{
	"info": {
		"_postman_id": "e1b0ee53-c005-42e9-936d-dbe5072c89f3",
		"name": "s35Activity",
		"schema": "https://schema.getpostman.com/json/collection/v2.1.0/collection.json",
		"_exporter_id": "24279126"
	},
	"item": [
		{
			"name": "create a user",
			"request": {
				"method": "GET",
				"header": []
			},
			"response": []
		}
	]
}