<?xml version="1.0" standalone="no"?>
<!DOCTYPE svg PUBLIC "-//W3C//DTD SVG 20010904//EN"
 "http://www.w3.org/TR/2001/REC-SVG-20010904/DTD/svg10.dtd">
<svg version="1.0" xmlns="http://www.w3.org/2000/svg"
 width="672.000000pt" height="672.000000pt" viewBox="0 0 672.000000 672.000000"
 preserveAspectRatio="xMidYMid meet">
<metadata>
Created by potrace 1.14, written by Peter Selinger 2001-2017
</metadata>
<g transform="translate(0.000000,672.000000) scale(0.100000,-0.100000)"
fill="#000000" stroke="none">
<path d="M1508 6714 c-3 -2 -34 -6 -70 -9 -36 -3 -76 -8 -89 -10 -13 -3 -41
-7 -63 -11 -22 -3 -49 -11 -61 -16 -11 -6 -21 -11 -22 -10 -2 1 -4 2 -5 1 -2
0 -10 -2 -18 -4 -8 -2 -33 -11 -55 -21 -22 -10 -43 -18 -46 -18 -3 -1 -35 -20
-71 -43 -201 -131 -317 -364 -355 -718 -10 -90 -10 -5030 -1 -5110 4 -33 12
-77 17 -97 5 -21 8 -38 6 -38 -2 0 9 -33 25 -74 97 -260 274 -418 540 -480 59
-14 85 -18 205 -31 28 -4 2437 -6 2660 -3 6 0 129 -3 275 -7 533 -15 880 -11
987 9 11 3 38 7 59 10 54 9 111 24 159 42 62 24 145 67 145 76 0 4 5 8 10 8
13 0 29 12 86 70 100 100 175 252 210 423 17 83 23 126 32 212 10 97 9 5089
-1 5145 -63 352 -251 564 -577 653 -30 9 -62 15 -70 15 -8 0 -26 3 -40 6 -74
15 -274 18 -1695 21 -852 2 -1690 6 -1862 9 -171 2 -313 3 -315 0z m2043
-1102 c245 -65 430 -201 537 -392 29 -52 59 -124 67 -161 2 -9 8 -32 13 -51
14 -52 12 -234 -3 -313 -8 -38 -23 -96 -34 -127 -20 -59 -97 -214 -138 -281
l-23 -37 27 -11 c59 -22 163 -74 163 -81 0 -4 5 -8 10 -8 19 0 80 -48 174
-135 144 -134 324 -426 383 -620 50 -165 62 -257 43 -324 -10 -38 -56 -91 -77
-91 -7 0 -13 -5 -13 -11 0 -5 -3 -8 -7 -6 -5 3 -19 0 -33 -6 -14 -5 -34 -12
-45 -14 -110 -21 -206 -23 -420 -8 -132 9 -1452 10 -1825 1 -259 -6 -331 3
-402 49 -49 33 -77 106 -72 190 4 61 5 68 18 120 81 321 302 659 539 829 71
50 184 106 232 113 17 3 32 7 34 9 5 4 -8 31 -40 84 -35 57 -109 208 -109 223
0 7 -5 18 -12 25 -7 7 -9 12 -5 12 3 0 2 11 -3 25 -27 72 -36 222 -19 327 14
90 15 96 19 103 1 3 3 8 4 13 5 22 51 133 69 167 116 214 337 370 570 401 23
4 43 7 45 9 2 2 60 2 130 0 88 -2 151 -9 203 -23z m-1041 -3287 c80 -2 168 -4
195 -4 28 -1 95 -1 150 -1 55 -1 107 -1 115 -1 8 1 98 1 200 0 102 0 192 0
200 0 8 0 62 0 120 0 58 0 112 0 120 0 168 2 888 2 895 1 6 -1 12 -2 15 -1 3
1 66 4 140 7 74 2 167 6 207 8 64 2 142 -4 211 -18 71 -15 126 -68 154 -152
26 -75 -7 -177 -74 -227 -61 -46 -46 -45 -1483 -47 -748 -1 -1385 -4 -1415 -6
-116 -10 -477 -13 -515 -4 -22 5 -55 12 -73 15 -51 9 -117 43 -146 76 -63 70
-57 200 12 277 46 51 81 66 187 78 28 3 52 7 54 9 4 4 497 -3 731 -10z m990
-829 c679 -1 1280 1 1335 3 271 10 387 -47 402 -199 11 -118 -59 -213 -172
-234 -17 -4 -787 -6 -1713 -7 -1888 -1 -1744 -6 -1823 73 -21 22 -39 43 -40
46 0 4 -3 16 -5 27 -14 57 -2 113 34 168 28 41 98 95 135 103 58 11 76 14 166
20 53 4 97 7 98 8 1 0 79 -1 175 -4 95 -2 729 -4 1408 -4z"/>
<path d="M3231 5224 c-157 -27 -275 -130 -310 -269 -7 -29 -6 -185 1 -218 14
-59 68 -158 114 -207 45 -48 139 -104 194 -115 131 -27 301 21 383 109 61 64
66 72 84 119 82 223 -26 479 -237 561 -81 32 -131 36 -229 20z"/>
<path d="M3237 3974 c-1 -1 -27 -5 -57 -8 -30 -3 -66 -8 -80 -12 -14 -3 -34
-7 -45 -9 -11 -2 -20 -4 -20 -5 0 -1 -7 -3 -15 -5 -39 -8 -121 -40 -182 -70
-104 -51 -177 -104 -258 -185 -97 -97 -117 -122 -161 -208 -10 -18 -22 -38
-27 -45 -6 -7 -13 -24 -17 -39 -6 -25 -5 -26 44 -29 28 -2 51 0 51 4 0 5 4 6
8 3 5 -3 35 -5 68 -6 86 -1 281 0 344 1 30 1 60 1 65 0 81 -5 125 -5 125 -1 0
3 24 4 52 3 29 -1 67 -2 83 -3 38 -1 242 -1 315 1 30 1 60 1 65 0 81 -5 125
-5 125 -1 0 3 56 5 125 5 69 0 125 -4 125 -8 0 -5 5 -5 11 -2 5 4 34 6 62 5
58 -1 53 -1 155 0 71 1 73 1 67 23 -9 29 -50 101 -91 160 -19 26 -34 49 -34
52 0 3 -33 38 -74 79 -76 75 -171 143 -263 190 -50 25 -187 74 -228 82 -11 2
-31 6 -45 9 -64 14 -102 17 -193 19 -53 1 -98 1 -100 0z"/>
</g>
</svg>
