{
  "title": "Templates filler Genista EN",
  "language": "en",
  "fields":   [
    {
      "personalResume": "Software Engineer with 8+ years of experience facilitating cutting-edge engineering solutions with a wide range of e-commerce application and technology skills. Proven ability to leverage full-stack knowledge and experience to build interactive and user-centered website designs to scale. Extensive expertise in large system architecture development and administration, as well as network design and configuration.",
      "code": "personal-resume",
      "title": "builder.sections.personalResume.title"
    },
    {
      "desiredPostTitle": "Software engineer",
      "firstName": "Lauren",
      "lastName": "Chen",
      "email": "lauren.chen@gmail.com",
      "phone": "(212) 256-1414",
      "code": "personal-details",
      "title": "builder.sections.personalInfo.title"
    },
    {
      "code": "employment-history",
      "title": "builder.sections.employmentHistory.title",
      "slots": [
        {
          "postTitle": "Senior web developer / System architect",
          "host": "New Enterprise",
          "duration": "2018-09",
          "durationEnd": "builder.misc.toPresent",
          "city": "San Jose, CA",
          "description": "Structure several internal systems comprising order entry/management tools, conversion/revenue reporting, and production workflow tracking, as well as design custom REST APIs built in Python and Laravel PHP Installed Linux servers and virtualized environments using Docker, Hyper-V, and Amazon Web Services Designed and implemented PHP web application, streamlining high-server traffic resource configuration and allocation",
          "index": 0
        },
        {
          "postTitle": "Digital Marketing Associate",
          "host": "E-Commerce Agency ",
          "duration": "2013-06",
          "durationEnd": "2018-08",
          "city": "San Bruno, CA",
          "description": "Successfully generated back-end programming utilizing LAMP stack; Linux (CentOS 5/Redhat), Apache with Kohana 2, PHP 5, CSS, JavaScript/jQuery, and MySQL frameworks Created e-commerce sites integrated with PayPal, Authorize.net, and other payment APIs Provided leadership as a subject matter expert (SME) on hosting issues, client and staff logins, and general upgrades/maintenance of servers Implemented new C# class library for the SQL server database access layer, and updated previous web page frameworks",
          "index": 1
        }
      ]
    },
    {
      "code": "education-history",
      "title": "builder.sections.educationHistory.title",
      "slots": [
        {
          "postTitle": "B.S. Computer Science",
          "host": "Miami State University",
          "duration": "2013-05",
          "durationEnd": "",
          "city": "Miami, FL",
          "description": "",
          "index": 0
        },
        {
          "postTitle": "A.A. Programming",
          "host": "Miami State University",
          "duration": "2011-05",
          "durationEnd": "",
          "city": "Miami, FL",
          "description": "",
          "index": 0
        }
      ]
    },
    {
      "code": "courses-history",
      "title": "builder.sections.coursesHistory.title",
      "slots": [
        {
          "postTitle": "Certified Web and Mobile Developer",
          "host": "",
          "duration": "2018-01",
          "durationEnd": "",
          "city": "",
          "description": "",
          "index": 0
        }
      ]
    },
    {
      "code": "skills",
      "title": "builder.sections.skills.title",
      "slots": [
        {
          "skill": "OpenTable",
          "level": "4",
          "index": 0
        },
        {
          "skill": "GuestBridge Reserve",
          "level": "2",
          "index": 1
        },
        {
          "skill": "Conversational Spanish",
          "level": "1",
          "index": 2
        },
        {
          "skill": "Interpersonal skills",
          "level": "3",
          "index": 3
        }
      ]
    },
    {
      "code": "websites-social-links",
      "title": "builder.sections.websitesSocialLinks.title",
      "slots": [
        {
          "name": "LinkedIn",
          "link": "https://linkedin.com/in/lauren-chen/"
        }
      ]
    }
  ]
}
