   
        
  const onAdd = (product) => {
    const exist = cart.find((x) => x.id === product.id);
    if (exist) {
      setCart(
        cart.map((x) => (x.id === product.id ? { ...exist, qty: +1 } : x))
      );
    } else {
      setCart([...cart, { qty: 1 }]);
    }
  };


 {cart.map((products) => (
          <div key={products.id} className="row">
            <div>{product.name}</div>
          </div>
        ))}





        import React, { useState } from "react";
 
function ItemCart(prop) {
  const { productProp } = prop;
  const { name, price, _id } = productProp;

  const [cartItems, setCartItems] = useState([]);

  const onAdd = (product) => {
    const exist = cartItems.find((x) => x.id === product.id);
    if (exist) {
      setCartItems(
        cartItems.map((x) =>
          x.id === product.id ? { ...exist, qty: exist.qty + 1 } : x
        )
      );
    } else {
      setCartItems([...cartItems, { ...product, qty: 1 }]);
    }
  };
  return <div></div>;
}

export default ItemCart;


Buy product

fetch("http://localhost:4000/accounts/purchaseProduct", {
      method: "POST",
      headers: {
        "Content-Type": "application/json",
        Authorization: `Bearer ${localStorage.getItem("token")}`,
      },
      body: JSON.stringify({
        productId: productId,
      }),
    })
      .then((res) => res.json())
      .then((data) => {
        console.log(data);
        if (data) {
          console.log("test");
        } else {
          console.log("fail");
        }
      });
  };