<?xml version="1.0" standalone="no"?>
<!DOCTYPE svg PUBLIC "-//W3C//DTD SVG 20010904//EN"
 "http://www.w3.org/TR/2001/REC-SVG-20010904/DTD/svg10.dtd">
<svg version="1.0" xmlns="http://www.w3.org/2000/svg"
 width="365.000000pt" height="365.000000pt" viewBox="0 0 365.000000 365.000000"
 preserveAspectRatio="xMidYMid meet">
<metadata>
Created by potrace 1.14, written by Peter Selinger 2001-2017
</metadata>
<g transform="translate(0.000000,365.000000) scale(0.100000,-0.100000)"
fill="#000000" stroke="none">
<path d="M1788 3446 c-3 -3 -25 -6 -157 -21 -18 -2 -48 -9 -66 -15 -17 -6 -41
-12 -51 -14 -17 -4 -63 -23 -180 -77 -23 -10 -63 -23 -90 -29 -27 -6 -55 -17
-64 -24 -8 -8 -25 -17 -36 -20 -19 -6 -31 -14 -80 -55 -6 -5 -20 -11 -31 -15
-11 -3 -42 -27 -69 -51 -27 -25 -61 -52 -76 -60 -16 -9 -28 -20 -28 -25 0 -12
-35 -47 -92 -90 -43 -33 -71 -69 -91 -115 -4 -11 -23 -33 -40 -50 -43 -40
-100 -131 -94 -149 3 -8 -14 -44 -39 -80 -24 -37 -44 -76 -44 -89 0 -12 -7
-34 -14 -49 -8 -15 -16 -40 -17 -55 -2 -15 -7 -33 -11 -38 -4 -6 -10 -26 -13
-44 -3 -19 -11 -43 -16 -53 -6 -11 -9 -28 -6 -39 3 -10 1 -35 -3 -56 -8 -35
-21 -176 -23 -248 -1 -54 11 -153 22 -173 6 -11 8 -21 6 -24 -6 -5 29 -127 43
-154 5 -10 12 -32 15 -49 3 -16 12 -44 21 -60 37 -73 25 -160 -30 -211 -44
-39 -100 -57 -189 -60 -104 -3 -109 -4 -125 -14 -21 -13 1 -55 114 -222 33
-49 63 -88 68 -88 4 0 8 -6 8 -13 0 -7 8 -20 18 -28 9 -9 44 -45 77 -80 83
-88 212 -194 325 -269 94 -61 326 -180 352 -180 8 0 18 -4 23 -8 6 -5 30 -15
55 -22 25 -8 51 -18 58 -23 6 -5 12 -7 12 -3 0 3 12 1 28 -5 15 -6 34 -12 42
-14 8 -2 53 -12 100 -23 82 -19 109 -24 230 -40 68 -8 395 -9 470 0 125 15
273 46 430 92 147 43 465 208 575 299 89 73 121 97 128 97 4 0 5 4 2 10 -3 5
-2 10 2 10 24 0 166 157 256 282 57 81 147 236 147 255 0 6 -57 10 -144 10
-153 0 -165 3 -206 55 -13 18 -22 46 -25 85 -4 49 -1 63 21 95 13 21 21 38 18
38 -4 0 -1 7 6 15 7 8 10 15 7 15 -3 0 1 24 10 53 9 28 17 61 19 72 1 11 3 20
4 20 1 0 3 20 4 45 2 25 8 64 14 86 16 55 26 244 14 244 -6 0 -7 14 -2 34 4
19 6 36 5 38 -2 2 -6 36 -9 77 -4 41 -12 83 -18 94 -5 11 -19 55 -29 98 -10
43 -23 87 -27 96 -5 10 -17 33 -26 50 -9 18 -16 35 -16 38 4 15 -13 66 -24 72
-7 5 -27 39 -46 76 -19 37 -40 73 -47 79 -7 6 -13 16 -13 23 0 49 -292 335
-435 425 -110 70 -214 120 -247 120 -17 0 -59 14 -94 30 -35 17 -66 31 -69 31
-2 0 -24 7 -47 15 -24 9 -56 18 -73 20 -16 2 -43 7 -60 10 -16 3 -88 7 -160
10 -71 2 -135 6 -142 8 -6 3 -13 3 -15 2z"/>
</g>
</svg>
