{
	"info": {
		"_postman_id": "c77c1ee2-f119-4471-966f-107475ef3b40",
		"name": "s33-s34",
		"schema": "https://schema.getpostman.com/json/collection/v2.1.0/collection.json",
		"_exporter_id": "21149196"
	},
	"item": [
		{
			"name": "GET from Express",
			"request": {
				"method": "GET",
				"header": [],
				"url": {
					"raw": "localhost:4000/greeting",
					"host": [
						"localhost"
					],
					"port": "4000",
					"path": [
						"greeting"
					]
				}
			},
			"response": []
		},
		{
			"name": "GET Users",
			"request": {
				"method": "GET",
				"header": [],
				"url": {
					"raw": "localhost:4000/users",
					"host": [
						"localhost"
					],
					"port": "4000",
					"path": [
						"users"
					]
				}
			},
			"response": []
		},
		{
			"name": "ADD User",
			"request": {
				"method": "POST",
				"header": [],
				"body": {
					"mode": "raw",
					"raw": "\r\n    {\r\n        \"username\": \"Luisa\",\r\n        \"email\": \"stronggirl@gmail.com\",\r\n        \"password\": \"pressure\"\r\n    }\r\n    ",
					"options": {
						"raw": {
							"language": "json"
						}
					}
				},
				"url": {
					"raw": "localhost:4000/users",
					"host": [
						"localhost"
					],
					"port": "4000",
					"path": [
						"users"
					]
				}
			},
			"response": []
		},
		{
			"name": "DELETE user",
			"request": {
				"method": "DELETE",
				"header": [],
				"url": {
					"raw": "localhost:4000/users",
					"host": [
						"localhost"
					],
					"port": "4000",
					"path": [
						"users"
					]
				}
			},
			"response": []
		},
		{
			"name": "UPDATE password",
			"request": {
				"method": "PUT",
				"header": [],
				"body": {
					"mode": "raw",
					"raw": "{\r\n    \"username\" : \"Bruno\"\r\n}",
					"options": {
						"raw": {
							"language": "json"
						}
					}
				},
				"url": {
					"raw": "localhost:4000/users/update/0",
					"host": [
						"localhost"
					],
					"port": "4000",
					"path": [
						"users",
						"update",
						"0"
					]
				}
			},
			"response": []
		},
		{
			"name": "GET Single User",
			"request": {
				"method": "GET",
				"header": [],
				"url": {
					"raw": "localhost:4000/users/getSingleUser/0",
					"host": [
						"localhost"
					],
					"port": "4000",
					"path": [
						"users",
						"getSingleUser",
						"0"
					]
				}
			},
			"response": []
		},
		{
			"name": "GET Items",
			"request": {
				"method": "GET",
				"header": [],
				"url": {
					"raw": "localhost:4000/items",
					"host": [
						"localhost"
					],
					"port": "4000",
					"path": [
						"items"
					]
				}
			},
			"response": []
		},
		{
			"name": "ADD Item/s",
			"request": {
				"method": "POST",
				"header": [],
				"body": {
					"mode": "raw",
					"raw": "{\r\n    \"name\" : \"Filomena\",\r\n    \"price\" : 500,\r\n    \"isActive\" : true\r\n}",
					"options": {
						"raw": {
							"language": "json"
						}
					}
				},
				"url": {
					"raw": "localhost:4000/items",
					"host": [
						"localhost"
					],
					"port": "4000",
					"path": [
						"items"
					]
				}
			},
			"response": []
		},
		{
			"name": "UPDATE price",
			"request": {
				"method": "PUT",
				"header": [],
				"body": {
					"mode": "raw",
					"raw": "{\r\n    \"price\" : 200\r\n}",
					"options": {
						"raw": {
							"language": "json"
						}
					}
				},
				"url": {
					"raw": "localhost:4000/items/1",
					"host": [
						"localhost"
					],
					"port": "4000",
					"path": [
						"items",
						"1"
					]
				}
			},
			"response": []
		}
	]
}