{
	"info": {
		"_postman_id": "7bd80e50-2f93-4aaf-9097-8a91b5481982",
		"name": "s34-activity",
		"schema": "https://schema.getpostman.com/json/collection/v2.1.0/collection.json",
		"_exporter_id": "20772219"
	},
	"item": [
		{
			"name": "GET SINGLE ITEM",
			"request": {
				"method": "GET",
				"header": [],
				"url": {
					"raw": "localhost:4000/items/getSingleItem/0",
					"host": [
						"localhost"
					],
					"port": "4000",
					"path": [
						"items",
						"getSingleItem",
						"0"
					]
				}
			},
			"response": []
		},
		{
			"name": "UPDATE ARCHIVE",
			"request": {
				"method": "PUT",
				"header": [],
				"url": {
					"raw": "localhost:4000/items/archive/0",
					"host": [
						"localhost"
					],
					"port": "4000",
					"path": [
						"items",
						"archive",
						"0"
					]
				}
			},
			"response": []
		},
		{
			"name": "UPDATE ACTIVATE",
			"request": {
				"method": "PUT",
				"header": [],
				"url": {
					"raw": "localhost:4000/items/activate/0",
					"host": [
						"localhost"
					],
					"port": "4000",
					"path": [
						"items",
						"activate",
						"0"
					]
				}
			},
			"response": []
		}
	]
}