{
	"_id": "user001",
	"firstName": "Jason",
	"lastName": "Vergara",
	"email": "jasonvergara@mail.com",
	"password" "jason123"
	"isAdmin": true,
	"mobileNumber": "0912346789",
	"dateTimeRegistered": "2022-05-18T20:00:00.00Z"
},

{
	"_id": "user002",
	"firstName": "Gerard",
	"lastName": "Samaniego",
	"email": "gersam@mail.com",
	"password" "gersam123"
	"isAdmin": false,
	"mobileNumber": "0912346789",
	"dateTimeRegistered": "2022-05-18T21:34:00.00Z"
},

{
	"_id": "user003",
	"firstName": "Luis",
	"lastName": "Lavina",
	"email": "luislav@mail.com",
	"password" "luislav123"
	"isAdmin": false,
	"mobileNumber": "0912346789",
	"dateTimeRegistered": "2022-05-18T21:54:00.00Z"
}