{
	"productId": "product001",
	"name": "iPhone 13",
	"description": "Brand New iPhone 13 2021",
	"price": "45000",
	"stocks": 50,
	"isActive" : true,
	"sku": "456NSKQ90LK",
	"dateTimeCreated": "2022-05-18T22:00:00.00Z"
},

{
	"productId": "product002",
	"name": "iPad Pro",
	"description": "Brand New iPad Pro 2022",
	"price": "50000",
	"stocks": 50,
	"isActive" : true,
	"sku": "047WEOT62GH",
	"dateTimeCreated": "2022-05-18T22:00:00.00Z"
},
