{
	"id" : "course001",
	"name" : "HTML",
	"description" : "Learn the basic and how to code.",
	"price" : 1000,
	"slots" : 20,
	"isActive" : true,
	"enrollees" : ["user0002"],
	"dateTimeCreated" : "2022-05-18T20:45:00.00Z"
}