{
	"firstName" : "Joe",
	"lastName" : "Smurf",
	"email" : "joesmurf@mail.com",
	"password" : "joe123",
	"isAdmin" : true,
	"mobileNumber" : "09987654321",
	"dateTimeRegistered": "2020-05-18T10:58:00.00Z"
},

{
	"firstName" : "June",
	"lastName" : "Day",
	"email" : "juneday@mail,com",
	"password" : "joe123",
	"isAdmin" : false,
	"mobileNumber" : "09876543210",
	"dateTimeRegistered": "2020-05-18T17:58:00.00Z"
}