{
// Products
//     - Name
//     - Description
//     - Price
//     - Stocks
//     - Is Active?
//     - SKU
	"productId": "01",
	"productName": "Ryzen 5 5600X",
	"description": "AMD Ryzen™ 5 5600X gaming desktop processors features 6 incredible cores",
	"price": "12,000.00",
	"stocks": "15",
	"isActive": true,
	"sku": true,
}