{
	"_id": "user001",
	"firstName" : "John",
	"lastName" : "Smith",
	"email" : "johnsmith@mail.com",
	"password" : "john123",
	"mobileNumber" : "09123456789",
	"isAdmin" : true,
	"dateTimeRegistered" : "2022-05-18T19:58:00.00Z"
},
{
	"_id": "user002",
	"firstName" : "Marlo",
	"lastName" : "Mortel",
	"email" : "marlomortel@mail.com",
	"password" : "marlo123",
	"mobileNumber" : "09123456789",
	"isAdmin" : false,
	"dateTimeRegistered" : "2022-05-18T22:58:00.00Z"
},