{
	"id": "book001",
	"name": "This Time Tomorrow: A Novel by Emma Straub",
	"description": "On the eve of her 40th birthday, Alice’s life isn’t terrible. She likes her job, even if it isn’t exactly the one she expected. She’s happy with her apartment, her romantic status, her independence, and she adores her lifelong best friend. But her father is ailing, and it feels to her as if something is missing. When she wakes up the next morning she finds herself back in 1996, reliving her 16th birthday. But it isn’t just her adolescent body that shocks her, or seeing her high school crush, it’s her dad:  the vital, charming, 40-something version of her father with whom she is reunited. Now armed with a new perspective on her own life and his, some past events take on new meaning. Is there anything that she would change if she could?",
	"price": 19.60,
	"stocks": 100,
	"isActive": true,
	"SKU": "B09H2H2VB4"
},
{
	"id": "book002",
	"name": "This Time Tomorrow: A Novel",
	"description": "On the eve of her 40th birthday, Alice’s life isn’t terrible. She likes her job, even if it isn’t exactly the one she expected. She’s happy with her apartment, her romantic status, her independence, and she adores her lifelong best friend. But her father is ailing, and it feels to her as if something is missing. When she wakes up the next morning she finds herself back in 1996, reliving her 16th birthday. But it isn’t just her adolescent body that shocks her, or seeing her high school crush, it’s her dad:  the vital, charming, 40-something version of her father with whom she is reunited. Now armed with a new perspective on her own life and his, some past events take on new meaning. Is there anything that she would change if she could?",
	"price": 19.60,
	"stocks": 100,
	"isActive": true,
	"SKU": "B09H2H2VB4"
},
{
	"id": "book003",
	"name": "River of the Gods: Genius, Courage, and Betrayal in the Search for the Source of the Nile by Candice Millard",
	"description": "For millennia the location of the Nile River’s headwaters was shrouded in mystery. In the 19th century, there was  a frenzy of interest in ancient Egypt. At the same time, European powers sent off waves of explorations intended to map the unknown corners of the globe – and extend their colonial empires. In River of the Gods Candice Millard has written another peerless story of courage and adventure, set against the backdrop of the race to exploit Africa by the colonial powers.",
	"price": 22.47,
	"stocks": 100,
	"isActive": true,
	"SKU": "B09BTJNJCX"
},
{
	"id": "book004",
	"name": "Remarkably Bright Creatures: A Novel by Shelby Van Pelt",
	"description": "After Tova Sullivan’s husband died, she began working the night shift at the Sowell Bay Aquarium, mopping floors and tidying up. Keeping busy has always helped her cope, which she’s been doing since her eighteen-year-old son, Erik, mysteriously vanished on a boat in Puget Sound over thirty years ago. Shelby Van Pelt’s debut novel is a gentle reminder that sometimes taking a hard look at the past can help uncover a future that once felt impossible.",
	"price": 18.69,
	"stocks": 100,
	"isActive": true,
	"SKU": "B09BNH4TLW"
}