{
	"_id":"user001",
	"firstName":"John",
	"lastName": "Smith",
	"email": "johnsmith@mail.com",
	"password": "john123",
	"isAdmin": true,
	"mobileNumber": "09123456789",
	"dateTimeRegistered" : "2022-05-18T19:58:00.00Z"
},

{
	"_id":"user002",
	"firstName":"Jane",
	"lastName": "Doe",
	"email": "janedoe@mail.com",
	"password": "jane123",
	"isAdmin": false,
	"mobileNumber": "09123456789",
	"dateTimeRegistered": "2022-05-18T20:58:00.00Z" 
}