{
	"_id": "user001",
	"firstName": "Gigi",
	"lastName": "Goode",
	"email": "gigigoode@mail.com",
	"password": "gg123",
	"isAdmin": true,
	"mobileNumber": "09123456789",
	"dateTimeRegistered": "2022-05-18T19:58:00.00Z"
},



{
	"_id": "user002",
	"firstName": "Sassy",
	"lastName": "Pom",
	"email": "sassythepom@mail.com",
	"password": "sassy123",
	"isAdmin": false,
	"mobileNumber": "09987654321",
	"dateTimeRegistered": "2022-05-18T20:59:00.00Z"
}