{
	"_id": "userID123",
	"firstName": "Dexter",
	"lastName": "Ladines",
	"email": "dexladines@gmail.com",
	"password":"123456",
	"isAdmin": false,
	"mobileNumber": "09123456789"
}


/*{
	"firstName": String
	"lastName": String
	"email": String
	"password": String
	"isAdmin": Boolean
	"mobileNumber": String 
}*/
