{
	"info": {
		"_postman_id": "b3136de9-f5e1-4d5d-8c06-b5a7e7c8479c",
		"name": "batch164_bookingAPI",
		"schema": "https://schema.getpostman.com/json/collection/v2.1.0/collection.json"
	},
	"item": [
		{
			"name": "Course",
			"item": [
				{
					"name": "add a course",
					"request": {
						"auth": {
							"type": "bearer",
							"bearer": [
								{
									"key": "token",
									"value": "eyJhbGciOiJIUzI1NiIsInR5cCI6IkpXVCJ9.eyJpZCI6IjYyNGViNjc0M2EwODUwNTdkZjNlNDEwNyIsImVtYWlsIjoiQWRtaW5AbWFpbC5jb20iLCJpc0FkbWluIjp0cnVlLCJpYXQiOjE2NDkzMzM5NjZ9.7CxZffWuk0CRgftGN-w3uxo8EXtT8G5v5kUiEfP1KLE",
									"type": "string"
								}
							]
						},
						"method": "POST",
						"header": [],
						"body": {
							"mode": "raw",
							"raw": "{\r\n\"name\": \"HTML\",\r\n\"description\" : \"Learn the basics of programming\",\r\n\"price\" : 1000\r\n\r\n}",
							"options": {
								"raw": {
									"language": "json"
								}
							}
						},
						"url": {
							"raw": "http://localhost:4000/api/courses/",
							"protocol": "http",
							"host": [
								"localhost"
							],
							"port": "4000",
							"path": [
								"api",
								"courses",
								""
							]
						}
					},
					"response": []
				},
				{
					"name": "retrieve all course",
					"request": {
						"method": "GET",
						"header": [],
						"url": {
							"raw": "http://localhost:4000/api/courses/all",
							"protocol": "http",
							"host": [
								"localhost"
							],
							"port": "4000",
							"path": [
								"api",
								"courses",
								"all"
							]
						}
					},
					"response": []
				},
				{
					"name": "get active course",
					"request": {
						"method": "GET",
						"header": [],
						"url": {
							"raw": "http://localhost:4000/api/courses/",
							"protocol": "http",
							"host": [
								"localhost"
							],
							"port": "4000",
							"path": [
								"api",
								"courses",
								""
							]
						}
					},
					"response": []
				},
				{
					"name": "get specific course by Id",
					"request": {
						"method": "GET",
						"header": [],
						"url": {
							"raw": "http://localhost:4000/api/courses/624ec60a432d87259bba3851",
							"protocol": "http",
							"host": [
								"localhost"
							],
							"port": "4000",
							"path": [
								"api",
								"courses",
								"624ec60a432d87259bba3851"
							]
						}
					},
					"response": []
				},
				{
					"name": "update  a course",
					"request": {
						"auth": {
							"type": "bearer",
							"bearer": [
								{
									"key": "token",
									"value": "eyJhbGciOiJIUzI1NiIsInR5cCI6IkpXVCJ9.eyJpZCI6IjYyNGViNjc0M2EwODUwNTdkZjNlNDEwNyIsImVtYWlsIjoiQWRtaW5AbWFpbC5jb20iLCJpc0FkbWluIjp0cnVlLCJpYXQiOjE2NDkzMzM5NjZ9.7CxZffWuk0CRgftGN-w3uxo8EXtT8G5v5kUiEfP1KLE",
									"type": "string"
								}
							]
						},
						"method": "PUT",
						"header": [],
						"body": {
							"mode": "raw",
							"raw": "{\r\n    \"name\":\"updatedCourseviaPut\",\r\n    \"description\":\"updatedDescription using Put\",\r\n    \"price\":4000\r\n}",
							"options": {
								"raw": {
									"language": "json"
								}
							}
						},
						"url": {
							"raw": "http://localhost:4000/api/courses/624ec60a432d87259bba3851",
							"protocol": "http",
							"host": [
								"localhost"
							],
							"port": "4000",
							"path": [
								"api",
								"courses",
								"624ec60a432d87259bba3851"
							]
						}
					},
					"response": []
				},
				{
					"name": "archive a course-admin",
					"request": {
						"method": "PUT",
						"header": []
					},
					"response": []
				},
				{
					"name": "archive a course-user",
					"request": {
						"auth": {
							"type": "bearer",
							"bearer": [
								{
									"key": "token",
									"value": "eyJhbGciOiJIUzI1NiIsInR5cCI6IkpXVCJ9.eyJpZCI6IjYyNGMzZjM3MzZiZGJlMGRiYzhkMGVmYiIsImVtYWlsIjoiam9obnNtaXRoQG1haWwuY29tIiwiaXNBZG1pbiI6ZmFsc2UsImlhdCI6MTY0OTY3MTY0M30._26ytq-OnrsthyKZh5e61mmqwjPWPfUHk1bLRVKHdNM",
									"type": "string"
								}
							]
						},
						"method": "PUT",
						"header": [],
						"body": {
							"mode": "raw",
							"raw": "{\r\n        \"_id\": \"624ec70b339e719f7bb4ee6b\",\r\n        \"name\": \"CSS\",\r\n        \"description\": \"Learn the basics of programming\",\r\n        \"price\": 1000,\r\n        \"isActive\": true,\r\n        \"createdOn\": \"2022-04-07T11:11:50.307Z\",\r\n        \"enrollees\": [],\r\n        \"__v\": 0\r\n}",
							"options": {
								"raw": {
									"language": "json"
								}
							}
						},
						"url": {
							"raw": "http://localhost:4000/api/courses/624ec70b339e719f7bb4ee6b/archive",
							"protocol": "http",
							"host": [
								"localhost"
							],
							"port": "4000",
							"path": [
								"api",
								"courses",
								"624ec70b339e719f7bb4ee6b",
								"archive"
							]
						}
					},
					"response": []
				}
			]
		},
		{
			"name": "check email duplicates",
			"request": {
				"method": "POST",
				"header": [],
				"body": {
					"mode": "raw",
					"raw": "{\r\n    \"email\":\"john@mail.com\"\r\n}",
					"options": {
						"raw": {
							"language": "json"
						}
					}
				},
				"url": {
					"raw": "http://localhost:4000/api/users/checkEmail",
					"protocol": "http",
					"host": [
						"localhost"
					],
					"port": "4000",
					"path": [
						"api",
						"users",
						"checkEmail"
					]
				}
			},
			"response": []
		},
		{
			"name": "register user",
			"request": {
				"method": "POST",
				"header": [],
				"body": {
					"mode": "raw",
					"raw": "{\r\n    \"firstName\":\"John\",\r\n    \"lastName\":\"Smith\",\r\n    \"mobileNo\":\"09123456789\",\r\n    \"email\":\"johnsmith@mail.com\",\r\n    \"password\":\"john1234\"\r\n}",
					"options": {
						"raw": {
							"language": "json"
						}
					}
				},
				"url": {
					"raw": "http://localhost:4000/api/users/register",
					"protocol": "http",
					"host": [
						"localhost"
					],
					"port": "4000",
					"path": [
						"api",
						"users",
						"register"
					]
				}
			},
			"response": []
		},
		{
			"name": "login admin",
			"request": {
				"method": "GET",
				"header": []
			},
			"response": []
		},
		{
			"name": "login a user",
			"request": {
				"method": "POST",
				"header": [],
				"body": {
					"mode": "raw",
					"raw": "{\r\n    \"email\": \"johnsmith@mail.com\",\r\n    \"password\":\"john1234\"\r\n}",
					"options": {
						"raw": {
							"language": "json"
						}
					}
				},
				"url": {
					"raw": "http://localhost:4000/api/users/login",
					"protocol": "http",
					"host": [
						"localhost"
					],
					"port": "4000",
					"path": [
						"api",
						"users",
						"login"
					]
				}
			},
			"response": []
		},
		{
			"name": "New Request",
			"request": {
				"method": "POST",
				"header": [],
				"body": {
					"mode": "raw",
					"raw": "{\"_id\": \"624c3f3736bdbe0dbc8d0efb\"}",
					"options": {
						"raw": {
							"language": "json"
						}
					}
				},
				"url": {
					"raw": "http://localhost:4000/api/users/details",
					"protocol": "http",
					"host": [
						"localhost"
					],
					"port": "4000",
					"path": [
						"api",
						"users",
						"details"
					]
				}
			},
			"response": []
		},
		{
			"name": "get specific user",
			"request": {
				"method": "GET",
				"header": []
			},
			"response": []
		}
	]
}