{
	"info": {
		"_postman_id": "acc915e8-8be5-40f7-b14b-017b98c3f170",
		"name": "s31 Activity",
		"schema": "https://schema.getpostman.com/json/collection/v2.1.0/collection.json"
	},
	"item": [
		{
			"name": "Put Method",
			"request": {
				"method": "PUT",
				"header": [],
				"body": {
					"mode": "raw",
					"raw": "",
					"options": {
						"raw": {
							"language": "json"
						}
					}
				},
				"url": {
					"raw": "http://localhost:3001/tasks/624ad01fbb76fe59fec98b5d/complete",
					"protocol": "http",
					"host": [
						"localhost"
					],
					"port": "3001",
					"path": [
						"tasks",
						"624ad01fbb76fe59fec98b5d",
						"complete"
					]
				}
			},
			"response": []
		}
	]
}