{
	"info": {
		"_postman_id": "aab0125d-66bb-4f52-888d-abd4226e520e",
		"name": "Capstone 2",
		"schema": "https://schema.getpostman.com/json/collection/v2.1.0/collection.json"
	},
	"item": [
		{
			"name": "User",
			"item": [
				{
					"name": "Register User",
					"request": {
						"method": "POST",
						"header": [],
						"body": {
							"mode": "raw",
							"raw": "{\r\n    \"firstName\": \"Ned\",\r\n    \"lastName\": \"Leeds\",\r\n    \"mobileNo\": \"09123456789\",\r\n    \"email\": \"ned@mail.com\",\r\n    \"password\": \"nedleeds\"\r\n}",
							"options": {
								"raw": {
									"language": "json"
								}
							}
						},
						"url": {
							"raw": "http://localhost:5000/api/users/register",
							"protocol": "http",
							"host": [
								"localhost"
							],
							"port": "5000",
							"path": [
								"api",
								"users",
								"register"
							]
						}
					},
					"response": []
				},
				{
					"name": "Authenticate User",
					"request": {
						"method": "POST",
						"header": [],
						"body": {
							"mode": "raw",
							"raw": "{\r\n    \"email\": \"admin@mail.com\",\r\n    \"password\": \"admin\"\r\n}",
							"options": {
								"raw": {
									"language": "json"
								}
							}
						},
						"url": {
							"raw": "http://localhost:4000/api/users/login",
							"protocol": "http",
							"host": [
								"localhost"
							],
							"port": "4000",
							"path": [
								"api",
								"users",
								"login"
							]
						}
					},
					"response": []
				},
				{
					"name": "User details",
					"protocolProfileBehavior": {
						"disableBodyPruning": true
					},
					"request": {
						"auth": {
							"type": "bearer",
							"bearer": [
								{
									"key": "token",
									"value": "eyJhbGciOiJIUzI1NiIsInR5cCI6IkpXVCJ9.eyJpZCI6IjYyNWQ4MDkxMGQ1OTZmODAwMjkyYzk4YyIsImVtYWlsIjoidG9ueUBtYWlsLmNvbSIsImlzQWRtaW4iOmZhbHNlLCJpYXQiOjE2NTAyOTUxNTJ9.Q_Yi-Om-oy90BrMqnEGI9tDuvLmBkPa2KzjOFAlEV5o",
									"type": "string"
								}
							]
						},
						"method": "GET",
						"header": [],
						"body": {
							"mode": "raw",
							"raw": "",
							"options": {
								"raw": {
									"language": "json"
								}
							}
						},
						"url": {
							"raw": "http://localhost:5000/api/users/details",
							"protocol": "http",
							"host": [
								"localhost"
							],
							"port": "5000",
							"path": [
								"api",
								"users",
								"details"
							]
						}
					},
					"response": []
				},
				{
					"name": "Set User as Admin",
					"request": {
						"method": "PUT",
						"header": [],
						"url": {
							"raw": "http://localhost:5000/api/users/6256a18497c6ba89a7191050",
							"protocol": "http",
							"host": [
								"localhost"
							],
							"port": "5000",
							"path": [
								"api",
								"users",
								"6256a18497c6ba89a7191050"
							]
						}
					},
					"response": []
				},
				{
					"name": "Checkout",
					"request": {
						"auth": {
							"type": "bearer",
							"bearer": [
								{
									"key": "token",
									"value": "eyJhbGciOiJIUzI1NiIsInR5cCI6IkpXVCJ9.eyJpZCI6IjYyNWQzZWQ0MmI1N2ZjYjEwNGUzMmE5ZiIsImVtYWlsIjoibmVkQG1haWwuY29tIiwiaXNBZG1pbiI6ZmFsc2UsImlhdCI6MTY1MDI4MDgxMH0.k-flpBLLtHpdNl8H_WyU_rNHhhY_tYfRA3B7IGAcgqw",
									"type": "string"
								}
							]
						},
						"method": "POST",
						"header": [],
						"body": {
							"mode": "raw",
							"raw": "{\r\n    \"productId\": \"6256c16a627084ee611429fc\"\r\n}",
							"options": {
								"raw": {
									"language": "json"
								}
							}
						},
						"url": {
							"raw": "http://localhost:5000/api/users/checkout",
							"protocol": "http",
							"host": [
								"localhost"
							],
							"port": "5000",
							"path": [
								"api",
								"users",
								"checkout"
							]
						}
					},
					"response": []
				}
			]
		},
		{
			"name": "Product",
			"item": [
				{
					"name": "Create Product",
					"request": {
						"auth": {
							"type": "bearer",
							"bearer": [
								{
									"key": "token",
									"value": "eyJhbGciOiJIUzI1NiIsInR5cCI6IkpXVCJ9.eyJpZCI6IjYyNTZhMjQ3OTdjNmJhODlhNzE5MTA1MiIsImVtYWlsIjoicGV0ZXJAbWFpbC5jb20iLCJpc0FkbWluIjp0cnVlLCJpYXQiOjE2NDk4NTIyMTV9.lvUxNBuCz3IHdSW5E4ElH4j1_9IN7iOJGXyyE8P-j28",
									"type": "string"
								}
							]
						},
						"method": "POST",
						"header": [],
						"body": {
							"mode": "raw",
							"raw": "{\r\n    \"name\": \"Yamaha Aerox 155\",\r\n    \"description\": \"Powered by a 155 cc engine, and has a Variable Speed gearbox.\",\r\n    \"price\": 132900\r\n}",
							"options": {
								"raw": {
									"language": "json"
								}
							}
						},
						"url": {
							"raw": "http://localhost:5000/api/product",
							"protocol": "http",
							"host": [
								"localhost"
							],
							"port": "5000",
							"path": [
								"api",
								"product"
							]
						}
					},
					"response": []
				},
				{
					"name": "Get All Product",
					"request": {
						"method": "GET",
						"header": []
					},
					"response": []
				},
				{
					"name": "get all active",
					"request": {
						"method": "GET",
						"header": [],
						"url": {
							"raw": "http://localhost:5000/api/products/",
							"protocol": "http",
							"host": [
								"localhost"
							],
							"port": "5000",
							"path": [
								"api",
								"products",
								""
							]
						}
					},
					"response": []
				},
				{
					"name": "Get Specific Product",
					"request": {
						"method": "GET",
						"header": [],
						"url": {
							"raw": "http://localhost:5000/api/products/625d58d7972334cf81d05ed6",
							"protocol": "http",
							"host": [
								"localhost"
							],
							"port": "5000",
							"path": [
								"api",
								"products",
								"625d58d7972334cf81d05ed6"
							]
						}
					},
					"response": []
				},
				{
					"name": "Update a Product Info",
					"request": {
						"auth": {
							"type": "bearer",
							"bearer": [
								{
									"key": "token",
									"value": "eyJhbGciOiJIUzI1NiIsInR5cCI6IkpXVCJ9.eyJpZCI6IjYyNGQ3MGVlMjcxY2ExODIzNDY5ZDhiMiIsImVtYWlsIjoiYWRtaW5AbWFpbC5jb20iLCJpc0FkbWluIjp0cnVlLCJpYXQiOjE2NDkzMzQyNzZ9.YvcgRC6DowABdNmv8opQRrlytleTe77EAB5WYs7_Jmo",
									"type": "string"
								}
							]
						},
						"method": "PUT",
						"header": [],
						"body": {
							"mode": "raw",
							"raw": "{\r\n    \"name\": \"HTML Update\",\r\n    \"description\": \"Making website design\",\r\n    \"price\": 2000\r\n}",
							"options": {
								"raw": {
									"language": "json"
								}
							}
						},
						"url": {
							"raw": "http://localhost:5000/api/product",
							"protocol": "http",
							"host": [
								"localhost"
							],
							"port": "5000",
							"path": [
								"api",
								"product"
							]
						}
					},
					"response": []
				},
				{
					"name": "Archive Product",
					"request": {
						"auth": {
							"type": "bearer",
							"bearer": [
								{
									"key": "token",
									"value": "eyJhbGciOiJIUzI1NiIsInR5cCI6IkpXVCJ9.eyJpZCI6IjYyNGQ3MGVlMjcxY2ExODIzNDY5ZDhiMiIsImVtYWlsIjoiYWRtaW5AbWFpbC5jb20iLCJpc0FkbWluIjp0cnVlLCJpYXQiOjE2NDk2NzM2MjV9._lQcyRgcxMlo-9OJ2XikBBzzriXsRsOj1hpy_GJyJoI",
									"type": "string"
								}
							]
						},
						"method": "PUT",
						"header": [],
						"body": {
							"mode": "raw",
							"raw": "{\r\n    \"isActive\": false\r\n}",
							"options": {
								"raw": {
									"language": "json"
								}
							}
						},
						"url": {
							"raw": "http://localhost:5000/api/products/6256c4a05df4aded256e42d3/archive",
							"protocol": "http",
							"host": [
								"localhost"
							],
							"port": "5000",
							"path": [
								"api",
								"products",
								"6256c4a05df4aded256e42d3",
								"archive"
							]
						}
					},
					"response": []
				}
			]
		}
	]
}