{
	"info": {
		"_postman_id": "3a3a3995-fc75-497e-8d23-f6c1591a5fae",
		"name": "s29",
		"schema": "https://schema.getpostman.com/json/collection/v2.1.0/collection.json",
		"_exporter_id": "20779495"
	},
	"item": [
		{
			"name": "d1",
			"item": [
				{
					"name": "GET request in the base URI",
					"request": {
						"method": "GET",
						"header": [],
						"url": {
							"raw": "localhost:3000",
							"host": [
								"localhost"
							],
							"port": "3000"
						}
					},
					"response": []
				},
				{
					"name": "Get request from /hello endpoint",
					"request": {
						"method": "GET",
						"header": [],
						"url": {
							"raw": "localhost:3000/hello",
							"host": [
								"localhost"
							],
							"port": "3000",
							"path": [
								"hello"
							]
						}
					},
					"response": []
				},
				{
					"name": "POST request in the /hello endpoint",
					"request": {
						"method": "POST",
						"header": [],
						"body": {
							"mode": "raw",
							"raw": "{\n    \"firstName\": \"John\",\n    \"lastName\": \"Doe\"\n}",
							"options": {
								"raw": {
									"language": "json"
								}
							}
						},
						"url": {
							"raw": "localhost:3000/hello",
							"host": [
								"localhost"
							],
							"port": "3000",
							"path": [
								"hello"
							]
						}
					},
					"response": []
				},
				{
					"name": "Create a user",
					"request": {
						"method": "POST",
						"header": [],
						"body": {
							"mode": "raw",
							"raw": "{\n    \"userName\": \"Johndoe\",\n    \"password\": \"john123\"\n\n}",
							"options": {
								"raw": {
									"language": "json"
								}
							}
						},
						"url": {
							"raw": "localhost:3000/signup",
							"host": [
								"localhost"
							],
							"port": "3000",
							"path": [
								"signup"
							]
						}
					},
					"response": []
				},
				{
					"name": "Update a user password",
					"request": {
						"method": "PATCH",
						"header": [],
						"body": {
							"mode": "raw",
							"raw": "{\n    \"userName\": \"johndoe\",\n    \"password\": \"john123\"\n}",
							"options": {
								"raw": {
									"language": "json"
								}
							}
						},
						"url": {
							"raw": "localhost:3000/change-password",
							"host": [
								"localhost"
							],
							"port": "3000",
							"path": [
								"change-password"
							]
						}
					},
					"response": []
				},
				{
					"name": "Remove a user",
					"request": {
						"method": "DELETE",
						"header": [],
						"url": {
							"raw": "localhost:3000/delete-user",
							"host": [
								"localhost"
							],
							"port": "3000",
							"path": [
								"delete-user"
							]
						}
					},
					"response": []
				}
			]
		}
	]
}