{
	"info": {
		"_postman_id": "31e28984-83ed-42d2-b4dc-0ea2d7ec25a8",
		"name": "Activity - Readings",
		"schema": "https://schema.getpostman.com/json/collection/v2.1.0/collection.json",
		"_exporter_id": "20768736"
	},
	"item": [
		{
			"name": "Greetings Request",
			"request": {
				"method": "GET",
				"header": [],
				"url": {
					"raw": "localhost:4000",
					"host": [
						"localhost"
					],
					"port": "4000"
				}
			},
			"response": []
		},
		{
			"name": "Profile Request",
			"request": {
				"method": "GET",
				"header": [],
				"url": {
					"raw": "localhost:4000/profile",
					"host": [
						"localhost"
					],
					"port": "4000",
					"path": [
						"profile"
					]
				}
			},
			"response": []
		},
		{
			"name": "Courses",
			"request": {
				"method": "GET",
				"header": [],
				"url": {
					"raw": "localhost:4000/courses",
					"host": [
						"localhost"
					],
					"port": "4000",
					"path": [
						"courses"
					]
				}
			},
			"response": []
		},
		{
			"name": "ADD COURSE REQUEST",
			"request": {
				"method": "GET",
				"header": [],
				"url": {
					"raw": "localhost:4000/addCourses",
					"host": [
						"localhost"
					],
					"port": "4000",
					"path": [
						"addCourses"
					]
				}
			},
			"response": []
		},
		{
			"name": "Update Courses",
			"request": {
				"method": "GET",
				"header": [],
				"url": {
					"raw": "localhost:4000/updateCourses",
					"host": [
						"localhost"
					],
					"port": "4000",
					"path": [
						"updateCourses"
					]
				}
			},
			"response": []
		},
		{
			"name": "Archiving Course",
			"request": {
				"method": "GET",
				"header": []
			},
			"response": []
		},
		{
			"name": "Unknown URL request",
			"request": {
				"method": "GET",
				"header": [],
				"url": {
					"raw": "localhost:4000/TheOriginals",
					"host": [
						"localhost"
					],
					"port": "4000",
					"path": [
						"TheOriginals"
					]
				}
			},
			"response": []
		}
	]
}