{
	"info": {
		"_postman_id": "90073b09-3840-4bf9-bbe7-cb86fd0438b4",
		"name": "Activity 34",
		"schema": "https://schema.getpostman.com/json/collection/v2.1.0/collection.json",
		"_exporter_id": "20774951"
	},
	"item": [
		{
			"name": "SingleItem",
			"request": {
				"method": "GET",
				"header": []
			},
			"response": []
		},
		{
			"name": "ARCHIVE FALSE",
			"request": {
				"method": "PUT",
				"header": []
			},
			"response": []
		},
		{
			"name": "ACTIVATE TRUE",
			"request": {
				"method": "PUT",
				"header": []
			},
			"response": []
		}
	]
}