CAPSTONE BACKEND 

>> TARGET BACKEND [ONLINE SHOP]

    WHERE : 
            *USER CAN CREATE ACCOUNT
                    IN USERNAME MUST BE UNIQUE [NO IDENTICAL]
                    EMAIL MUST BE ALSO UNIQUE
                    PASSWORD IS NOT LESS THAN 8 CHARACTERS
            *USER CAN LOG IN
            *USER CAN BROWSE ITEMS
            *USER CAN BUY ITEMS
            *USER CAN HAVE THE TOTAL AMOUNT TO PAY!

            *ADMIN 
                CAN ADD ITEMS
                CAN REMOVE ITEMS
                CAN DEACTIVATE A USER.

