{
	"info": {
		"_postman_id": "f39870d6-2aee-479e-83a8-4fd5e3ea896f",
		"name": "booking-system-api",
		"schema": "https://schema.getpostman.com/json/collection/v2.1.0/collection.json",
		"_exporter_id": "20736647"
	},
	"item": [
		{
			"name": "ACTIVITIES",
			"item": [
				{
					"name": "GET SINGLE COURSE",
					"request": {
						"method": "GET",
						"header": [],
						"url": {
							"raw": "localhost:4000/courses/getSingleCourse/629731a78561118296f06979",
							"host": [
								"localhost"
							],
							"port": "4000",
							"path": [
								"courses",
								"getSingleCourse",
								"629731a78561118296f06979"
							]
						}
					},
					"response": []
				},
				{
					"name": "CHECK EMAIL EXISTS",
					"request": {
						"method": "POST",
						"header": [],
						"body": {
							"mode": "raw",
							"raw": "{\r\n    \"email\" : \"callMeLisa@gmail.com\"\r\n}",
							"options": {
								"raw": {
									"language": "json"
								}
							}
						},
						"url": {
							"raw": "localhost:4000/users/checkEmailExists",
							"host": [
								"localhost"
							],
							"port": "4000",
							"path": [
								"users",
								"checkEmailExists"
							]
						}
					},
					"response": []
				},
				{
					"name": "UPDATE A USER DETAILS",
					"request": {
						"auth": {
							"type": "bearer",
							"bearer": [
								{
									"key": "token",
									"value": "eyJhbGciOiJIUzI1NiIsInR5cCI6IkpXVCJ9.eyJpZCI6IjYyOTcwMDI2OTIyNDE4OTAzNTQ3NGRmOCIsImVtYWlsIjoiY2FsbE1lTGlzYUBnbWFpbC5jb20iLCJpc0FkbWluIjp0cnVlLCJpYXQiOjE2NTQxNDkwNjR9.ZVgj0DbBhdqfc1iXvi0jDCQTTMKu6MBqTSBaR3K260c",
									"type": "string"
								}
							]
						},
						"method": "PUT",
						"header": [],
						"body": {
							"mode": "raw",
							"raw": "{\r\n    \"firstName\" : \"Jennie\",\r\n    \"lastName\" : \"Kim\",\r\n    \"mobileNo\" : \"09123456789\"\r\n}",
							"options": {
								"raw": {
									"language": "json"
								}
							}
						},
						"url": {
							"raw": "localhost:4000/users/updateUserDetails",
							"host": [
								"localhost"
							],
							"port": "4000",
							"path": [
								"users",
								"updateUserDetails"
							]
						}
					},
					"response": []
				},
				{
					"name": "UPDATE ADMIN",
					"request": {
						"auth": {
							"type": "bearer",
							"bearer": [
								{
									"key": "token",
									"value": "eyJhbGciOiJIUzI1NiIsInR5cCI6IkpXVCJ9.eyJpZCI6IjYyOTcwMDI2OTIyNDE4OTAzNTQ3NGRmOCIsImVtYWlsIjoiY2FsbE1lTGlzYUBnbWFpbC5jb20iLCJpc0FkbWluIjp0cnVlLCJpYXQiOjE2NTQxNTA1MDh9.asnioXo2X2cWV2GrX_yogpRkUSz1vMwED22hkt66M9U",
									"type": "string"
								}
							]
						},
						"method": "PUT",
						"header": [],
						"body": {
							"mode": "raw",
							"raw": "{\r\n    \"isAdmin\" : true\r\n}",
							"options": {
								"raw": {
									"language": "json"
								}
							}
						},
						"url": {
							"raw": "localhost:4000/users/updateAdmin/629700269224189035474df8",
							"host": [
								"localhost"
							],
							"port": "4000",
							"path": [
								"users",
								"updateAdmin",
								"629700269224189035474df8"
							]
						}
					},
					"response": []
				},
				{
					"name": "UPDATE A COURSE",
					"request": {
						"auth": {
							"type": "bearer",
							"bearer": [
								{
									"key": "token",
									"value": "eyJhbGciOiJIUzI1NiIsInR5cCI6IkpXVCJ9.eyJpZCI6IjYyOTcwMDI2OTIyNDE4OTAzNTQ3NGRmOCIsImVtYWlsIjoiY2FsbE1lTGlzYUBnbWFpbC5jb20iLCJpc0FkbWluIjp0cnVlLCJpYXQiOjE2NTQxNTIzOTB9.-v79DksnNdgtM_PQlMR-ppizmQhRJ8Qhbr0Pg5Cj22Y",
									"type": "string"
								}
							]
						},
						"method": "PUT",
						"header": [],
						"body": {
							"mode": "raw",
							"raw": "{\r\n    \"name\" : \"HTML\",\r\n    \"description\" : \"To make a website\",\r\n    \"price\" : \"20000\"\r\n}",
							"options": {
								"raw": {
									"language": "json"
								}
							}
						},
						"url": {
							"raw": "localhost:4000/courses/629731cc8561118296f0697c",
							"host": [
								"localhost"
							],
							"port": "4000",
							"path": [
								"courses",
								"629731cc8561118296f0697c"
							]
						}
					},
					"response": []
				},
				{
					"name": "ARCHIVE COURSE",
					"request": {
						"auth": {
							"type": "bearer",
							"bearer": [
								{
									"key": "token",
									"value": "eyJhbGciOiJIUzI1NiIsInR5cCI6IkpXVCJ9.eyJpZCI6IjYyOTcwMDI2OTIyNDE4OTAzNTQ3NGRmOCIsImVtYWlsIjoiY2FsbE1lTGlzYUBnbWFpbC5jb20iLCJpc0FkbWluIjp0cnVlLCJpYXQiOjE2NTQxNTQyMTB9.OdDztsEdAAH2w1jQgXkffxFNw7kr6scobgxylpFsTDw",
									"type": "string"
								}
							]
						},
						"method": "PUT",
						"header": [],
						"body": {
							"mode": "raw",
							"raw": "",
							"options": {
								"raw": {
									"language": "json"
								}
							}
						},
						"url": {
							"raw": "localhost:4000/courses/archive/629731cc8561118296f0697c",
							"host": [
								"localhost"
							],
							"port": "4000",
							"path": [
								"courses",
								"archive",
								"629731cc8561118296f0697c"
							]
						}
					},
					"response": []
				},
				{
					"name": "ACTIVATE COURSE",
					"request": {
						"auth": {
							"type": "bearer",
							"bearer": [
								{
									"key": "token",
									"value": "eyJhbGciOiJIUzI1NiIsInR5cCI6IkpXVCJ9.eyJpZCI6IjYyOTcwMDI2OTIyNDE4OTAzNTQ3NGRmOCIsImVtYWlsIjoiY2FsbE1lTGlzYUBnbWFpbC5jb20iLCJpc0FkbWluIjp0cnVlLCJpYXQiOjE2NTQxNTUzMDN9.L3Vgx2aDviRmhfNSpPwsyAhYL3v4XuOQ7h8WrDzJDqE",
									"type": "string"
								}
							]
						},
						"method": "PUT",
						"header": [],
						"url": {
							"raw": "localhost:4000/courses/activate/629731cc8561118296f0697c",
							"host": [
								"localhost"
							],
							"port": "4000",
							"path": [
								"courses",
								"activate",
								"629731cc8561118296f0697c"
							]
						}
					},
					"response": []
				},
				{
					"name": "GET ACTIVE COURSE",
					"request": {
						"method": "GET",
						"header": [],
						"url": {
							"raw": "localhost:4000/courses/getActiveCourses",
							"host": [
								"localhost"
							],
							"port": "4000",
							"path": [
								"courses",
								"getActiveCourses"
							]
						}
					},
					"response": []
				}
			]
		},
		{
			"name": "REGISTER USER",
			"request": {
				"method": "POST",
				"header": [],
				"body": {
					"mode": "raw",
					"raw": "{\r\n    \"firstName\" : \"Bruce\",\r\n    \"lastName\" : \"Lee\",\r\n    \"email\" : \"kungfu@gmail.com\",\r\n    \"mobileNo\" : \"09987654321\",\r\n    \"password\" : \"user123\"\r\n}",
					"options": {
						"raw": {
							"language": "json"
						}
					}
				},
				"url": {
					"raw": "localhost:4000/users",
					"host": [
						"localhost"
					],
					"port": "4000",
					"path": [
						"users"
					]
				}
			},
			"response": []
		},
		{
			"name": "GET ALL USERS",
			"request": {
				"method": "GET",
				"header": [],
				"url": {
					"raw": "localhost:4000/users",
					"host": [
						"localhost"
					],
					"port": "4000",
					"path": [
						"users"
					]
				}
			},
			"response": []
		},
		{
			"name": "LOGIN USER",
			"request": {
				"auth": {
					"type": "bearer"
				},
				"method": "POST",
				"header": [],
				"body": {
					"mode": "raw",
					"raw": "{\r\n    \"email\" : \"callMeLisa@gmail.com\",\r\n    \"password\" : \"user123\"\r\n}",
					"options": {
						"raw": {
							"language": "json"
						}
					}
				},
				"url": {
					"raw": "localhost:4000/users/login",
					"host": [
						"localhost"
					],
					"port": "4000",
					"path": [
						"users",
						"login"
					]
				}
			},
			"response": []
		},
		{
			"name": "ADD COURSE",
			"request": {
				"auth": {
					"type": "bearer",
					"bearer": [
						{
							"key": "token",
							"value": "eyJhbGciOiJIUzI1NiIsInR5cCI6IkpXVCJ9.eyJpZCI6IjYyOTcwMDI2OTIyNDE4OTAzNTQ3NGRmOCIsImVtYWlsIjoiY2FsbE1lTGlzYUBnbWFpbC5jb20iLCJpc0FkbWluIjp0cnVlLCJpYXQiOjE2NTQxNDAwMjN9.UX-SdKSExswo0xPs1xId9Ul9Ka5tlhBH1FSquBCuG4o",
							"type": "string"
						}
					]
				},
				"method": "POST",
				"header": [],
				"body": {
					"mode": "raw",
					"raw": "{\r\n    \"name\" : \"IT\",\r\n    \"description\" : \"Is about using technology to organize\",\r\n    \"price\" : 25000\r\n}",
					"options": {
						"raw": {
							"language": "json"
						}
					}
				},
				"url": {
					"raw": "localhost:4000/courses",
					"host": [
						"localhost"
					],
					"port": "4000",
					"path": [
						"courses"
					]
				}
			},
			"response": []
		},
		{
			"name": "GET ALL COURSES",
			"request": {
				"method": "GET",
				"header": [],
				"url": {
					"raw": "localhost:4000/courses",
					"host": [
						"localhost"
					],
					"port": "4000",
					"path": [
						"courses"
					]
				}
			},
			"response": []
		},
		{
			"name": "GET USER DETAILS",
			"request": {
				"auth": {
					"type": "bearer",
					"bearer": [
						{
							"key": "token",
							"value": "eyJhbGciOiJIUzI1NiIsInR5cCI6IkpXVCJ9.eyJpZCI6IjYyOTcwMDI2OTIyNDE4OTAzNTQ3NGRmOCIsImVtYWlsIjoiY2FsbE1lTGlzYUBnbWFpbC5jb20iLCJpc0FkbWluIjp0cnVlLCJpYXQiOjE2NTQxMzkyODh9.F5-mY_FlPb2lk-Sw8HhcxU3E0iHVpv16QQTZjV6hDi0",
							"type": "string"
						}
					]
				},
				"method": "GET",
				"header": [],
				"url": {
					"raw": "localhost:4000/users/getUserDetails",
					"host": [
						"localhost"
					],
					"port": "4000",
					"path": [
						"users",
						"getUserDetails"
					]
				}
			},
			"response": []
		}
	]
}