{
	"info": {
		"_postman_id": "95e23416-fb1f-4783-9715-1c22d9b376c2",
		"name": "booking-system-api",
		"schema": "https://schema.getpostman.com/json/collection/v2.1.0/collection.json",
		"_exporter_id": "21149163"
	},
	"item": [
		{
			"name": "Register User",
			"request": {
				"method": "POST",
				"header": [],
				"body": {
					"mode": "raw",
					"raw": "{\r\n        \"firstName\": \"John\",\r\n        \"lastName\": \"Doe\",\r\n        \"email\": \"uwotmate@mail.com\",\r\n        \"password\": \"user123\",\r\n        \"mobileNumber\": \"09090909090\"\r\n    }",
					"options": {
						"raw": {
							"language": "json"
						}
					}
				},
				"url": {
					"raw": "localhost:4200/users",
					"host": [
						"localhost"
					],
					"port": "4200",
					"path": [
						"users"
					]
				}
			},
			"response": []
		},
		{
			"name": "Get All Users",
			"request": {
				"method": "GET",
				"header": [],
				"url": {
					"raw": "localhost:4200/users",
					"host": [
						"localhost"
					],
					"port": "4200",
					"path": [
						"users"
					]
				}
			},
			"response": []
		},
		{
			"name": "LOGIN User",
			"request": {
				"method": "POST",
				"header": [],
				"body": {
					"mode": "raw",
					"raw": "{\r\n    \"email\": \"uwotmate@mail.com\",\r\n    \"password\": \"user123\"\r\n}",
					"options": {
						"raw": {
							"language": "json"
						}
					}
				},
				"url": {
					"raw": "localhost:4200/users/login",
					"host": [
						"localhost"
					],
					"port": "4200",
					"path": [
						"users",
						"login"
					]
				}
			},
			"response": []
		},
		{
			"name": "Get All Courses",
			"request": {
				"method": "GET",
				"header": [],
				"url": {
					"raw": "localhost:4200/courses",
					"host": [
						"localhost"
					],
					"port": "4200",
					"path": [
						"courses"
					]
				}
			},
			"response": []
		},
		{
			"name": "Register Course",
			"request": {
				"method": "POST",
				"header": [],
				"body": {
					"mode": "raw",
					"raw": "{\r\n        \"name\": \"Unreal Engine 5 C++\",\r\n        \"description\": \"The world's most advanced real-time 3D creation tool for photoreal visuals and immersive experiences. Unreal Engine 5FeaturesLicensing options Other ProductsMetaHuman Creator. Cloud-based app for high-fidelity digital humans in minutes. Fast, easy, real-time immersive 3D architectural visualization.\",\r\n        \"price\": 2000\r\n    }",
					"options": {
						"raw": {
							"language": "json"
						}
					}
				},
				"url": {
					"raw": "localhost:4200/courses",
					"host": [
						"localhost"
					],
					"port": "4200",
					"path": [
						"courses"
					]
				}
			},
			"response": []
		}
	]
}