[{
	"_id": "product001",
	"name": "Royal Canin",
	"description": "Organic Dog Food helps to fast digestion.",
	"price": 1000,
	"stocks": 10,
	"isActive": true,
	"SKU": "UGG-BB-PUR-06"
},
{
	"_id": "product002",
	"name": "Pedigree",
	"description": "Not Organic Dog Food",
	"price": 500,
	"stocks": 50,
	"isActive": true,
	"SKU": "U55-xx-PUR-80"
}]