[{
	"_id": "orderProduct001",
	"orderID": "order001",
	"productID": "product001",
	"quantity": 1,
	"price": 1000,
	"subTotal": 1000
},
{
	"_id": "orderProduct001",
	"orderID": "order001",
	"productID": "product002",
	"quantity": 1,
	"price": 500,
	"subTotal": 500
}]