1:
3.79
3.53
3.47
4.76
3.85
4.02
3.57
3.82
4.15
3.73
2.84
3.71
4.25
4.12
3.02
4.33
3.94
4.35
4.24
4.28
3.29
5.0
3.65
10:
3.04
2.80
1000:
3.28
3.00
2.79
4.59
3.63
3.51
3.35
3.95
3.18
2.93
3.37
3.63
3.33
4.28
3.94
3.15
3.12
3.14
3.29
3.69
3.69
3.94
2.52
3.16
4.06
3.19
3.67
10000:
3.77
3.95
10001:
3.65
4.28
3.90
2.87
4.14
3.43
3.52
3.97
3.98
2.92
4.15
4.16
3.06
4.20
3.82
3.96
4.38
10002:
4.43
3.56
4.84
4.02
10003:
2.09
10004:
5.0
4.12
4.33
3.97
4.66
4.33
4.45
4.25
4.30
4.14
4.13
3.90
4.29
3.85
5.0
4.57
4.43
4.43
4.60
4.97
4.27
4.06
3.84
4.18
5.0
3.88
4.19
4.37
3.32
4.60
4.54
10005:
3.61
4.03
3.23
3.11
3.64
10006:
3.95
3.44
4.12
2.98
10007:
2.32
2.89
2.60
2.49
2.21
2.73
2.36
3.03
2.60
2.95
2.48
2.92
2.65
10008:
4.76
3.56
3.68
3.21
4.33
4.12
4.10
10009:
3.84
3.62
4.67
2.89
2.75
3.54
1001:
3.26
3.55
3.86
3.09
4.11
3.97
3.73
3.69
2.77
3.68
3.63
4.08
2.95
3.71
3.43
3.34
3.97
3.79
3.00
3.27
3.26
3.69
3.35
2.85
3.55
2.95
3.61
3.66
3.96
4.05
3.67
4.61
3.03
3.48
3.34
3.51
4.04
2.81
3.42
3.72
3.94
3.08
3.64
3.97
4.05
3.82
3.45
3.11
3.25
4.03
3.22
2.34
2.63
3.56
4.07
4.12
3.58
3.34
3.50
3.21
3.44
3.17
3.00
2.95
4.05
3.20
2.84
3.06
3.96
3.47
2.95
3.32
3.54
3.07
2.36
3.73
2.72
2.57
3.64
3.54
4.16
3.93
2.64
2.91
3.52
3.24
3.39
4.14
3.39
3.04
4.01
3.46
3.39
3.78
3.16
2.74
3.17
4.61
3.33
3.94
3.50
3.71
3.12
3.10
3.21
3.46
3.67
3.90
3.66
2.75
3.10
3.39
3.42
3.07
3.42
2.52
3.08
4.14
3.75
3.12
3.33
3.49
3.58
3.49
3.27
3.30
3.11
3.61
3.64
3.36
3.47
3.72
3.61
3.39
10010:
2.43
2.24
2.28
3.03
2.64
2.29
2.53
2.31
2.00
2.62
2.25
2.06
2.36
1.91
2.95
2.24
2.08
2.74
1.49
2.39
2.07
1.93
2.34
10011:
4.45
4.13
10012:
3.43
4.25
3.39
3.42
3.96
4.03
2.86
2.88
3.34
3.64
4.01
3.37
3.46
10013:
3.59
3.16
3.42
3.67
3.40
3.52
3.09
3.63
3.38
3.82
2.84
4.11
3.65
3.44
3.15
3.32
2.88
3.21
3.31
2.87
3.11
2.99
3.28
3.83
3.74
3.16
3.33
2.73
3.15
3.46
2.98
3.21
3.06
3.82
3.28
3.05
3.38
3.99
4.01
2.88
4.14
3.33
3.72
3.85
3.27
2.87
3.32
3.50
3.21
3.62
3.11
3.17
3.61
3.74
3.24
2.64
3.84
10014:
2.84
3.68
2.64
3.85
3.20
10015:
3.82
3.36
3.02
3.61
3.97
3.56
4.07
3.87
3.98
3.75
3.98
3.69
3.47
4.11
4.11
3.60
3.72
4.15
3.54
4.07
5.0
4.13
4.58
3.87
3.27
3.39
4.35
3.73
10016:
1.88
2.06
2.41
2.65
3.62
10017:
2.79
3.29
3.31
10018:
4.57
4.28
2.95
3.26
3.61
3.92
3.79
3.39
2.68
4.19
3.51
4.09
3.25
3.93
3.28
3.97
3.74
3.79
3.28
3.79
4.46
3.25
4.19
4.30
3.58
4.16
4.02
3.87
4.18
4.22
10019:
3.53
1.88
3.81
3.14
4.36
4.25
3.60
2.77
3.85
3.63
4.46
3.07
3.11
3.32
3.82
3.66
3.90
3.71
3.46
4.41
3.82
3.85
3.83
3.63
3.97
3.70
3.20
3.36
3.52
3.82
3.78
2.91
3.82
4.04
3.35
4.06
2.55
3.94
3.99
4.15
4.03
4.23
4.13
3.90
4.23
3.07
3.85
4.19
3.55
3.61
3.25
3.43
4.00
3.38
1.11
2.57
2.81
3.30
4.37
3.40
3.08
3.47
4.62
3.46
4.06
4.72
3.43
4.65
3.64
1002:
3.59
2.82
3.42
3.61
2.94
3.66
4.19
2.58
3.58
3.71
4.17
3.50
3.39
3.14
10020:
4.09
4.16
3.90
4.27
3.95
3.76
3.88
4.30
4.18
4.04
3.98
4.89
4.18
3.68
4.03
3.99
4.30
3.56
4.22
3.68
4.42
3.48
3.87
3.88
3.40
2.68
4.26
10021:
2.55
2.88
3.02
2.02
10022:
2.41
3.43
3.02
2.98
3.59
3.43
2.63
2.66
10023:
3.97
3.92
3.96
3.64
4.77
3.65
3.50
3.89
3.58
3.99
4.42
10024:
3.53
3.97
3.59
3.87
3.63
3.66
3.14
3.31
3.75
3.77
10025:
2.94
10027:
4.58
4.11
3.86
3.82
3.19
3.81
3.52
4.88
3.27
4.55
3.88
3.98
4.21
3.63
3.98
4.66
3.66
4.15
4.26
4.19
3.46
3.83
3.91
4.11
4.32
4.13
4.42
4.54
5.0
4.55
4.60
4.28
3.44
3.92
4.47
4.29
4.78
4.14
4.18
3.69
4.47
4.53
5.0
3.85
3.77
4.53
4.12
4.03
4.30
4.39
3.99
4.35
3.80
3.73
3.62
4.01
3.66
3.70
4.45
4.28
3.82
3.50
4.58
3.44
4.57
5.0
3.58
4.22
3.46
4.33
4.26
4.23
4.45
4.26
4.58
4.07
4.34
3.82
3.12
3.80
4.77
4.87
3.57
4.07
4.14
4.37
3.91
4.17
10028:
3.44
3.66
3.43
4.34
4.78
3.36
4.62
10029:
3.21
4.04
4.01
2.91
10031:
3.33
2.88
3.69
2.50
3.84
3.06
2.76
2.32
2.83
10032:
3.26
4.76
4.19
4.29
4.10
2.93
3.61
3.45
3.86
2.71
3.20
4.22
4.67
3.53
4.19
2.89
3.68
3.52
3.45
3.72
3.29
3.63
3.38
3.52
3.89
3.17
3.06
3.57
4.46
3.30
3.65
3.84
4.17
3.82
2.75
4.03
3.76
3.36
3.49
3.67
3.58
3.69
3.56
3.12
3.46
3.68
3.98
10033:
4.09
3.58
2.95
3.87
3.22
3.11
3.42
3.36
3.93
3.38
4.00
3.68
4.83
4.14
10034:
1.62
3.35
10035:
2.78
4.68
4.54
4.43
4.47
4.46
4.14
3.77
3.66
3.82
4.09
3.98
4.09
4.21
3.95
3.97
4.14
4.38
4.30
5.0
10036:
4.19
3.51
3.68
3.44
3.99
4.00
3.18
3.84
3.03
3.24
3.29
3.75
4.12
4.02
4.64
4.10
3.77
4.07
2.81
3.24
3.87
3.51
4.97
4.02
3.74
4.28
3.91
4.12
4.11
3.18
3.69
3.21
3.16
3.45
3.11
3.63
3.88
3.84
3.65
4.09
3.53
3.74
4.33
3.87
4.05
4.25
4.54
5.0
3.32
4.15
3.45
3.89
3.71
3.12
3.74
3.89
3.72
4.83
3.60
4.14
3.87
4.40
3.40
4.49
3.23
4.54
3.91
3.74
3.94
4.09
4.69
4.19
4.01
3.47
3.94
4.26
4.28
3.33
4.22
4.20
3.89
3.82
4.58
4.13
2.99
3.91
3.62
4.00
4.04
3.49
2.84
4.31
3.66
4.22
3.69
3.43
3.34
4.01
3.61
4.21
4.20
3.03
3.65
4.44
3.70
3.10
4.86
3.31
3.80
3.97
3.92
3.52
3.55
3.74
3.60
3.74
4.64
3.54
3.70
4.03
3.83
3.92
4.07
3.74
3.96
3.39
3.94
4.56
3.74
3.49
4.30
3.34
3.42
5.0
3.77
3.41
4.09
3.83
4.26
3.14
4.53
4.28
3.89
3.79
3.26
4.73
3.48
3.91
3.57
3.53
4.34
3.95
4.19
3.71
3.67
3.59
4.82
3.97
3.71
4.46
4.17
3.74
4.02
4.15
3.80
3.81
4.14
4.42
4.21
3.64
3.47
3.65
4.24
3.76
4.04
4.02
3.67
4.10
4.01
4.45
3.80
4.44
3.39
3.93
4.72
3.72
3.79
3.47
4.10
3.77
3.67
3.37
4.01
4.65
4.17
3.21
3.80
4.30
3.31
3.90
3.84
3.88
3.57
4.07
3.10
4.86
3.85
4.55
4.19
3.71
3.68
3.57
4.42
3.74
3.59
10037:
4.12
3.17
3.52
3.98
3.83
3.90
3.42
2.90
3.56
3.90
3.58
3.53
3.07
3.56
10038:
4.34
3.16
3.33
3.15
3.32
3.75
3.75
3.13
10039:
1.77
1004:
2.45
2.14
3.07
2.73
3.06
3.02
2.53
3.58
2.27
2.98
3.13
3.34
3.35
3.43
2.67
2.27
2.87
3.10
2.76
2.95
3.02
3.43
3.43
1.72
2.58
2.18
2.92
2.96
2.67
3.02
2.53
10040:
3.03
3.34
4.01
10041:
4.14
3.01
3.34
2.83
3.15
3.08
3.78
3.10
1.29
2.86
1.0
3.42
3.81
2.46
3.27
3.36
3.20
2.74
2.99
2.56
2.97
3.30
2.99
3.16
3.41
2.51
3.28
2.55
3.22
2.60
3.35
10042:
4.63
3.98
4.54
4.14
4.49
5.0
5.0
4.37
5.0
4.30
4.67
4.30
4.85
4.46
4.57
4.81
3.87
5.0
5.0
4.63
5.0
4.91
3.73
4.48
4.60
5.0
4.96
3.54
4.74
4.63
4.79
4.73
4.56
4.86
4.75
5.0
4.57
5.0
4.38
3.96
4.66
4.38
4.36
4.21
5.0
4.96
4.58
4.16
4.57
4.10
4.27
4.88
5.0
2.95
5.0
4.99
3.93
4.68
4.00
4.39
4.54
4.71
4.60
4.57
3.77
3.96
4.33
5.0
4.66
4.23
4.24
4.61
4.59
4.28
3.85
5.0
4.89
4.48
4.52
4.75
4.07
5.0
4.64
4.52
4.96
4.26
5.0
4.73
3.97
5.0
4.27
4.65
5.0
4.43
4.48
4.39
4.24
4.58
4.58
4.31
4.82
4.86
4.00
5.0
4.80
4.40
4.50
4.53
5.0
4.69
5.0
4.57
4.66
4.84
4.42
4.56
4.59
4.17
4.63
5.0
4.09
5.0
4.45
5.0
4.75
5.0
3.97
4.27
4.63
4.16
4.26
4.60
4.51
2.86
4.43
4.55
5.0
5.0
4.19
5.0
4.42
5.0
4.47
3.94
4.66
4.39
4.66
3.79
4.21
4.84
4.28
4.69
5.0
4.56
4.80
3.95
4.33
3.84
4.06
4.75
3.95
4.99
4.56
4.66
4.08
4.94
4.33
4.28
4.44
4.55
4.93
4.93
4.15
4.59
4.90
4.31
4.77
5.0
5.0
4.32
4.53
5.0
5.0
4.31
4.61
5.0
4.24
3.93
4.40
4.91
4.25
4.51
4.82
4.08
4.92
5.0
4.94
4.49
4.57
4.54
4.75
4.90
4.64
4.75
4.72
3.31
4.75
4.64
4.66
4.35
4.22
4.36
5.0
5.0
5.0
4.89
5.0
4.75
4.51
4.77
4.50
4.78
5.0
4.89
4.62
4.73
4.91
4.27
5.0
4.60
4.58
4.61
4.92
5.0
5.0
4.47
5.0
4.22
5.0
4.56
4.24
5.0
5.0
4.85
4.76
5.0
5.0
4.84
4.51
4.70
3.89
4.61
5.0
4.45
4.23
5.0
4.26
4.79
4.78
4.06
4.48
4.75
4.32
5.0
3.83
4.42
5.0
4.82
4.62
4.32
4.54
4.97
4.48
4.24
5.0
4.16
4.57
4.51
5.0
4.80
4.52
4.26
4.83
4.34
4.72
4.36
4.43
4.93
4.32
4.71
4.71
4.08
4.77
4.24
4.21
4.13
4.39
4.81
4.37
4.42
4.81
4.62
4.64
4.65
4.02
4.56
4.49
5.0
4.75
4.33
4.56
4.65
5.0
4.71
4.50
5.0
4.75
4.95
4.89
4.32
4.76
4.36
4.90
4.78
4.99
4.82
4.91
4.62
5.0
4.53
4.94
5.0
3.98
4.85
4.30
4.81
5.0
5.0
4.32
4.98
4.95
5.0
4.94
5.0
4.22
4.74
4.79
5.0
4.28
4.98
5.0
4.30
4.86
4.66
4.13
4.69
4.96
4.86
4.34
4.75
4.28
4.29
4.51
4.64
4.55
4.33
4.09
4.30
5.0
5.0
5.0
4.52
4.47
4.35
4.70
5.0
3.96
3.80
4.68
4.77
4.54
4.61
4.02
4.50
4.32
4.89
4.60
4.36
4.14
4.56
4.58
4.31
4.56
4.03
4.21
5.0
4.58
4.27
4.47
4.50
4.45
4.42
4.16
4.29
4.51
4.56
4.75
4.46
3.85
4.84
4.98
4.14
4.66
4.49
5.0
4.68
4.14
5.0
4.57
3.99
5.0
4.56
4.71
5.0
4.64
4.32
4.90
5.0
4.98
4.49
4.33
4.94
4.10
4.60
5.0
3.98
4.43
3.40
4.30
5.0
5.0
5.0
4.57
4.57
5.0
5.0
5.0
4.83
4.38
4.12
4.35
4.99
5.0
4.88
5.0
4.96
4.18
4.70
4.13
4.90
4.63
4.53
4.45
4.12
5.0
4.56
5.0
5.0
4.73
5.0
4.83
4.50
4.25
5.0
4.90
4.91
4.70
5.0
4.22
4.02
4.63
4.73
4.39
4.11
5.0
4.31
5.0
4.55
4.78
4.25
4.51
4.31
4.06
4.58
4.50
4.81
4.41
4.62
4.57
4.22
4.49
4.13
4.49
4.13
4.15
5.0
4.70
4.83
4.06
4.62
4.53
4.86
4.64
4.42
4.84
4.89
5.0
5.0
4.23
4.47
4.83
4.25
4.17
4.44
5.0
4.77
4.49
3.80
3.86
5.0
4.84
4.14
4.63
4.79
5.0
4.35
5.0
5.0
4.90
4.53
4.17
4.92
4.78
4.56
4.97
5.0
3.89
5.0
5.0
4.56
4.35
3.58
5.0
2.05
4.41
4.84
4.56
4.30
4.19
5.0
4.51
4.07
4.79
4.50
4.77
4.96
4.38
4.10
4.56
3.87
4.62
3.36
4.02
4.98
4.17
5.0
4.53
3.85
4.51
4.53
5.0
4.17
4.46
4.28
4.68
4.75
5.0
5.0
5.0
4.39
4.39
4.58
4.16
4.27
3.87
4.50
4.69
4.74
4.36
4.11
4.60
5.0
4.56
4.41
3.83
4.72
4.40
4.44
5.0
4.05
4.29
4.18
5.0
4.81
4.20
4.36
3.85
5.0
4.84
4.21
4.07
4.49
4.71
4.28
3.98
4.58
3.93
3.85
4.67
4.41
4.60
4.79
4.62
4.32
4.50
4.14
5.0
4.58
4.43
5.0
4.47
4.11
4.71
4.65
4.85
4.81
5.0
4.39
4.47
4.39
4.53
4.53
4.57
4.77
4.94
4.79
4.44
5.0
4.40
4.68
3.68
5.0
3.89
4.34
4.79
4.95
4.47
4.12
4.41
4.63
4.52
4.28
4.85
5.0
5.0
4.70
4.04
4.62
4.53
4.28
5.0
4.35
4.79
4.06
4.49
4.35
4.40
5.0
4.35
4.43
4.34
5.0
4.51
4.42
4.55
4.69
4.73
4.86
4.55
4.52
5.0
3.45
4.75
4.70
4.75
4.86
4.45
4.27
4.25
4.52
4.46
4.19
4.62
4.90
4.68
4.94
4.75
4.75
5.0
4.70
4.13
4.95
5.0
4.70
4.02
4.25
4.65
3.55
4.10
4.15
4.60
4.36
5.0
4.22
5.0
4.83
4.38
4.46
5.0
4.30
4.52
4.50
3.93
4.79
4.60
4.52
4.92
4.78
4.77
5.0
4.22
5.0
5.0
4.66
4.67
5.0
0.85
