1 10 20
100 200 125
201 210 89
900 1000 174
796353 212703 509
764616 914311 525
898974 269553 525
939672 881422 507
830497 202258 509
933727 597775 525
781910 546730 509
330885 468795 449
233290 868095 525
817854 232545 509
850319 531543 525
593302 240178 471
74653 958285 525
39801 707976 509
483929 660610 509
530968 905573 525
365735 935168 525
95399 329769 443
113060 590557 471
522738 598807 453
362308 557415 471
320500 562399 471
508930 294308 449
828304 830221 375
643503 988278 525
763511 369162 509
994815 751263 525
805341 103225 509
831467 974484 525
419071 732779 509
263845 892634 525
994732 452693 525
883875 625631 525
294659 254250 407
733599 236514 509
685381 866274 525
697685 466136 509
762435 97834 509
84038 646531 509
385333 53988 443
484030 94015 449
351110 343389 441
806615 672286 504
378013 378375 330
183926 253425 443
72125 109639 354
585636 234853 471
802134 598686 509
535911 399894 471
278600 188189 443
52354 724340 509
143104 578710 471
652263 270030 509
915927 566703 525
107678 629642 509
892971 100282 525
271186 33923 443
855346 65610 525
748622 816731 470
114145 921737 525
552595 144095 471
393570 713728 509
124920 47720 354
883262 448316 525
885324 754848 525
960048 528849 525
951042 798507 525
15179 533697 471
8912 370398 443
30354 137490 354
815815 802475 406
386875 856991 525
44354 890190 525
811001 192465 509
351862 676287 509
465666 192142 449
690804 858274 525
861539 427804 525
332468 48369 443
985582 363785 525
688782 691653 336
339750 156512 443
956003 340436 525
718491 311974 509
92329 261765 443
99012 507928 449
234700 924749 525
230493 61618 386
175356 157074 370
427869 357999 449
81232 135911 354
5951 665486 509
872273 162603 525
507067 998233 525
144087 693628 509
380699 727215 509
60332 97824 351
803111 330860 509
785060 288438 509
447742 193851 449
554799 397976 471
843633 379397 525
638252 129387 509
392847 627904 509
884184 76908 525
405881 887167 525
481302 207099 449
483922 398997 449
582232 137473 471
483083 223307 449
323710 433847 449
581118 55706 471
250881 766833 509
874251 396272 525
699593 602794 509
132640 417206 449
290689 165300 443
903038 307870 525
260031 268227 407
474226 830054 509
220300 374767 443
988189 615662 525
203519 781266 509
432551 453775 400
560133 255410 471
538952 573137 453
113295 859414 525
619207 560305 448
88384 497885 449
462848 591168 471
550749 270934 471
249426 945625 525
158724 486578 449
798113 818711 406
556488 116426 471
918353 555922 525
867860 844333 420
345422 716310 509
372563 554272 471
334537 839562 525
699693 604574 509
270414 376411 441
13376 585882 471
186864 1539 383
963822 145210 525
526227 213128 471
769297 286203 509
555741 348144 471
818368 26775 509
612992 225687 471
15864 607856 471
