1 10 20
100 200 125
201 210 89
900 1000 174
96492 111793 354
79580 634371 509
153116 78090 375
463229 822416 509
517951 11739 470
33739 544594 470
45717 349288 443
646636 707069 504
617496 302268 470
364319 494085 449
13431 365183 443
33258 301551 443
890317 705580 525
771489 228384 509
872310 913567 476
227400 850715 525
945420 308650 525
961077 878116 507
183781 217107 386
157316 933306 525
895484 611954 525
644594 861964 525
146976 552169 470
299485 855322 525
478729 897145 525
179488 958949 525
311503 174754 443
968913 469372 525
976182 891728 507
579525 207411 470
270367 450493 449
999475 248684 525
166358 434330 449
430180 585136 470
909166 642318 525
116608 922532 525
391720 306839 441
396840 921517 525
755249 73999 509
57542 249902 443
67309 723635 509
223474 751073 509
934178 902006 476
643110 137341 509
35897 28706 311
88690 709575 509
18795 873761 525
143871 313576 443
767095 103102 509
80956 348857 443
542656 572566 452
902261 571641 525
425836 415558 418
517397 891621 525
241566 216439 443
953730 849213 507
955019 28322 525
52207 149131 375
312910 538573 470
892551 828625 525
273974 60767 443
611849 110647 470
150297 73956 375
503304 170818 449
335725 8319 443
135707 386385 443
530654 588587 452
935419 872406 476
474033 121083 449
806258 360932 509
722161 915002 525
970629 869439 507
805051 562904 509
674889 918711 525
741456 61600 509
728561 498816 509
618391 744393 509
791891 374084 509
222792 812595 509
138002 845817 525
313835 65708 443
207755 919025 525
815113 628744 504
158485 619298 470
486732 170403 449
167166 874203 525
332567 243252 407
419347 107075 449
560373 849024 525
536138 536138 46
368813 448582 449
78386 770928 509
50643 722474 509
611512 218226 470
402076 883547 525
687918 771735 504
825268 56449 509
207319 940455 525
28833 468540 449
171979 30031 383
369228 689802 509
603349 82963 470
225638 402226 443
563666 80235 470
203542 75312 383
582343 365564 470
719653 396094 509
359025 709659 509
137099 840314 525
784372 329696 509
171086 489507 449
204088 979354 525
310413 740151 509
3022 443205 449
613312 619441 447
256405 220073 443
787304 945328 525
506496 670838 509
350784 190228 443
542341 991893 525
430054 71218 449
193239 304456 443
404459 892932 525
816582 901596 525
42451 391096 443
357311 798988 509
172743 857147 525
712948 857678 525
174360 806218 509
737438 354337 509
120022 213530 383
755428 674773 504
330794 324750 384
138034 238478 443
849649 713566 525
220854 72512 386
706146 849312 525
106806 14869 351
771661 984797 525
121345 676643 509
541517 670122 509
730483 690686 504
380039 749608 509
136112 919867 525
276652 616411 470
501103 3696 449
513390 540547 439
560261 73488 470
16565 433258 449
611441 324755 470
984488 76765 525
247344 814962 509
314401 161999 443
303124 17606 443
770891 98497 509
313873 112486 443
981890 144896 525
298899 754221 509
222041 888672 525
196608 928470 525
290053 289321 327
790871 45527 509
536589 133741 470
458037 419292 418
388569 499155 449
303266 466234 449
887591 97410 525
195740 441648 449
123590 969078 525
993948 129562 525
447587 995196 525
587356 209702 470
216206 372375 443
307132 32141 443
591591 38954 470
863479 79741 525
636201 127827 509
888278 275595 525
25090 232772 443
44727 44727 164
345056 606014 470
123073 252057 443
737898 973010 525
124692 771787 509
47976 435112 449
894929 774612 525
948957 750269 525
284352 186789 443
996410 996410 91
468190 837695 509
232091 89170 443
80267 547797 470
847732 708476 525
407181 589396 470
227572 329118 443
980974 126067 525
469970 791863 509
71509 565580 470
189171 919946 525
951347 297814 525
