1 5000 238
5001 10000 262
5501 10500 262
6001 11000 268
6501 11500 268
7501 12500 268
8001 13000 268
8501 13500 276
9001 14000 276
9501 14500 276
10001 15000 276
10501 15500 276
11001 16000 276
11501 16500 276
12001 17000 276
12501 17500 276
13001 18000 279
13501 18500 279
14001 19000 279
14501 19500 279
15001 20000 279
15501 20500 279
16001 21000 279
16501 21500 279
17001 22000 279
17501 22500 279
18001 23000 274
18501 23500 274
19001 24000 282
19501 24500 282
20001 25000 282
20501 25500 282
21001 26000 282
21501 26500 282
22001 27000 308
22501 27500 308
23001 28000 308
23501 28500 308
24001 29000 308
24501 29500 308
25001 30000 308
25501 30500 308
26001 31000 308
26501 31500 308
27001 32000 285
27501 32500 285
28001 33000 285
28501 33500 285
29001 34000 285
29501 34500 311
30001 35000 311
30501 35500 311
31001 36000 324
31501 36500 324
32001 37000 324
32501 37500 324
33001 38000 324
33501 38500 324
34001 39000 324
34501 39500 324
35001 40000 324
35501 40500 324
36001 41000 306
36501 41500 306
37001 42000 306
37501 42500 306
38001 43000 306
38501 43500 306
39001 44000 306
39501 44500 306
40001 45000 288
40501 45500 314
41001 46000 314
41501 46500 314
42001 47000 314
42501 47500 314
43001 48000 314
43501 48500 314
44001 49000 314
44501 49500 314
45001 50000 314
45501 50500 314
46001 51000 314
46501 51500 314
47001 52000 314
47501 52500 309
48001 53000 340
48501 53500 340
49001 54000 340
49501 54500 340
50001 55000 340
50501 55500 340
51001 56000 340
51501 56500 340
52001 57000 340
52501 57500 340
53001 58000 322
53501 58500 322
54001 59000 322
54501 59500 322
55001 60000 322
55501 60500 322
56001 61000 335
56501 61500 335
57001 62000 335
57501 62500 335
58001 63000 335
58501 63500 335
59001 64000 335
59501 64500 335
60001 65000 335
60501 65500 335
61001 66000 330
61501 66500 330
62001 67000 330
62501 67500 330
63001 68000 330
63501 68500 312
64001 69000 312
64501 69500 312
65001 70000 312
65501 70500 312
66001 71000 312
66501 71500 325
67001 72000 325
67501 72500 325
68001 73000 325
68501 73500 325
69001 74000 325
69501 74500 325
70001 75000 325
70501 75500 325
71001 76000 325
71501 76500 325
72001 77000 325
72501 77500 351
73001 78000 351
73501 78500 351
74001 79000 351
74501 79500 351
75001 80000 351
75501 80500 351
76001 81000 351
76501 81500 351
77001 82000 351
77501 82500 338
78001 83000 338
78501 83500 338
79001 84000 320
79501 84500 320
80001 85000 320
80501 85500 320
81001 86000 320
81501 86500 320
82001 87000 320
82501 87500 333
83001 88000 333
83501 88500 333
84001 89000 333
84501 89500 333
85001 90000 333
85501 90500 333
86001 91000 333
86501 91500 333
87001 92000 333
87501 92500 333
88001 93000 333
88501 93500 333
89001 94000 333
89501 94500 333
90001 95000 333
90501 95500 333
91001 96000 333
91501 96500 328
92001 97000 328
92501 97500 328
93001 98000 328
93501 98500 328
94001 99000 328
94501 99500 328
95001 100000 328
95501 100500 341
96001 101000 341
96501 101500 341
97001 102000 341
97501 102500 341
98001 103000 341
98501 103500 341
103501 999999 525
1 999999 525
999999 1 525
555 555 31
