1 10 20
100 200 125
201 210 89
900 1000 174
1 1 1
250 750 171
750 250 171
1000 1001 143
1001 1000 143
2001 3000 217
3000 2001 217
1500 2500 209
2500 1500 209
250000 750000 509
999999 999999 259
999999 1 525
1 999999 525
987347 551412 525
698179 584960 509
919022 518860 525
99393 959251 525
765789 511470 509
295583 519464 470
754520 535436 509
916621 638180 525
500082 323741 449
598570 16652 470
243092 358908 441
551128 998949 525
420355 369024 449
367805 126916 443
340089 247485 407
163135 876638 525
26137 524401 470
688161 807441 504
768816 797239 468
208303 15324 383
115462 427418 449
398997 31944 443
188985 414637 449
893958 150200 525
252565 468975 449
235016 460833 449
857620 339782 525
10678 983139 525
386973 455385 449
354129 822396 509
938915 958002 507
537889 581891 452
351966 736957 509
797900 12377 509
245155 984194 525
51502 342981 443
478369 915357 525
31858 252531 443
443563 22840 449
655982 947838 525
666034 726272 504
721569 934215 525
746446 252545 509
559960 749956 509
561543 377697 470
36686 649629 509
246114 49509 443
618315 802368 509
665635 762034 504
952308 43020 525
609958 866913 525
714141 124511 509
670695 741518 504
31390 377869 443
752519 848541 525
334557 622243 470
914885 196142 525
712972 286465 509
964161 248973 525
381531 806592 509
226861 365143 443
151465 302239 443
384374 389406 436
214042 139464 383
262183 463859 449
120256 958658 525
273474 132319 443
325269 138069 443
763534 753090 424
95277 534775 470
519927 690916 509
488736 960035 525
482068 475174 413
290109 268451 407
229619 71717 386
756596 106944 509
678992 158593 509
830491 819982 450
845813 569008 525
289984 242966 407
236998 83795 443
574082 611227 434
873208 574466 525
807515 611832 509
530769 645811 509
877855 448685 525
877214 664143 525
298907 280196 389
813683 362313 509
24597 692582 509
12518 734996 509
450701 993356 525
373013 732772 509
810290 599064 509
422034 915319 525
469391 118614 449
956508 426351 525
596090 785618 509
559394 41734 470
618382 411774 470
