{
  "contracts": {
    "Etherless": {
      "address": "0x0f63a3784204F4FB148Af6e87765C0A5576A478b",
      "constructorCode": "608060405234801561001057600080fd5b50612271806100206000396000f3fe",
      "bodyBytecodeHash": "b8b32dee1ea612afe3ad63ad933ae2dcec3e56414ac1d9edc8b6576dffa41634",
      "localBytecodeHash": "164fdc7723a1c8e623191a238fd00e8e34610346f4a6d23f9c0bce0029440b1d",
      "deployedBytecodeHash": "164fdc7723a1c8e623191a238fd00e8e34610346f4a6d23f9c0bce0029440b1d",
      "types": {
        "t_bool": {
          "id": "t_bool",
          "kind": "elementary",
          "label": "bool"
        },
        "t_uint256": {
          "id": "t_uint256",
          "kind": "elementary",
          "label": "uint256"
        },
        "t_array:50<t_uint256>": {
          "id": "t_array:50<t_uint256>",
          "valueType": "t_uint256",
          "length": "50",
          "kind": "array",
          "label": "uint256[50]"
        },
        "t_address": {
          "id": "t_address",
          "kind": "elementary",
          "label": "address"
        },
        "t_mapping<t_uint256>": {
          "id": "t_mapping<t_uint256>",
          "valueType": "t_uint256",
          "label": "mapping(key => uint256)",
          "kind": "mapping"
        },
        "t_struct<Etherless.Software>": {
          "id": "t_struct<Etherless.Software>",
          "kind": "struct",
          "label": "Etherless.Software",
          "members": [
            {
              "label": "publicationTime",
              "astId": 13,
              "type": "t_uint256",
              "src": "1601:23:0"
            },
            {
              "label": "lastUpdatedTime",
              "astId": 15,
              "type": "t_uint256",
              "src": "1635:23:0"
            },
            {
              "label": "publisher",
              "astId": 17,
              "type": "t_address",
              "src": "1669:17:0"
            },
            {
              "label": "updates",
              "astId": 19,
              "type": "t_uint32",
              "src": "1697:14:0"
            },
            {
              "label": "executionPrice",
              "astId": 21,
              "type": "t_uint256",
              "src": "1722:19:0"
            }
          ]
        },
        "t_uint32": {
          "id": "t_uint32",
          "kind": "elementary",
          "label": "uint32"
        },
        "t_mapping<t_struct<Etherless.Software>>": {
          "id": "t_mapping<t_struct<Etherless.Software>>",
          "valueType": "t_struct<Etherless.Software>",
          "label": "mapping(key => Etherless.Software)",
          "kind": "mapping"
        },
        "t_mapping<t_bool>": {
          "id": "t_mapping<t_bool>",
          "valueType": "t_bool",
          "label": "mapping(key => bool)",
          "kind": "mapping"
        },
        "t_bytes32": {
          "id": "t_bytes32",
          "kind": "elementary",
          "label": "bytes32"
        }
      },
      "storage": [
        {
          "contract": "Initializable",
          "path": "contracts/includes/Initializable.sol",
          "label": "initialized",
          "astId": 417,
          "type": "t_bool",
          "src": "808:24:1"
        },
        {
          "contract": "Initializable",
          "path": "contracts/includes/Initializable.sol",
          "label": "initializing",
          "astId": 419,
          "type": "t_bool",
          "src": "839:25:1"
        },
        {
          "contract": "Initializable",
          "path": "contracts/includes/Initializable.sol",
          "label": "______gap",
          "astId": 458,
          "type": "t_array:50<t_uint256>",
          "src": "1351:29:1"
        },
        {
          "contract": "Ownable",
          "path": "contracts/includes/Ownable.sol",
          "label": "owner",
          "astId": 463,
          "type": "t_address",
          "src": "95:13:2"
        },
        {
          "contract": "WalletContainer",
          "path": "contracts/includes/WalletContainer.sol",
          "label": "wallet",
          "astId": 497,
          "type": "t_mapping<t_uint256>",
          "src": "1368:39:3"
        },
        {
          "contract": "Etherless",
          "path": "contracts/Etherless.sol",
          "label": "softwares",
          "astId": 36,
          "type": "t_mapping<t_struct<Etherless.Software>>",
          "src": "2145:45:0"
        },
        {
          "contract": "Etherless",
          "path": "contracts/Etherless.sol",
          "label": "usedTokens",
          "astId": 40,
          "type": "t_mapping<t_bool>",
          "src": "2199:44:0"
        },
        {
          "contract": "Etherless",
          "path": "contracts/Etherless.sol",
          "label": "lastToken",
          "astId": 42,
          "type": "t_bytes32",
          "src": "2252:25:0"
        },
        {
          "contract": "Etherless",
          "path": "contracts/Etherless.sol",
          "label": "______gap",
          "astId": 411,
          "type": "t_array:50<t_uint256>",
          "src": "6118:29:0"
        }
      ],
      "warnings": {
        "hasConstructor": false,
        "hasSelfDestruct": false,
        "hasDelegateCall": false,
        "hasInitialValuesInDeclarations": false,
        "uninitializedBaseContracts": []
      }
    }
  },
  "solidityLibs": {},
  "proxies": {
    "etherless-smart/Etherless": [
      {
        "address": "0xb5233d6b6B4F1A1a14553f3b30f3924Bc23620aC",
        "version": "0.0.1",
        "implementation": "0x0f63a3784204F4FB148Af6e87765C0A5576A478b",
        "admin": "0x33a61DC0e46aD8F3A8E4b1a44835dF1D5D564f27",
        "kind": "Upgradeable"
      },
      {
        "address": "0x2A2E9108Da10b616436BfC3716F52146b609AA5a",
        "version": "0.0.1",
        "implementation": "0x0f63a3784204F4FB148Af6e87765C0A5576A478b",
        "admin": "0x33a61DC0e46aD8F3A8E4b1a44835dF1D5D564f27",
        "kind": "Upgradeable"
      }
    ]
  },
  "manifestVersion": "2.2",
  "version": "0.0.1",
  "proxyAdmin": {
    "address": "0x33a61DC0e46aD8F3A8E4b1a44835dF1D5D564f27"
  }
}
