<svg xmlns="http://www.w3.org/2000/svg" xmlns:xlink="http://www.w3.org/1999/xlink" width="109" height="109" viewBox="0 0 109 109">
  <defs>
    <filter id="Ellipse_4" x="0" y="0" width="109" height="109" filterUnits="userSpaceOnUse">
      <feOffset dy="2" input="SourceAlpha"/>
      <feGaussianBlur stdDeviation="1.5" result="blur"/>
      <feFlood flood-opacity="0.161"/>
      <feComposite operator="in" in2="blur"/>
      <feComposite in="SourceGraphic"/>
    </filter>
  </defs>
  <g id="Group_1201" data-name="Group 1201" transform="translate(-369.5 -123.5)">
    <g transform="matrix(1, 0, 0, 1, 369.5, 123.5)" filter="url(#Ellipse_4)">
      <circle id="Ellipse_4-2" data-name="Ellipse 4" cx="50" cy="50" r="50" transform="translate(4.5 2.5)" fill="#a3a3a3"/>
    </g>
    <path id="ic_visibility_off_24px" d="M24.228,11.447A10.562,10.562,0,0,1,34.787,22.005a10.248,10.248,0,0,1-.76,3.864l6.166,6.166a24.954,24.954,0,0,0,7.243-10.03A24.974,24.974,0,0,0,24.207,6.168a24.591,24.591,0,0,0-8.4,1.478l4.561,4.561A10.248,10.248,0,0,1,24.228,11.447ZM3.112,5.682,7.926,10.5l.971.971A24.926,24.926,0,0,0,1,22.005,24.963,24.963,0,0,0,33.478,36.069l.887.887,6.187,6.166,2.682-2.682L5.794,3ZM14.789,17.359l3.273,3.273a5.957,5.957,0,0,0-.169,1.373,6.327,6.327,0,0,0,6.335,6.335,5.957,5.957,0,0,0,1.373-.169l3.273,3.273A10.489,10.489,0,0,1,14.789,17.359Zm9.1-1.647,6.652,6.652.042-.338a6.327,6.327,0,0,0-6.335-6.335Z" transform="translate(401.033 154.148)" fill="#fff"/>
  </g>
</svg>
