{
  "files": {
    "main.css": "/static/css/main.71eea670.chunk.css",
    "main.js": "/static/js/main.86ce2c44.chunk.js",
    "main.js.map": "/static/js/main.86ce2c44.chunk.js.map",
    "runtime-main.js": "/static/js/runtime-main.ff67c1f0.js",
    "runtime-main.js.map": "/static/js/runtime-main.ff67c1f0.js.map",
    "static/css/2.4ce9e501.chunk.css": "/static/css/2.4ce9e501.chunk.css",
    "static/js/2.774f633c.chunk.js": "/static/js/2.774f633c.chunk.js",
    "static/js/2.774f633c.chunk.js.map": "/static/js/2.774f633c.chunk.js.map",
    "static/js/3.5bd27621.chunk.js": "/static/js/3.5bd27621.chunk.js",
    "static/js/3.5bd27621.chunk.js.map": "/static/js/3.5bd27621.chunk.js.map",
    "index.html": "/index.html",
    "static/css/2.4ce9e501.chunk.css.map": "/static/css/2.4ce9e501.chunk.css.map",
    "static/css/main.71eea670.chunk.css.map": "/static/css/main.71eea670.chunk.css.map",
    "static/js/2.774f633c.chunk.js.LICENSE.txt": "/static/js/2.774f633c.chunk.js.LICENSE.txt",
    "static/media/font.css": "/static/media/Rajdhani-Bold.0d5cc77a.ttf",
    "static/media/error.57c9b57a.jpg": "/static/media/error.57c9b57a.jpg",
    "static/media/logo-mini.09db4878.svg": "/static/media/logo-mini.09db4878.svg",
    "static/media/logo.27147501.svg": "/static/media/logo.27147501.svg",
    "static/media/shopping-cart.e74f61ed.png": "/static/media/shopping-cart.e74f61ed.png"
  },
  "entrypoints": [
    "static/js/runtime-main.ff67c1f0.js",
    "static/css/2.4ce9e501.chunk.css",
    "static/js/2.774f633c.chunk.js",
    "static/css/main.71eea670.chunk.css",
    "static/js/main.86ce2c44.chunk.js"
  ]
}