{
  "project_id": "1",
  "message": "",
  "traces": [
    {
      "timestamp": "2023-07-10T15:02:30.677538Z",
      "trace_id": "97e6b7b3-9579-b6e9-eb86-25f1ded2cff0",
      "service_name": "tracegen",
      "operation": "lets-go",
      "statusCode": "STATUS_CODE_UNSET",
      "spans": [
        {
          "timestamp": "2023-07-10T15:02:30.677538Z",
          "span_id": "E2CB9B54BB6FCAC1",
          "trace_id": "97e6b7b3-9579-b6e9-eb86-25f1ded2cff0",
          "service_name": "tracegen",
          "operation": "lets-go",
          "duration_nano": 147000,
          "statusCode": "STATUS_CODE_UNSET"
        },
        {
          "timestamp": "2023-07-10T15:02:30.677561Z",
          "span_id": "4B29015A902EF378",
          "trace_id": "97e6b7b3-9579-b6e9-eb86-25f1ded2cff0",
          "service_name": "tracegen",
          "operation": "okey-dokey",
          "duration_nano": 124000,
          "statusCode": "STATUS_CODE_UNSET"
        }
      ],
      "totalSpans": 2
    },
    {
      "timestamp": "2023-07-10T15:02:30.677538Z",
      "trace_id": "97e6b7b3-9579-b6e9-eb86-25f1ded2cff0",
      "service_name": "tracegen",
      "operation": "lets-go",
      "statusCode": "STATUS_CODE_UNSET",
      "spans": [
        {
          "timestamp": "2023-07-10T15:02:30.677538Z",
          "span_id": "E2CB9B54BB6FCAC1",
          "trace_id": "97e6b7b3-9579-b6e9-eb86-25f1ded2cff0",
          "service_name": "tracegen",
          "operation": "lets-go",
          "duration_nano": 147000,
          "statusCode": "STATUS_CODE_UNSET"
        },
        {
          "timestamp": "2023-07-10T15:02:30.677561Z",
          "span_id": "4B29015A902EF378",
          "trace_id": "97e6b7b3-9579-b6e9-eb86-25f1ded2cff0",
          "service_name": "tracegen",
          "operation": "okey-dokey",
          "duration_nano": 124000,
          "statusCode": "STATUS_CODE_UNSET"
        }
      ],
      "totalSpans": 2
    },
    {
      "timestamp": "2023-07-10T15:02:30.67758Z",
      "trace_id": "36f65703-d085-0674-a589-b35db23f77d5",
      "service_name": "tracegen",
      "operation": "lets-go",
      "statusCode": "STATUS_CODE_UNSET",
      "spans": [
        {
          "timestamp": "2023-07-10T15:02:30.67758Z",
          "span_id": "F0788D69026E13A1",
          "trace_id": "36f65703-d085-0674-a589-b35db23f77d5",
          "service_name": "tracegen",
          "operation": "lets-go",
          "duration_nano": 125000,
          "statusCode": "STATUS_CODE_UNSET"
        },
        {
          "timestamp": "2023-07-10T15:02:30.677581Z",
          "span_id": "14987F8F6FDD27AE",
          "trace_id": "36f65703-d085-0674-a589-b35db23f77d5",
          "service_name": "tracegen",
          "operation": "okey-dokey",
          "duration_nano": 124000,
          "statusCode": "STATUS_CODE_UNSET"
        }
      ],
      "totalSpans": 2
    },
    {
      "timestamp": "2023-07-10T15:02:30.67758Z",
      "trace_id": "36f65703-d085-0674-a589-b35db23f77d5",
      "service_name": "tracegen",
      "operation": "lets-go",
      "statusCode": "STATUS_CODE_UNSET",
      "spans": [
        {
          "timestamp": "2023-07-10T15:02:30.67758Z",
          "span_id": "F0788D69026E13A1",
          "trace_id": "36f65703-d085-0674-a589-b35db23f77d5",
          "service_name": "tracegen",
          "operation": "lets-go",
          "duration_nano": 125000,
          "statusCode": "STATUS_CODE_UNSET"
        },
        {
          "timestamp": "2023-07-10T15:02:30.677581Z",
          "span_id": "14987F8F6FDD27AE",
          "trace_id": "36f65703-d085-0674-a589-b35db23f77d5",
          "service_name": "tracegen",
          "operation": "okey-dokey",
          "duration_nano": 124000,
          "statusCode": "STATUS_CODE_UNSET"
        }
      ],
      "totalSpans": 2
    },
    {
      "timestamp": "2023-07-10T15:02:30.677583Z",
      "trace_id": "219da434-0271-581c-0bfa-1c0e31f7bc03",
      "service_name": "tracegen",
      "operation": "lets-go",
      "statusCode": "STATUS_CODE_UNSET",
      "spans": [
        {
          "timestamp": "2023-07-10T15:02:30.677583Z",
          "span_id": "F5AB66F29F53ECAF",
          "trace_id": "219da434-0271-581c-0bfa-1c0e31f7bc03",
          "service_name": "tracegen",
          "operation": "lets-go",
          "duration_nano": 124000,
          "statusCode": "STATUS_CODE_UNSET"
        },
        {
          "timestamp": "2023-07-10T15:02:30.677584Z",
          "span_id": "17D79F52E57E9C6A",
          "trace_id": "219da434-0271-581c-0bfa-1c0e31f7bc03",
          "service_name": "tracegen",
          "operation": "okey-dokey",
          "duration_nano": 123000,
          "statusCode": "STATUS_CODE_UNSET"
        }
      ],
      "totalSpans": 2
    },
    {
      "timestamp": "2023-07-10T15:02:30.677583Z",
      "trace_id": "219da434-0271-581c-0bfa-1c0e31f7bc03",
      "service_name": "tracegen",
      "operation": "lets-go",
      "statusCode": "STATUS_CODE_UNSET",
      "spans": [
        {
          "timestamp": "2023-07-10T15:02:30.677583Z",
          "span_id": "F5AB66F29F53ECAF",
          "trace_id": "219da434-0271-581c-0bfa-1c0e31f7bc03",
          "service_name": "tracegen",
          "operation": "lets-go",
          "duration_nano": 124000,
          "statusCode": "STATUS_CODE_UNSET"
        },
        {
          "timestamp": "2023-07-10T15:02:30.677584Z",
          "span_id": "17D79F52E57E9C6A",
          "trace_id": "219da434-0271-581c-0bfa-1c0e31f7bc03",
          "service_name": "tracegen",
          "operation": "okey-dokey",
          "duration_nano": 123000,
          "statusCode": "STATUS_CODE_UNSET"
        }
      ],
      "totalSpans": 2
    },
    {
      "timestamp": "2023-07-10T15:02:30.677585Z",
      "trace_id": "e899d9a8-4d54-b131-9580-e540697604b4",
      "service_name": "tracegen",
      "operation": "lets-go",
      "statusCode": "STATUS_CODE_UNSET",
      "spans": [
        {
          "timestamp": "2023-07-10T15:02:30.677585Z",
          "span_id": "468B2959252EDA28",
          "trace_id": "e899d9a8-4d54-b131-9580-e540697604b4",
          "service_name": "tracegen",
          "operation": "lets-go",
          "duration_nano": 125000,
          "statusCode": "STATUS_CODE_UNSET"
        },
        {
          "timestamp": "2023-07-10T15:02:30.677586Z",
          "span_id": "7AC8860F5CB85E0A",
          "trace_id": "e899d9a8-4d54-b131-9580-e540697604b4",
          "service_name": "tracegen",
          "operation": "okey-dokey",
          "duration_nano": 124000,
          "statusCode": "STATUS_CODE_UNSET"
        }
      ],
      "totalSpans": 2
    },
    {
      "timestamp": "2023-07-10T15:02:30.677585Z",
      "trace_id": "e899d9a8-4d54-b131-9580-e540697604b4",
      "service_name": "tracegen",
      "operation": "lets-go",
      "statusCode": "STATUS_CODE_UNSET",
      "spans": [
        {
          "timestamp": "2023-07-10T15:02:30.677585Z",
          "span_id": "468B2959252EDA28",
          "trace_id": "e899d9a8-4d54-b131-9580-e540697604b4",
          "service_name": "tracegen",
          "operation": "lets-go",
          "duration_nano": 125000,
          "statusCode": "STATUS_CODE_UNSET"
        },
        {
          "timestamp": "2023-07-10T15:02:30.677586Z",
          "span_id": "7AC8860F5CB85E0A",
          "trace_id": "e899d9a8-4d54-b131-9580-e540697604b4",
          "service_name": "tracegen",
          "operation": "okey-dokey",
          "duration_nano": 124000,
          "statusCode": "STATUS_CODE_UNSET"
        }
      ],
      "totalSpans": 2
    },
    {
      "timestamp": "2023-07-10T15:02:30.677588Z",
      "trace_id": "057228bd-3c6d-2551-b779-641d71f111c7",
      "service_name": "tracegen",
      "operation": "lets-go",
      "statusCode": "STATUS_CODE_UNSET",
      "spans": [
        {
          "timestamp": "2023-07-10T15:02:30.677588Z",
          "span_id": "3411BDD296DB9370",
          "trace_id": "057228bd-3c6d-2551-b779-641d71f111c7",
          "service_name": "tracegen",
          "operation": "lets-go",
          "duration_nano": 124000,
          "statusCode": "STATUS_CODE_UNSET"
        },
        {
          "timestamp": "2023-07-10T15:02:30.677589Z",
          "span_id": "1774F16A178B8FCB",
          "trace_id": "057228bd-3c6d-2551-b779-641d71f111c7",
          "service_name": "tracegen",
          "operation": "okey-dokey",
          "duration_nano": 123000,
          "statusCode": "STATUS_CODE_UNSET"
        }
      ],
      "totalSpans": 2
    },
    {
      "timestamp": "2023-07-10T15:02:30.677588Z",
      "trace_id": "057228bd-3c6d-2551-b779-641d71f111c7",
      "service_name": "tracegen",
      "operation": "lets-go",
      "statusCode": "STATUS_CODE_UNSET",
      "spans": [
        {
          "timestamp": "2023-07-10T15:02:30.677588Z",
          "span_id": "3411BDD296DB9370",
          "trace_id": "057228bd-3c6d-2551-b779-641d71f111c7",
          "service_name": "tracegen",
          "operation": "lets-go",
          "duration_nano": 124000,
          "statusCode": "STATUS_CODE_UNSET"
        },
        {
          "timestamp": "2023-07-10T15:02:30.677589Z",
          "span_id": "1774F16A178B8FCB",
          "trace_id": "057228bd-3c6d-2551-b779-641d71f111c7",
          "service_name": "tracegen",
          "operation": "okey-dokey",
          "duration_nano": 123000,
          "statusCode": "STATUS_CODE_UNSET"
        }
      ],
      "totalSpans": 2
    },
    {
      "timestamp": "2023-07-10T15:02:30.677613Z",
      "trace_id": "a6d8c574-d1ce-e46d-8634-e12d1251a009",
      "service_name": "tracegen",
      "operation": "lets-go",
      "statusCode": "STATUS_CODE_UNSET",
      "spans": [
        {
          "timestamp": "2023-07-10T15:02:30.677613Z",
          "span_id": "CDACF24BB78C3534",
          "trace_id": "a6d8c574-d1ce-e46d-8634-e12d1251a009",
          "service_name": "tracegen",
          "operation": "lets-go",
          "duration_nano": 125000,
          "statusCode": "STATUS_CODE_UNSET"
        },
        {
          "timestamp": "2023-07-10T15:02:30.677614Z",
          "span_id": "7B69777569B9EA84",
          "trace_id": "a6d8c574-d1ce-e46d-8634-e12d1251a009",
          "service_name": "tracegen",
          "operation": "okey-dokey",
          "duration_nano": 124000,
          "statusCode": "STATUS_CODE_UNSET"
        }
      ],
      "totalSpans": 2
    },
    {
      "timestamp": "2023-07-10T15:02:30.677613Z",
      "trace_id": "a6d8c574-d1ce-e46d-8634-e12d1251a009",
      "service_name": "tracegen",
      "operation": "lets-go",
      "statusCode": "STATUS_CODE_UNSET",
      "spans": [
        {
          "timestamp": "2023-07-10T15:02:30.677613Z",
          "span_id": "CDACF24BB78C3534",
          "trace_id": "a6d8c574-d1ce-e46d-8634-e12d1251a009",
          "service_name": "tracegen",
          "operation": "lets-go",
          "duration_nano": 125000,
          "statusCode": "STATUS_CODE_UNSET"
        },
        {
          "timestamp": "2023-07-10T15:02:30.677614Z",
          "span_id": "7B69777569B9EA84",
          "trace_id": "a6d8c574-d1ce-e46d-8634-e12d1251a009",
          "service_name": "tracegen",
          "operation": "okey-dokey",
          "duration_nano": 124000,
          "statusCode": "STATUS_CODE_UNSET"
        }
      ],
      "totalSpans": 2
    },
    {
      "timestamp": "2023-07-10T15:02:30.677616Z",
      "trace_id": "d29efaa9-f0dd-8ce8-901c-9bb076292144",
      "service_name": "tracegen",
      "operation": "lets-go",
      "statusCode": "STATUS_CODE_UNSET",
      "spans": [
        {
          "timestamp": "2023-07-10T15:02:30.677616Z",
          "span_id": "1265DF31CD5EC4E2",
          "trace_id": "d29efaa9-f0dd-8ce8-901c-9bb076292144",
          "service_name": "tracegen",
          "operation": "lets-go",
          "duration_nano": 125000,
          "statusCode": "STATUS_CODE_UNSET"
        },
        {
          "timestamp": "2023-07-10T15:02:30.677617Z",
          "span_id": "3E0260222F729537",
          "trace_id": "d29efaa9-f0dd-8ce8-901c-9bb076292144",
          "service_name": "tracegen",
          "operation": "okey-dokey",
          "duration_nano": 124000,
          "statusCode": "STATUS_CODE_UNSET"
        }
      ],
      "totalSpans": 2
    },
    {
      "timestamp": "2023-07-10T15:02:30.677616Z",
      "trace_id": "d29efaa9-f0dd-8ce8-901c-9bb076292144",
      "service_name": "tracegen",
      "operation": "lets-go",
      "statusCode": "STATUS_CODE_UNSET",
      "spans": [
        {
          "timestamp": "2023-07-10T15:02:30.677616Z",
          "span_id": "1265DF31CD5EC4E2",
          "trace_id": "d29efaa9-f0dd-8ce8-901c-9bb076292144",
          "service_name": "tracegen",
          "operation": "lets-go",
          "duration_nano": 125000,
          "statusCode": "STATUS_CODE_UNSET"
        },
        {
          "timestamp": "2023-07-10T15:02:30.677617Z",
          "span_id": "3E0260222F729537",
          "trace_id": "d29efaa9-f0dd-8ce8-901c-9bb076292144",
          "service_name": "tracegen",
          "operation": "okey-dokey",
          "duration_nano": 124000,
          "statusCode": "STATUS_CODE_UNSET"
        }
      ],
      "totalSpans": 2
    },
    {
      "timestamp": "2023-07-10T15:02:30.677619Z",
      "trace_id": "175fe57e-ce90-3e58-6e75-ffb37e6ed787",
      "service_name": "tracegen",
      "operation": "lets-go",
      "statusCode": "STATUS_CODE_UNSET",
      "spans": [
        {
          "timestamp": "2023-07-10T15:02:30.677619Z",
          "span_id": "3A06AC7ABCA9D043",
          "trace_id": "175fe57e-ce90-3e58-6e75-ffb37e6ed787",
          "service_name": "tracegen",
          "operation": "lets-go",
          "duration_nano": 124000,
          "statusCode": "STATUS_CODE_UNSET"
        },
        {
          "timestamp": "2023-07-10T15:02:30.677619Z",
          "span_id": "9C99F917736586E1",
          "trace_id": "175fe57e-ce90-3e58-6e75-ffb37e6ed787",
          "service_name": "tracegen",
          "operation": "okey-dokey",
          "duration_nano": 124000,
          "statusCode": "STATUS_CODE_UNSET"
        }
      ],
      "totalSpans": 2
    },
    {
      "timestamp": "2023-07-10T15:02:30.677619Z",
      "trace_id": "175fe57e-ce90-3e58-6e75-ffb37e6ed787",
      "service_name": "tracegen",
      "operation": "lets-go",
      "statusCode": "STATUS_CODE_UNSET",
      "spans": [
        {
          "timestamp": "2023-07-10T15:02:30.677619Z",
          "span_id": "3A06AC7ABCA9D043",
          "trace_id": "175fe57e-ce90-3e58-6e75-ffb37e6ed787",
          "service_name": "tracegen",
          "operation": "lets-go",
          "duration_nano": 124000,
          "statusCode": "STATUS_CODE_UNSET"
        },
        {
          "timestamp": "2023-07-10T15:02:30.677619Z",
          "span_id": "9C99F917736586E1",
          "trace_id": "175fe57e-ce90-3e58-6e75-ffb37e6ed787",
          "service_name": "tracegen",
          "operation": "okey-dokey",
          "duration_nano": 124000,
          "statusCode": "STATUS_CODE_UNSET"
        }
      ],
      "totalSpans": 2
    },
    {
      "timestamp": "2023-07-10T15:02:30.677621Z",
      "trace_id": "5bda0cda-5c5d-ccc6-7266-5e438572bccf",
      "service_name": "tracegen",
      "operation": "lets-go",
      "statusCode": "STATUS_CODE_UNSET",
      "spans": [
        {
          "timestamp": "2023-07-10T15:02:30.677621Z",
          "span_id": "B2417463C771A704",
          "trace_id": "5bda0cda-5c5d-ccc6-7266-5e438572bccf",
          "service_name": "tracegen",
          "operation": "lets-go",
          "duration_nano": 124000,
          "statusCode": "STATUS_CODE_UNSET"
        },
        {
          "timestamp": "2023-07-10T15:02:30.677622Z",
          "span_id": "897DD866880697F0",
          "trace_id": "5bda0cda-5c5d-ccc6-7266-5e438572bccf",
          "service_name": "tracegen",
          "operation": "okey-dokey",
          "duration_nano": 123000,
          "statusCode": "STATUS_CODE_UNSET"
        }
      ],
      "totalSpans": 2
    },
    {
      "timestamp": "2023-07-10T15:02:30.677621Z",
      "trace_id": "5bda0cda-5c5d-ccc6-7266-5e438572bccf",
      "service_name": "tracegen",
      "operation": "lets-go",
      "statusCode": "STATUS_CODE_UNSET",
      "spans": [
        {
          "timestamp": "2023-07-10T15:02:30.677621Z",
          "span_id": "B2417463C771A704",
          "trace_id": "5bda0cda-5c5d-ccc6-7266-5e438572bccf",
          "service_name": "tracegen",
          "operation": "lets-go",
          "duration_nano": 124000,
          "statusCode": "STATUS_CODE_UNSET"
        },
        {
          "timestamp": "2023-07-10T15:02:30.677622Z",
          "span_id": "897DD866880697F0",
          "trace_id": "5bda0cda-5c5d-ccc6-7266-5e438572bccf",
          "service_name": "tracegen",
          "operation": "okey-dokey",
          "duration_nano": 123000,
          "statusCode": "STATUS_CODE_UNSET"
        }
      ],
      "totalSpans": 2
    },
    {
      "timestamp": "2023-07-10T15:02:30.677637Z",
      "trace_id": "1b00f009-80fb-4389-5629-0e6326838a87",
      "service_name": "tracegen",
      "operation": "lets-go",
      "statusCode": "STATUS_CODE_UNSET",
      "spans": [
        {
          "timestamp": "2023-07-10T15:02:30.677637Z",
          "span_id": "AB982E41826E4CB4",
          "trace_id": "1b00f009-80fb-4389-5629-0e6326838a87",
          "service_name": "tracegen",
          "operation": "lets-go",
          "duration_nano": 124000,
          "statusCode": "STATUS_CODE_UNSET"
        },
        {
          "timestamp": "2023-07-10T15:02:30.677638Z",
          "span_id": "8577639018E3ACE2",
          "trace_id": "1b00f009-80fb-4389-5629-0e6326838a87",
          "service_name": "tracegen",
          "operation": "okey-dokey",
          "duration_nano": 123000,
          "statusCode": "STATUS_CODE_UNSET"
        }
      ],
      "totalSpans": 2
    },
    {
      "timestamp": "2023-07-10T15:02:30.677637Z",
      "trace_id": "1b00f009-80fb-4389-5629-0e6326838a87",
      "service_name": "tracegen",
      "operation": "lets-go",
      "statusCode": "STATUS_CODE_UNSET",
      "spans": [
        {
          "timestamp": "2023-07-10T15:02:30.677637Z",
          "span_id": "AB982E41826E4CB4",
          "trace_id": "1b00f009-80fb-4389-5629-0e6326838a87",
          "service_name": "tracegen",
          "operation": "lets-go",
          "duration_nano": 124000,
          "statusCode": "STATUS_CODE_UNSET"
        },
        {
          "timestamp": "2023-07-10T15:02:30.677638Z",
          "span_id": "8577639018E3ACE2",
          "trace_id": "1b00f009-80fb-4389-5629-0e6326838a87",
          "service_name": "tracegen",
          "operation": "okey-dokey",
          "duration_nano": 123000,
          "statusCode": "STATUS_CODE_UNSET"
        }
      ],
      "totalSpans": 2
    },
    {
      "timestamp": "2023-07-10T15:02:30.677651Z",
      "trace_id": "effe5f7a-b902-eb19-cccf-9ac4a0aea683",
      "service_name": "tracegen",
      "operation": "lets-go",
      "statusCode": "STATUS_CODE_UNSET",
      "spans": [
        {
          "timestamp": "2023-07-10T15:02:30.677651Z",
          "span_id": "E4D0C62B763FC25C",
          "trace_id": "effe5f7a-b902-eb19-cccf-9ac4a0aea683",
          "service_name": "tracegen",
          "operation": "lets-go",
          "duration_nano": 125000,
          "statusCode": "STATUS_CODE_UNSET"
        },
        {
          "timestamp": "2023-07-10T15:02:30.677653Z",
          "span_id": "C059EDEE59610CB1",
          "trace_id": "effe5f7a-b902-eb19-cccf-9ac4a0aea683",
          "service_name": "tracegen",
          "operation": "okey-dokey",
          "duration_nano": 123000,
          "statusCode": "STATUS_CODE_UNSET"
        }
      ],
      "totalSpans": 2
    },
    {
      "timestamp": "2023-07-10T15:02:30.677651Z",
      "trace_id": "effe5f7a-b902-eb19-cccf-9ac4a0aea683",
      "service_name": "tracegen",
      "operation": "lets-go",
      "statusCode": "STATUS_CODE_UNSET",
      "spans": [
        {
          "timestamp": "2023-07-10T15:02:30.677651Z",
          "span_id": "E4D0C62B763FC25C",
          "trace_id": "effe5f7a-b902-eb19-cccf-9ac4a0aea683",
          "service_name": "tracegen",
          "operation": "lets-go",
          "duration_nano": 125000,
          "statusCode": "STATUS_CODE_UNSET"
        },
        {
          "timestamp": "2023-07-10T15:02:30.677653Z",
          "span_id": "C059EDEE59610CB1",
          "trace_id": "effe5f7a-b902-eb19-cccf-9ac4a0aea683",
          "service_name": "tracegen",
          "operation": "okey-dokey",
          "duration_nano": 123000,
          "statusCode": "STATUS_CODE_UNSET"
        }
      ],
      "totalSpans": 2
    },
    {
      "timestamp": "2023-07-10T15:02:30.677654Z",
      "trace_id": "9532c21e-1e43-14b3-d5e9-239256361eb4",
      "service_name": "tracegen",
      "operation": "lets-go",
      "statusCode": "STATUS_CODE_UNSET",
      "spans": [
        {
          "timestamp": "2023-07-10T15:02:30.677654Z",
          "span_id": "EF63FD474F6898CE",
          "trace_id": "9532c21e-1e43-14b3-d5e9-239256361eb4",
          "service_name": "tracegen",
          "operation": "lets-go",
          "duration_nano": 125000,
          "statusCode": "STATUS_CODE_UNSET"
        },
        {
          "timestamp": "2023-07-10T15:02:30.677655Z",
          "span_id": "694494E5AA2A2763",
          "trace_id": "9532c21e-1e43-14b3-d5e9-239256361eb4",
          "service_name": "tracegen",
          "operation": "okey-dokey",
          "duration_nano": 124000,
          "statusCode": "STATUS_CODE_UNSET"
        }
      ],
      "totalSpans": 2
    },
    {
      "timestamp": "2023-07-10T15:02:30.677654Z",
      "trace_id": "9532c21e-1e43-14b3-d5e9-239256361eb4",
      "service_name": "tracegen",
      "operation": "lets-go",
      "statusCode": "STATUS_CODE_UNSET",
      "spans": [
        {
          "timestamp": "2023-07-10T15:02:30.677654Z",
          "span_id": "EF63FD474F6898CE",
          "trace_id": "9532c21e-1e43-14b3-d5e9-239256361eb4",
          "service_name": "tracegen",
          "operation": "lets-go",
          "duration_nano": 125000,
          "statusCode": "STATUS_CODE_UNSET"
        },
        {
          "timestamp": "2023-07-10T15:02:30.677655Z",
          "span_id": "694494E5AA2A2763",
          "trace_id": "9532c21e-1e43-14b3-d5e9-239256361eb4",
          "service_name": "tracegen",
          "operation": "okey-dokey",
          "duration_nano": 124000,
          "statusCode": "STATUS_CODE_UNSET"
        }
      ],
      "totalSpans": 2
    },
    {
      "timestamp": "2023-07-10T15:02:30.677657Z",
      "trace_id": "311ab221-6e09-0ec6-e8f4-5bd1a50110f1",
      "service_name": "tracegen",
      "operation": "okey-dokey",
      "statusCode": "STATUS_CODE_UNSET",
      "spans": [
        {
          "timestamp": "2023-07-10T15:02:30.677657Z",
          "span_id": "A7C41B19AC60C808",
          "trace_id": "311ab221-6e09-0ec6-e8f4-5bd1a50110f1",
          "service_name": "tracegen",
          "operation": "okey-dokey",
          "duration_nano": 124000,
          "statusCode": "STATUS_CODE_UNSET"
        },
        {
          "timestamp": "2023-07-10T15:02:30.677657Z",
          "span_id": "57A5EDD6AF5CEB5B",
          "trace_id": "311ab221-6e09-0ec6-e8f4-5bd1a50110f1",
          "service_name": "tracegen",
          "operation": "lets-go",
          "duration_nano": 124000,
          "statusCode": "STATUS_CODE_UNSET"
        }
      ],
      "totalSpans": 2
    },
    {
      "timestamp": "2023-07-10T15:02:30.677657Z",
      "trace_id": "311ab221-6e09-0ec6-e8f4-5bd1a50110f1",
      "service_name": "tracegen",
      "operation": "okey-dokey",
      "statusCode": "STATUS_CODE_UNSET",
      "spans": [
        {
          "timestamp": "2023-07-10T15:02:30.677657Z",
          "span_id": "A7C41B19AC60C808",
          "trace_id": "311ab221-6e09-0ec6-e8f4-5bd1a50110f1",
          "service_name": "tracegen",
          "operation": "okey-dokey",
          "duration_nano": 124000,
          "statusCode": "STATUS_CODE_UNSET"
        },
        {
          "timestamp": "2023-07-10T15:02:30.677657Z",
          "span_id": "57A5EDD6AF5CEB5B",
          "trace_id": "311ab221-6e09-0ec6-e8f4-5bd1a50110f1",
          "service_name": "tracegen",
          "operation": "lets-go",
          "duration_nano": 124000,
          "statusCode": "STATUS_CODE_UNSET"
        }
      ],
      "totalSpans": 2
    },
    {
      "timestamp": "2023-07-10T15:02:30.677659Z",
      "trace_id": "d32d61e6-a3c7-ac62-3a54-37b4f82255e4",
      "service_name": "tracegen",
      "operation": "lets-go",
      "statusCode": "STATUS_CODE_UNSET",
      "spans": [
        {
          "timestamp": "2023-07-10T15:02:30.677659Z",
          "span_id": "EA174F950C4D04D8",
          "trace_id": "d32d61e6-a3c7-ac62-3a54-37b4f82255e4",
          "service_name": "tracegen",
          "operation": "lets-go",
          "duration_nano": 124000,
          "statusCode": "STATUS_CODE_UNSET"
        },
        {
          "timestamp": "2023-07-10T15:02:30.67766Z",
          "span_id": "BA21BB5236E2EF8E",
          "trace_id": "d32d61e6-a3c7-ac62-3a54-37b4f82255e4",
          "service_name": "tracegen",
          "operation": "okey-dokey",
          "duration_nano": 123000,
          "statusCode": "STATUS_CODE_UNSET"
        }
      ],
      "totalSpans": 2
    },
    {
      "timestamp": "2023-07-10T15:02:30.677659Z",
      "trace_id": "d32d61e6-a3c7-ac62-3a54-37b4f82255e4",
      "service_name": "tracegen",
      "operation": "lets-go",
      "statusCode": "STATUS_CODE_UNSET",
      "spans": [
        {
          "timestamp": "2023-07-10T15:02:30.677659Z",
          "span_id": "EA174F950C4D04D8",
          "trace_id": "d32d61e6-a3c7-ac62-3a54-37b4f82255e4",
          "service_name": "tracegen",
          "operation": "lets-go",
          "duration_nano": 124000,
          "statusCode": "STATUS_CODE_UNSET"
        },
        {
          "timestamp": "2023-07-10T15:02:30.67766Z",
          "span_id": "BA21BB5236E2EF8E",
          "trace_id": "d32d61e6-a3c7-ac62-3a54-37b4f82255e4",
          "service_name": "tracegen",
          "operation": "okey-dokey",
          "duration_nano": 123000,
          "statusCode": "STATUS_CODE_UNSET"
        }
      ],
      "totalSpans": 2
    },
    {
      "timestamp": "2023-07-10T15:02:30.677661Z",
      "trace_id": "43690e3b-acbd-512d-5a4a-a5b2db28e84c",
      "service_name": "tracegen",
      "operation": "lets-go",
      "statusCode": "STATUS_CODE_UNSET",
      "spans": [
        {
          "timestamp": "2023-07-10T15:02:30.677661Z",
          "span_id": "BF7E718C91691CBE",
          "trace_id": "43690e3b-acbd-512d-5a4a-a5b2db28e84c",
          "service_name": "tracegen",
          "operation": "lets-go",
          "duration_nano": 129000,
          "statusCode": "STATUS_CODE_UNSET"
        },
        {
          "timestamp": "2023-07-10T15:02:30.677666Z",
          "span_id": "50F782517AF36EA8",
          "trace_id": "43690e3b-acbd-512d-5a4a-a5b2db28e84c",
          "service_name": "tracegen",
          "operation": "okey-dokey",
          "duration_nano": 124000,
          "statusCode": "STATUS_CODE_UNSET"
        }
      ],
      "totalSpans": 2
    },
    {
      "timestamp": "2023-07-10T15:02:30.677661Z",
      "trace_id": "43690e3b-acbd-512d-5a4a-a5b2db28e84c",
      "service_name": "tracegen",
      "operation": "lets-go",
      "statusCode": "STATUS_CODE_UNSET",
      "spans": [
        {
          "timestamp": "2023-07-10T15:02:30.677661Z",
          "span_id": "BF7E718C91691CBE",
          "trace_id": "43690e3b-acbd-512d-5a4a-a5b2db28e84c",
          "service_name": "tracegen",
          "operation": "lets-go",
          "duration_nano": 129000,
          "statusCode": "STATUS_CODE_UNSET"
        },
        {
          "timestamp": "2023-07-10T15:02:30.677666Z",
          "span_id": "50F782517AF36EA8",
          "trace_id": "43690e3b-acbd-512d-5a4a-a5b2db28e84c",
          "service_name": "tracegen",
          "operation": "okey-dokey",
          "duration_nano": 124000,
          "statusCode": "STATUS_CODE_UNSET"
        }
      ],
      "totalSpans": 2
    },
    {
      "timestamp": "2023-07-10T15:02:30.677668Z",
      "trace_id": "36764123-3cff-bc0e-70a5-8b781294556f",
      "service_name": "tracegen",
      "operation": "lets-go",
      "statusCode": "STATUS_CODE_UNSET",
      "spans": [
        {
          "timestamp": "2023-07-10T15:02:30.677668Z",
          "span_id": "3B5B0841228A565D",
          "trace_id": "36764123-3cff-bc0e-70a5-8b781294556f",
          "service_name": "tracegen",
          "operation": "lets-go",
          "duration_nano": 131000,
          "statusCode": "STATUS_CODE_UNSET"
        },
        {
          "timestamp": "2023-07-10T15:02:30.677669Z",
          "span_id": "62ADBDBA30734B48",
          "trace_id": "36764123-3cff-bc0e-70a5-8b781294556f",
          "service_name": "tracegen",
          "operation": "okey-dokey",
          "duration_nano": 130000,
          "statusCode": "STATUS_CODE_UNSET"
        }
      ],
      "totalSpans": 2
    },
    {
      "timestamp": "2023-07-10T15:02:30.677668Z",
      "trace_id": "36764123-3cff-bc0e-70a5-8b781294556f",
      "service_name": "tracegen",
      "operation": "lets-go",
      "statusCode": "STATUS_CODE_UNSET",
      "spans": [
        {
          "timestamp": "2023-07-10T15:02:30.677668Z",
          "span_id": "3B5B0841228A565D",
          "trace_id": "36764123-3cff-bc0e-70a5-8b781294556f",
          "service_name": "tracegen",
          "operation": "lets-go",
          "duration_nano": 131000,
          "statusCode": "STATUS_CODE_UNSET"
        },
        {
          "timestamp": "2023-07-10T15:02:30.677669Z",
          "span_id": "62ADBDBA30734B48",
          "trace_id": "36764123-3cff-bc0e-70a5-8b781294556f",
          "service_name": "tracegen",
          "operation": "okey-dokey",
          "duration_nano": 130000,
          "statusCode": "STATUS_CODE_UNSET"
        }
      ],
      "totalSpans": 2
    },
    {
      "timestamp": "2023-07-10T15:02:30.677685Z",
      "trace_id": "c891efc0-b266-cb02-4b8e-1085df4ac0c1",
      "service_name": "tracegen",
      "operation": "lets-go",
      "statusCode": "STATUS_CODE_UNSET",
      "spans": [
        {
          "timestamp": "2023-07-10T15:02:30.677685Z",
          "span_id": "8A9D888CF37A3F57",
          "trace_id": "c891efc0-b266-cb02-4b8e-1085df4ac0c1",
          "service_name": "tracegen",
          "operation": "lets-go",
          "duration_nano": 125000,
          "statusCode": "STATUS_CODE_UNSET"
        },
        {
          "timestamp": "2023-07-10T15:02:30.677686Z",
          "span_id": "388636C7D201F9FB",
          "trace_id": "c891efc0-b266-cb02-4b8e-1085df4ac0c1",
          "service_name": "tracegen",
          "operation": "okey-dokey",
          "duration_nano": 124000,
          "statusCode": "STATUS_CODE_UNSET"
        }
      ],
      "totalSpans": 2
    },
    {
      "timestamp": "2023-07-10T15:02:30.677685Z",
      "trace_id": "c891efc0-b266-cb02-4b8e-1085df4ac0c1",
      "service_name": "tracegen",
      "operation": "lets-go",
      "statusCode": "STATUS_CODE_UNSET",
      "spans": [
        {
          "timestamp": "2023-07-10T15:02:30.677685Z",
          "span_id": "8A9D888CF37A3F57",
          "trace_id": "c891efc0-b266-cb02-4b8e-1085df4ac0c1",
          "service_name": "tracegen",
          "operation": "lets-go",
          "duration_nano": 125000,
          "statusCode": "STATUS_CODE_UNSET"
        },
        {
          "timestamp": "2023-07-10T15:02:30.677686Z",
          "span_id": "388636C7D201F9FB",
          "trace_id": "c891efc0-b266-cb02-4b8e-1085df4ac0c1",
          "service_name": "tracegen",
          "operation": "okey-dokey",
          "duration_nano": 124000,
          "statusCode": "STATUS_CODE_UNSET"
        }
      ],
      "totalSpans": 2
    },
    {
      "timestamp": "2023-07-10T15:02:30.677688Z",
      "trace_id": "e78889ea-f202-5c87-e64b-f6db159d9632",
      "service_name": "tracegen",
      "operation": "lets-go",
      "statusCode": "STATUS_CODE_UNSET",
      "spans": [
        {
          "timestamp": "2023-07-10T15:02:30.677688Z",
          "span_id": "9E84A870338BBACA",
          "trace_id": "e78889ea-f202-5c87-e64b-f6db159d9632",
          "service_name": "tracegen",
          "operation": "lets-go",
          "duration_nano": 128000,
          "statusCode": "STATUS_CODE_UNSET"
        },
        {
          "timestamp": "2023-07-10T15:02:30.677693Z",
          "span_id": "FC1665CC8A7536B6",
          "trace_id": "e78889ea-f202-5c87-e64b-f6db159d9632",
          "service_name": "tracegen",
          "operation": "okey-dokey",
          "duration_nano": 123000,
          "statusCode": "STATUS_CODE_UNSET"
        }
      ],
      "totalSpans": 2
    },
    {
      "timestamp": "2023-07-10T15:02:30.677688Z",
      "trace_id": "e78889ea-f202-5c87-e64b-f6db159d9632",
      "service_name": "tracegen",
      "operation": "lets-go",
      "statusCode": "STATUS_CODE_UNSET",
      "spans": [
        {
          "timestamp": "2023-07-10T15:02:30.677688Z",
          "span_id": "9E84A870338BBACA",
          "trace_id": "e78889ea-f202-5c87-e64b-f6db159d9632",
          "service_name": "tracegen",
          "operation": "lets-go",
          "duration_nano": 128000,
          "statusCode": "STATUS_CODE_UNSET"
        },
        {
          "timestamp": "2023-07-10T15:02:30.677693Z",
          "span_id": "FC1665CC8A7536B6",
          "trace_id": "e78889ea-f202-5c87-e64b-f6db159d9632",
          "service_name": "tracegen",
          "operation": "okey-dokey",
          "duration_nano": 123000,
          "statusCode": "STATUS_CODE_UNSET"
        }
      ],
      "totalSpans": 2
    },
    {
      "timestamp": "2023-07-10T15:02:30.677695Z",
      "trace_id": "5154401c-5126-856b-9474-29efb69b8588",
      "service_name": "tracegen",
      "operation": "okey-dokey",
      "statusCode": "STATUS_CODE_UNSET",
      "spans": [
        {
          "timestamp": "2023-07-10T15:02:30.677695Z",
          "span_id": "1B5140A527AC99F8",
          "trace_id": "5154401c-5126-856b-9474-29efb69b8588",
          "service_name": "tracegen",
          "operation": "okey-dokey",
          "duration_nano": 124000,
          "statusCode": "STATUS_CODE_UNSET"
        },
        {
          "timestamp": "2023-07-10T15:02:30.677695Z",
          "span_id": "6C328C8E60FBB3A8",
          "trace_id": "5154401c-5126-856b-9474-29efb69b8588",
          "service_name": "tracegen",
          "operation": "lets-go",
          "duration_nano": 124000,
          "statusCode": "STATUS_CODE_UNSET"
        }
      ],
      "totalSpans": 2
    },
    {
      "timestamp": "2023-07-10T15:02:30.677695Z",
      "trace_id": "5154401c-5126-856b-9474-29efb69b8588",
      "service_name": "tracegen",
      "operation": "okey-dokey",
      "statusCode": "STATUS_CODE_UNSET",
      "spans": [
        {
          "timestamp": "2023-07-10T15:02:30.677695Z",
          "span_id": "1B5140A527AC99F8",
          "trace_id": "5154401c-5126-856b-9474-29efb69b8588",
          "service_name": "tracegen",
          "operation": "okey-dokey",
          "duration_nano": 124000,
          "statusCode": "STATUS_CODE_UNSET"
        },
        {
          "timestamp": "2023-07-10T15:02:30.677695Z",
          "span_id": "6C328C8E60FBB3A8",
          "trace_id": "5154401c-5126-856b-9474-29efb69b8588",
          "service_name": "tracegen",
          "operation": "lets-go",
          "duration_nano": 124000,
          "statusCode": "STATUS_CODE_UNSET"
        }
      ],
      "totalSpans": 2
    },
    {
      "timestamp": "2023-07-10T15:02:30.677697Z",
      "trace_id": "fe2fab22-75c3-afa2-6046-2c90b1cd6224",
      "service_name": "tracegen",
      "operation": "lets-go",
      "statusCode": "STATUS_CODE_UNSET",
      "spans": [
        {
          "timestamp": "2023-07-10T15:02:30.677697Z",
          "span_id": "BC05CC86EF04A641",
          "trace_id": "fe2fab22-75c3-afa2-6046-2c90b1cd6224",
          "service_name": "tracegen",
          "operation": "lets-go",
          "duration_nano": 129000,
          "statusCode": "STATUS_CODE_UNSET"
        },
        {
          "timestamp": "2023-07-10T15:02:30.677703Z",
          "span_id": "3DAF5282D4311F57",
          "trace_id": "fe2fab22-75c3-afa2-6046-2c90b1cd6224",
          "service_name": "tracegen",
          "operation": "okey-dokey",
          "duration_nano": 123000,
          "statusCode": "STATUS_CODE_UNSET"
        }
      ],
      "totalSpans": 2
    },
    {
      "timestamp": "2023-07-10T15:02:30.677697Z",
      "trace_id": "fe2fab22-75c3-afa2-6046-2c90b1cd6224",
      "service_name": "tracegen",
      "operation": "lets-go",
      "statusCode": "STATUS_CODE_UNSET",
      "spans": [
        {
          "timestamp": "2023-07-10T15:02:30.677697Z",
          "span_id": "BC05CC86EF04A641",
          "trace_id": "fe2fab22-75c3-afa2-6046-2c90b1cd6224",
          "service_name": "tracegen",
          "operation": "lets-go",
          "duration_nano": 129000,
          "statusCode": "STATUS_CODE_UNSET"
        },
        {
          "timestamp": "2023-07-10T15:02:30.677703Z",
          "span_id": "3DAF5282D4311F57",
          "trace_id": "fe2fab22-75c3-afa2-6046-2c90b1cd6224",
          "service_name": "tracegen",
          "operation": "okey-dokey",
          "duration_nano": 123000,
          "statusCode": "STATUS_CODE_UNSET"
        }
      ],
      "totalSpans": 2
    },
    {
      "timestamp": "2023-07-10T15:02:30.677707Z",
      "trace_id": "1899b1d8-7f12-e38e-7e7f-e39189ae7c7e",
      "service_name": "tracegen",
      "operation": "lets-go",
      "statusCode": "STATUS_CODE_UNSET",
      "spans": [
        {
          "timestamp": "2023-07-10T15:02:30.677707Z",
          "span_id": "AEAF8AC47E800113",
          "trace_id": "1899b1d8-7f12-e38e-7e7f-e39189ae7c7e",
          "service_name": "tracegen",
          "operation": "lets-go",
          "duration_nano": 124000,
          "statusCode": "STATUS_CODE_UNSET"
        },
        {
          "timestamp": "2023-07-10T15:02:30.677708Z",
          "span_id": "D6314BCF73DC741F",
          "trace_id": "1899b1d8-7f12-e38e-7e7f-e39189ae7c7e",
          "service_name": "tracegen",
          "operation": "okey-dokey",
          "duration_nano": 123000,
          "statusCode": "STATUS_CODE_UNSET"
        }
      ],
      "totalSpans": 2
    },
    {
      "timestamp": "2023-07-10T15:02:30.677707Z",
      "trace_id": "1899b1d8-7f12-e38e-7e7f-e39189ae7c7e",
      "service_name": "tracegen",
      "operation": "lets-go",
      "statusCode": "STATUS_CODE_UNSET",
      "spans": [
        {
          "timestamp": "2023-07-10T15:02:30.677707Z",
          "span_id": "AEAF8AC47E800113",
          "trace_id": "1899b1d8-7f12-e38e-7e7f-e39189ae7c7e",
          "service_name": "tracegen",
          "operation": "lets-go",
          "duration_nano": 124000,
          "statusCode": "STATUS_CODE_UNSET"
        },
        {
          "timestamp": "2023-07-10T15:02:30.677708Z",
          "span_id": "D6314BCF73DC741F",
          "trace_id": "1899b1d8-7f12-e38e-7e7f-e39189ae7c7e",
          "service_name": "tracegen",
          "operation": "okey-dokey",
          "duration_nano": 123000,
          "statusCode": "STATUS_CODE_UNSET"
        }
      ],
      "totalSpans": 2
    },
    {
      "timestamp": "2023-07-10T15:02:30.677718Z",
      "trace_id": "e5655518-6f37-8226-0161-f8cb85eb4ba4",
      "service_name": "tracegen",
      "operation": "lets-go",
      "statusCode": "STATUS_CODE_UNSET",
      "spans": [
        {
          "timestamp": "2023-07-10T15:02:30.677718Z",
          "span_id": "D0BEDA55261815BE",
          "trace_id": "e5655518-6f37-8226-0161-f8cb85eb4ba4",
          "service_name": "tracegen",
          "operation": "lets-go",
          "duration_nano": 124000,
          "statusCode": "STATUS_CODE_UNSET"
        },
        {
          "timestamp": "2023-07-10T15:02:30.677719Z",
          "span_id": "E1FA20547B7056ED",
          "trace_id": "e5655518-6f37-8226-0161-f8cb85eb4ba4",
          "service_name": "tracegen",
          "operation": "okey-dokey",
          "duration_nano": 123000,
          "statusCode": "STATUS_CODE_UNSET"
        }
      ],
      "totalSpans": 2
    },
    {
      "timestamp": "2023-07-10T15:02:30.677718Z",
      "trace_id": "e5655518-6f37-8226-0161-f8cb85eb4ba4",
      "service_name": "tracegen",
      "operation": "lets-go",
      "statusCode": "STATUS_CODE_UNSET",
      "spans": [
        {
          "timestamp": "2023-07-10T15:02:30.677718Z",
          "span_id": "D0BEDA55261815BE",
          "trace_id": "e5655518-6f37-8226-0161-f8cb85eb4ba4",
          "service_name": "tracegen",
          "operation": "lets-go",
          "duration_nano": 124000,
          "statusCode": "STATUS_CODE_UNSET"
        },
        {
          "timestamp": "2023-07-10T15:02:30.677719Z",
          "span_id": "E1FA20547B7056ED",
          "trace_id": "e5655518-6f37-8226-0161-f8cb85eb4ba4",
          "service_name": "tracegen",
          "operation": "okey-dokey",
          "duration_nano": 123000,
          "statusCode": "STATUS_CODE_UNSET"
        }
      ],
      "totalSpans": 2
    },
    {
      "timestamp": "2023-07-10T15:02:30.677721Z",
      "trace_id": "b0717d3c-d555-e6fa-1e4d-1aca7c889c25",
      "service_name": "tracegen",
      "operation": "okey-dokey",
      "statusCode": "STATUS_CODE_UNSET",
      "spans": [
        {
          "timestamp": "2023-07-10T15:02:30.677721Z",
          "span_id": "B171E7315A8B7FD1",
          "trace_id": "b0717d3c-d555-e6fa-1e4d-1aca7c889c25",
          "service_name": "tracegen",
          "operation": "okey-dokey",
          "duration_nano": 124000,
          "statusCode": "STATUS_CODE_UNSET"
        },
        {
          "timestamp": "2023-07-10T15:02:30.677721Z",
          "span_id": "CD8D690AC2924C06",
          "trace_id": "b0717d3c-d555-e6fa-1e4d-1aca7c889c25",
          "service_name": "tracegen",
          "operation": "lets-go",
          "duration_nano": 124000,
          "statusCode": "STATUS_CODE_UNSET"
        }
      ],
      "totalSpans": 2
    },
    {
      "timestamp": "2023-07-10T15:02:30.677721Z",
      "trace_id": "b0717d3c-d555-e6fa-1e4d-1aca7c889c25",
      "service_name": "tracegen",
      "operation": "okey-dokey",
      "statusCode": "STATUS_CODE_UNSET",
      "spans": [
        {
          "timestamp": "2023-07-10T15:02:30.677721Z",
          "span_id": "B171E7315A8B7FD1",
          "trace_id": "b0717d3c-d555-e6fa-1e4d-1aca7c889c25",
          "service_name": "tracegen",
          "operation": "okey-dokey",
          "duration_nano": 124000,
          "statusCode": "STATUS_CODE_UNSET"
        },
        {
          "timestamp": "2023-07-10T15:02:30.677721Z",
          "span_id": "CD8D690AC2924C06",
          "trace_id": "b0717d3c-d555-e6fa-1e4d-1aca7c889c25",
          "service_name": "tracegen",
          "operation": "lets-go",
          "duration_nano": 124000,
          "statusCode": "STATUS_CODE_UNSET"
        }
      ],
      "totalSpans": 2
    },
    {
      "timestamp": "2023-07-10T15:02:30.677723Z",
      "trace_id": "0dd663d5-d314-1736-cd5a-90d2811232fc",
      "service_name": "tracegen",
      "operation": "lets-go",
      "statusCode": "STATUS_CODE_UNSET",
      "spans": [
        {
          "timestamp": "2023-07-10T15:02:30.677723Z",
          "span_id": "224B0CB973E7D237",
          "trace_id": "0dd663d5-d314-1736-cd5a-90d2811232fc",
          "service_name": "tracegen",
          "operation": "lets-go",
          "duration_nano": 125000,
          "statusCode": "STATUS_CODE_UNSET"
        },
        {
          "timestamp": "2023-07-10T15:02:30.677724Z",
          "span_id": "452D473BC85DDBA5",
          "trace_id": "0dd663d5-d314-1736-cd5a-90d2811232fc",
          "service_name": "tracegen",
          "operation": "okey-dokey",
          "duration_nano": 124000,
          "statusCode": "STATUS_CODE_UNSET"
        }
      ],
      "totalSpans": 2
    },
    {
      "timestamp": "2023-07-10T15:02:30.677723Z",
      "trace_id": "0dd663d5-d314-1736-cd5a-90d2811232fc",
      "service_name": "tracegen",
      "operation": "lets-go",
      "statusCode": "STATUS_CODE_UNSET",
      "spans": [
        {
          "timestamp": "2023-07-10T15:02:30.677723Z",
          "span_id": "224B0CB973E7D237",
          "trace_id": "0dd663d5-d314-1736-cd5a-90d2811232fc",
          "service_name": "tracegen",
          "operation": "lets-go",
          "duration_nano": 125000,
          "statusCode": "STATUS_CODE_UNSET"
        },
        {
          "timestamp": "2023-07-10T15:02:30.677724Z",
          "span_id": "452D473BC85DDBA5",
          "trace_id": "0dd663d5-d314-1736-cd5a-90d2811232fc",
          "service_name": "tracegen",
          "operation": "okey-dokey",
          "duration_nano": 124000,
          "statusCode": "STATUS_CODE_UNSET"
        }
      ],
      "totalSpans": 2
    },
    {
      "timestamp": "2023-07-10T15:02:30.677726Z",
      "trace_id": "b057b9c7-96dd-337a-ff46-c62254e4b0f8",
      "service_name": "tracegen",
      "operation": "lets-go",
      "statusCode": "STATUS_CODE_UNSET",
      "spans": [
        {
          "timestamp": "2023-07-10T15:02:30.677726Z",
          "span_id": "6491B39AA9F2CB97",
          "trace_id": "b057b9c7-96dd-337a-ff46-c62254e4b0f8",
          "service_name": "tracegen",
          "operation": "lets-go",
          "duration_nano": 124000,
          "statusCode": "STATUS_CODE_UNSET"
        },
        {
          "timestamp": "2023-07-10T15:02:30.677727Z",
          "span_id": "96C2E96EA8D3AF1D",
          "trace_id": "b057b9c7-96dd-337a-ff46-c62254e4b0f8",
          "service_name": "tracegen",
          "operation": "okey-dokey",
          "duration_nano": 123000,
          "statusCode": "STATUS_CODE_UNSET"
        }
      ],
      "totalSpans": 2
    },
    {
      "timestamp": "2023-07-10T15:02:30.677726Z",
      "trace_id": "b057b9c7-96dd-337a-ff46-c62254e4b0f8",
      "service_name": "tracegen",
      "operation": "lets-go",
      "statusCode": "STATUS_CODE_UNSET",
      "spans": [
        {
          "timestamp": "2023-07-10T15:02:30.677726Z",
          "span_id": "6491B39AA9F2CB97",
          "trace_id": "b057b9c7-96dd-337a-ff46-c62254e4b0f8",
          "service_name": "tracegen",
          "operation": "lets-go",
          "duration_nano": 124000,
          "statusCode": "STATUS_CODE_UNSET"
        },
        {
          "timestamp": "2023-07-10T15:02:30.677727Z",
          "span_id": "96C2E96EA8D3AF1D",
          "trace_id": "b057b9c7-96dd-337a-ff46-c62254e4b0f8",
          "service_name": "tracegen",
          "operation": "okey-dokey",
          "duration_nano": 123000,
          "statusCode": "STATUS_CODE_UNSET"
        }
      ],
      "totalSpans": 2
    },
    {
      "timestamp": "2023-07-10T15:02:30.677728Z",
      "trace_id": "c2b52b78-3a3a-0a44-bc73-04288175f112",
      "service_name": "tracegen",
      "operation": "lets-go",
      "statusCode": "STATUS_CODE_UNSET",
      "spans": [
        {
          "timestamp": "2023-07-10T15:02:30.677728Z",
          "span_id": "3A7F5394923A5AF0",
          "trace_id": "c2b52b78-3a3a-0a44-bc73-04288175f112",
          "service_name": "tracegen",
          "operation": "lets-go",
          "duration_nano": 124000,
          "statusCode": "STATUS_CODE_UNSET"
        },
        {
          "timestamp": "2023-07-10T15:02:30.677729Z",
          "span_id": "24CC4AB1032650CF",
          "trace_id": "c2b52b78-3a3a-0a44-bc73-04288175f112",
          "service_name": "tracegen",
          "operation": "okey-dokey",
          "duration_nano": 123000,
          "statusCode": "STATUS_CODE_UNSET"
        }
      ],
      "totalSpans": 2
    },
    {
      "timestamp": "2023-07-10T15:02:30.677728Z",
      "trace_id": "c2b52b78-3a3a-0a44-bc73-04288175f112",
      "service_name": "tracegen",
      "operation": "lets-go",
      "statusCode": "STATUS_CODE_UNSET",
      "spans": [
        {
          "timestamp": "2023-07-10T15:02:30.677728Z",
          "span_id": "3A7F5394923A5AF0",
          "trace_id": "c2b52b78-3a3a-0a44-bc73-04288175f112",
          "service_name": "tracegen",
          "operation": "lets-go",
          "duration_nano": 124000,
          "statusCode": "STATUS_CODE_UNSET"
        },
        {
          "timestamp": "2023-07-10T15:02:30.677729Z",
          "span_id": "24CC4AB1032650CF",
          "trace_id": "c2b52b78-3a3a-0a44-bc73-04288175f112",
          "service_name": "tracegen",
          "operation": "okey-dokey",
          "duration_nano": 123000,
          "statusCode": "STATUS_CODE_UNSET"
        }
      ],
      "totalSpans": 2
    },
    {
      "timestamp": "2023-07-10T15:02:30.677743Z",
      "trace_id": "e25bf442-7823-44e0-4400-0570b4bf525c",
      "service_name": "tracegen",
      "operation": "lets-go",
      "statusCode": "STATUS_CODE_UNSET",
      "spans": [
        {
          "timestamp": "2023-07-10T15:02:30.677743Z",
          "span_id": "F783055E10DA9E2D",
          "trace_id": "e25bf442-7823-44e0-4400-0570b4bf525c",
          "service_name": "tracegen",
          "operation": "lets-go",
          "duration_nano": 124000,
          "statusCode": "STATUS_CODE_UNSET"
        },
        {
          "timestamp": "2023-07-10T15:02:30.677744Z",
          "span_id": "E581CC7A539137BF",
          "trace_id": "e25bf442-7823-44e0-4400-0570b4bf525c",
          "service_name": "tracegen",
          "operation": "okey-dokey",
          "duration_nano": 123000,
          "statusCode": "STATUS_CODE_UNSET"
        }
      ],
      "totalSpans": 2
    },
    {
      "timestamp": "2023-07-10T15:02:30.677743Z",
      "trace_id": "e25bf442-7823-44e0-4400-0570b4bf525c",
      "service_name": "tracegen",
      "operation": "lets-go",
      "statusCode": "STATUS_CODE_UNSET",
      "spans": [
        {
          "timestamp": "2023-07-10T15:02:30.677743Z",
          "span_id": "F783055E10DA9E2D",
          "trace_id": "e25bf442-7823-44e0-4400-0570b4bf525c",
          "service_name": "tracegen",
          "operation": "lets-go",
          "duration_nano": 124000,
          "statusCode": "STATUS_CODE_UNSET"
        },
        {
          "timestamp": "2023-07-10T15:02:30.677744Z",
          "span_id": "E581CC7A539137BF",
          "trace_id": "e25bf442-7823-44e0-4400-0570b4bf525c",
          "service_name": "tracegen",
          "operation": "okey-dokey",
          "duration_nano": 123000,
          "statusCode": "STATUS_CODE_UNSET"
        }
      ],
      "totalSpans": 2
    },
    {
      "timestamp": "2023-07-10T15:02:30.677746Z",
      "trace_id": "7737691c-16f6-8aa4-9326-2114e3a1048e",
      "service_name": "tracegen",
      "operation": "lets-go",
      "statusCode": "STATUS_CODE_UNSET",
      "spans": [
        {
          "timestamp": "2023-07-10T15:02:30.677746Z",
          "span_id": "89BD651A0E16281F",
          "trace_id": "7737691c-16f6-8aa4-9326-2114e3a1048e",
          "service_name": "tracegen",
          "operation": "lets-go",
          "duration_nano": 124000,
          "statusCode": "STATUS_CODE_UNSET"
        },
        {
          "timestamp": "2023-07-10T15:02:30.677747Z",
          "span_id": "1FADCC9FB8DDE886",
          "trace_id": "7737691c-16f6-8aa4-9326-2114e3a1048e",
          "service_name": "tracegen",
          "operation": "okey-dokey",
          "duration_nano": 123000,
          "statusCode": "STATUS_CODE_UNSET"
        }
      ],
      "totalSpans": 2
    },
    {
      "timestamp": "2023-07-10T15:02:30.677746Z",
      "trace_id": "7737691c-16f6-8aa4-9326-2114e3a1048e",
      "service_name": "tracegen",
      "operation": "lets-go",
      "statusCode": "STATUS_CODE_UNSET",
      "spans": [
        {
          "timestamp": "2023-07-10T15:02:30.677746Z",
          "span_id": "89BD651A0E16281F",
          "trace_id": "7737691c-16f6-8aa4-9326-2114e3a1048e",
          "service_name": "tracegen",
          "operation": "lets-go",
          "duration_nano": 124000,
          "statusCode": "STATUS_CODE_UNSET"
        },
        {
          "timestamp": "2023-07-10T15:02:30.677747Z",
          "span_id": "1FADCC9FB8DDE886",
          "trace_id": "7737691c-16f6-8aa4-9326-2114e3a1048e",
          "service_name": "tracegen",
          "operation": "okey-dokey",
          "duration_nano": 123000,
          "statusCode": "STATUS_CODE_UNSET"
        }
      ],
      "totalSpans": 2
    },
    {
      "timestamp": "2023-07-10T15:02:30.677749Z",
      "trace_id": "79cc7e3b-10dc-7f53-03a6-2a5c4417bdc5",
      "service_name": "tracegen",
      "operation": "lets-go",
      "statusCode": "STATUS_CODE_UNSET",
      "spans": [
        {
          "timestamp": "2023-07-10T15:02:30.677749Z",
          "span_id": "09E59AECCEDE7725",
          "trace_id": "79cc7e3b-10dc-7f53-03a6-2a5c4417bdc5",
          "service_name": "tracegen",
          "operation": "lets-go",
          "duration_nano": 124000,
          "statusCode": "STATUS_CODE_UNSET"
        },
        {
          "timestamp": "2023-07-10T15:02:30.67775Z",
          "span_id": "9885AAE43420A45B",
          "trace_id": "79cc7e3b-10dc-7f53-03a6-2a5c4417bdc5",
          "service_name": "tracegen",
          "operation": "okey-dokey",
          "duration_nano": 123000,
          "statusCode": "STATUS_CODE_UNSET"
        }
      ],
      "totalSpans": 2
    },
    {
      "timestamp": "2023-07-10T15:02:30.677749Z",
      "trace_id": "79cc7e3b-10dc-7f53-03a6-2a5c4417bdc5",
      "service_name": "tracegen",
      "operation": "lets-go",
      "statusCode": "STATUS_CODE_UNSET",
      "spans": [
        {
          "timestamp": "2023-07-10T15:02:30.677749Z",
          "span_id": "09E59AECCEDE7725",
          "trace_id": "79cc7e3b-10dc-7f53-03a6-2a5c4417bdc5",
          "service_name": "tracegen",
          "operation": "lets-go",
          "duration_nano": 124000,
          "statusCode": "STATUS_CODE_UNSET"
        },
        {
          "timestamp": "2023-07-10T15:02:30.67775Z",
          "span_id": "9885AAE43420A45B",
          "trace_id": "79cc7e3b-10dc-7f53-03a6-2a5c4417bdc5",
          "service_name": "tracegen",
          "operation": "okey-dokey",
          "duration_nano": 123000,
          "statusCode": "STATUS_CODE_UNSET"
        }
      ],
      "totalSpans": 2
    },
    {
      "timestamp": "2023-07-10T15:02:30.677751Z",
      "trace_id": "5e7ba616-863c-a3d9-531d-def5659bfb5f",
      "service_name": "tracegen",
      "operation": "lets-go",
      "statusCode": "STATUS_CODE_UNSET",
      "spans": [
        {
          "timestamp": "2023-07-10T15:02:30.677751Z",
          "span_id": "CC204570C29BDBF4",
          "trace_id": "5e7ba616-863c-a3d9-531d-def5659bfb5f",
          "service_name": "tracegen",
          "operation": "lets-go",
          "duration_nano": 125000,
          "statusCode": "STATUS_CODE_UNSET"
        },
        {
          "timestamp": "2023-07-10T15:02:30.677752Z",
          "span_id": "D17C651E1245C0F9",
          "trace_id": "5e7ba616-863c-a3d9-531d-def5659bfb5f",
          "service_name": "tracegen",
          "operation": "okey-dokey",
          "duration_nano": 124000,
          "statusCode": "STATUS_CODE_UNSET"
        }
      ],
      "totalSpans": 2
    },
    {
      "timestamp": "2023-07-10T15:02:30.677751Z",
      "trace_id": "5e7ba616-863c-a3d9-531d-def5659bfb5f",
      "service_name": "tracegen",
      "operation": "lets-go",
      "statusCode": "STATUS_CODE_UNSET",
      "spans": [
        {
          "timestamp": "2023-07-10T15:02:30.677751Z",
          "span_id": "CC204570C29BDBF4",
          "trace_id": "5e7ba616-863c-a3d9-531d-def5659bfb5f",
          "service_name": "tracegen",
          "operation": "lets-go",
          "duration_nano": 125000,
          "statusCode": "STATUS_CODE_UNSET"
        },
        {
          "timestamp": "2023-07-10T15:02:30.677752Z",
          "span_id": "D17C651E1245C0F9",
          "trace_id": "5e7ba616-863c-a3d9-531d-def5659bfb5f",
          "service_name": "tracegen",
          "operation": "okey-dokey",
          "duration_nano": 124000,
          "statusCode": "STATUS_CODE_UNSET"
        }
      ],
      "totalSpans": 2
    },
    {
      "timestamp": "2023-07-10T15:02:30.677755Z",
      "trace_id": "9be40513-f8ae-1f93-0a2b-043323294f75",
      "service_name": "tracegen",
      "operation": "lets-go",
      "statusCode": "STATUS_CODE_UNSET",
      "spans": [
        {
          "timestamp": "2023-07-10T15:02:30.677755Z",
          "span_id": "B9C3F1DAF9940B7F",
          "trace_id": "9be40513-f8ae-1f93-0a2b-043323294f75",
          "service_name": "tracegen",
          "operation": "lets-go",
          "duration_nano": 124000,
          "statusCode": "STATUS_CODE_UNSET"
        },
        {
          "timestamp": "2023-07-10T15:02:30.677755Z",
          "span_id": "06A614DD43EC1E9A",
          "trace_id": "9be40513-f8ae-1f93-0a2b-043323294f75",
          "service_name": "tracegen",
          "operation": "okey-dokey",
          "duration_nano": 124000,
          "statusCode": "STATUS_CODE_UNSET"
        }
      ],
      "totalSpans": 2
    },
    {
      "timestamp": "2023-07-10T15:02:30.677755Z",
      "trace_id": "9be40513-f8ae-1f93-0a2b-043323294f75",
      "service_name": "tracegen",
      "operation": "lets-go",
      "statusCode": "STATUS_CODE_UNSET",
      "spans": [
        {
          "timestamp": "2023-07-10T15:02:30.677755Z",
          "span_id": "B9C3F1DAF9940B7F",
          "trace_id": "9be40513-f8ae-1f93-0a2b-043323294f75",
          "service_name": "tracegen",
          "operation": "lets-go",
          "duration_nano": 124000,
          "statusCode": "STATUS_CODE_UNSET"
        },
        {
          "timestamp": "2023-07-10T15:02:30.677755Z",
          "span_id": "06A614DD43EC1E9A",
          "trace_id": "9be40513-f8ae-1f93-0a2b-043323294f75",
          "service_name": "tracegen",
          "operation": "okey-dokey",
          "duration_nano": 124000,
          "statusCode": "STATUS_CODE_UNSET"
        }
      ],
      "totalSpans": 2
    },
    {
      "timestamp": "2023-07-10T15:02:30.677757Z",
      "trace_id": "89f98a5b-09d4-0e0b-3f92-3572152ddc3d",
      "service_name": "tracegen",
      "operation": "lets-go",
      "statusCode": "STATUS_CODE_UNSET",
      "spans": [
        {
          "timestamp": "2023-07-10T15:02:30.677757Z",
          "span_id": "46A99707D5225859",
          "trace_id": "89f98a5b-09d4-0e0b-3f92-3572152ddc3d",
          "service_name": "tracegen",
          "operation": "lets-go",
          "duration_nano": 131000,
          "statusCode": "STATUS_CODE_UNSET"
        },
        {
          "timestamp": "2023-07-10T15:02:30.677763Z",
          "span_id": "F489DDD88539BDA4",
          "trace_id": "89f98a5b-09d4-0e0b-3f92-3572152ddc3d",
          "service_name": "tracegen",
          "operation": "okey-dokey",
          "duration_nano": 125000,
          "statusCode": "STATUS_CODE_UNSET"
        }
      ],
      "totalSpans": 2
    },
    {
      "timestamp": "2023-07-10T15:02:30.677757Z",
      "trace_id": "89f98a5b-09d4-0e0b-3f92-3572152ddc3d",
      "service_name": "tracegen",
      "operation": "lets-go",
      "statusCode": "STATUS_CODE_UNSET",
      "spans": [
        {
          "timestamp": "2023-07-10T15:02:30.677757Z",
          "span_id": "46A99707D5225859",
          "trace_id": "89f98a5b-09d4-0e0b-3f92-3572152ddc3d",
          "service_name": "tracegen",
          "operation": "lets-go",
          "duration_nano": 131000,
          "statusCode": "STATUS_CODE_UNSET"
        },
        {
          "timestamp": "2023-07-10T15:02:30.677763Z",
          "span_id": "F489DDD88539BDA4",
          "trace_id": "89f98a5b-09d4-0e0b-3f92-3572152ddc3d",
          "service_name": "tracegen",
          "operation": "okey-dokey",
          "duration_nano": 125000,
          "statusCode": "STATUS_CODE_UNSET"
        }
      ],
      "totalSpans": 2
    },
    {
      "timestamp": "2023-07-10T15:02:30.677773Z",
      "trace_id": "b8ea3732-f870-f54c-1b3e-dff49376a1ec",
      "service_name": "tracegen",
      "operation": "lets-go",
      "statusCode": "STATUS_CODE_UNSET",
      "spans": [
        {
          "timestamp": "2023-07-10T15:02:30.677773Z",
          "span_id": "3223B8A1131D2A70",
          "trace_id": "b8ea3732-f870-f54c-1b3e-dff49376a1ec",
          "service_name": "tracegen",
          "operation": "lets-go",
          "duration_nano": 125000,
          "statusCode": "STATUS_CODE_UNSET"
        },
        {
          "timestamp": "2023-07-10T15:02:30.677774Z",
          "span_id": "82904DC8C7ED5487",
          "trace_id": "b8ea3732-f870-f54c-1b3e-dff49376a1ec",
          "service_name": "tracegen",
          "operation": "okey-dokey",
          "duration_nano": 124000,
          "statusCode": "STATUS_CODE_UNSET"
        }
      ],
      "totalSpans": 2
    },
    {
      "timestamp": "2023-07-10T15:02:30.677773Z",
      "trace_id": "b8ea3732-f870-f54c-1b3e-dff49376a1ec",
      "service_name": "tracegen",
      "operation": "lets-go",
      "statusCode": "STATUS_CODE_UNSET",
      "spans": [
        {
          "timestamp": "2023-07-10T15:02:30.677773Z",
          "span_id": "3223B8A1131D2A70",
          "trace_id": "b8ea3732-f870-f54c-1b3e-dff49376a1ec",
          "service_name": "tracegen",
          "operation": "lets-go",
          "duration_nano": 125000,
          "statusCode": "STATUS_CODE_UNSET"
        },
        {
          "timestamp": "2023-07-10T15:02:30.677774Z",
          "span_id": "82904DC8C7ED5487",
          "trace_id": "b8ea3732-f870-f54c-1b3e-dff49376a1ec",
          "service_name": "tracegen",
          "operation": "okey-dokey",
          "duration_nano": 124000,
          "statusCode": "STATUS_CODE_UNSET"
        }
      ],
      "totalSpans": 2
    },
    {
      "timestamp": "2023-07-10T15:02:30.677776Z",
      "trace_id": "a8ed5cde-b713-64ac-e11a-1222134e2857",
      "service_name": "tracegen",
      "operation": "lets-go",
      "statusCode": "STATUS_CODE_UNSET",
      "spans": [
        {
          "timestamp": "2023-07-10T15:02:30.677776Z",
          "span_id": "D9EC63C08230FB02",
          "trace_id": "a8ed5cde-b713-64ac-e11a-1222134e2857",
          "service_name": "tracegen",
          "operation": "lets-go",
          "duration_nano": 124000,
          "statusCode": "STATUS_CODE_UNSET"
        },
        {
          "timestamp": "2023-07-10T15:02:30.677777Z",
          "span_id": "F504530C5C200E2E",
          "trace_id": "a8ed5cde-b713-64ac-e11a-1222134e2857",
          "service_name": "tracegen",
          "operation": "okey-dokey",
          "duration_nano": 123000,
          "statusCode": "STATUS_CODE_UNSET"
        }
      ],
      "totalSpans": 2
    },
    {
      "timestamp": "2023-07-10T15:02:30.677776Z",
      "trace_id": "a8ed5cde-b713-64ac-e11a-1222134e2857",
      "service_name": "tracegen",
      "operation": "lets-go",
      "statusCode": "STATUS_CODE_UNSET",
      "spans": [
        {
          "timestamp": "2023-07-10T15:02:30.677776Z",
          "span_id": "D9EC63C08230FB02",
          "trace_id": "a8ed5cde-b713-64ac-e11a-1222134e2857",
          "service_name": "tracegen",
          "operation": "lets-go",
          "duration_nano": 124000,
          "statusCode": "STATUS_CODE_UNSET"
        },
        {
          "timestamp": "2023-07-10T15:02:30.677777Z",
          "span_id": "F504530C5C200E2E",
          "trace_id": "a8ed5cde-b713-64ac-e11a-1222134e2857",
          "service_name": "tracegen",
          "operation": "okey-dokey",
          "duration_nano": 123000,
          "statusCode": "STATUS_CODE_UNSET"
        }
      ],
      "totalSpans": 2
    },
    {
      "timestamp": "2023-07-10T15:02:30.677778Z",
      "trace_id": "bcbb0a0a-35a4-ff10-65b6-848271d6101a",
      "service_name": "tracegen",
      "operation": "lets-go",
      "statusCode": "STATUS_CODE_UNSET",
      "spans": [
        {
          "timestamp": "2023-07-10T15:02:30.677778Z",
          "span_id": "6F0F8D30DF04BA3E",
          "trace_id": "bcbb0a0a-35a4-ff10-65b6-848271d6101a",
          "service_name": "tracegen",
          "operation": "lets-go",
          "duration_nano": 124000,
          "statusCode": "STATUS_CODE_UNSET"
        },
        {
          "timestamp": "2023-07-10T15:02:30.677779Z",
          "span_id": "2FF73BB3675EBE65",
          "trace_id": "bcbb0a0a-35a4-ff10-65b6-848271d6101a",
          "service_name": "tracegen",
          "operation": "okey-dokey",
          "duration_nano": 123000,
          "statusCode": "STATUS_CODE_UNSET"
        }
      ],
      "totalSpans": 2
    },
    {
      "timestamp": "2023-07-10T15:02:30.677778Z",
      "trace_id": "bcbb0a0a-35a4-ff10-65b6-848271d6101a",
      "service_name": "tracegen",
      "operation": "lets-go",
      "statusCode": "STATUS_CODE_UNSET",
      "spans": [
        {
          "timestamp": "2023-07-10T15:02:30.677778Z",
          "span_id": "6F0F8D30DF04BA3E",
          "trace_id": "bcbb0a0a-35a4-ff10-65b6-848271d6101a",
          "service_name": "tracegen",
          "operation": "lets-go",
          "duration_nano": 124000,
          "statusCode": "STATUS_CODE_UNSET"
        },
        {
          "timestamp": "2023-07-10T15:02:30.677779Z",
          "span_id": "2FF73BB3675EBE65",
          "trace_id": "bcbb0a0a-35a4-ff10-65b6-848271d6101a",
          "service_name": "tracegen",
          "operation": "okey-dokey",
          "duration_nano": 123000,
          "statusCode": "STATUS_CODE_UNSET"
        }
      ],
      "totalSpans": 2
    },
    {
      "timestamp": "2023-07-10T15:02:30.67778Z",
      "trace_id": "636bfe8f-c6f3-54a7-f828-b1b85740c33f",
      "service_name": "tracegen",
      "operation": "lets-go",
      "statusCode": "STATUS_CODE_UNSET",
      "spans": [
        {
          "timestamp": "2023-07-10T15:02:30.67778Z",
          "span_id": "3D79FEC1831E8F1A",
          "trace_id": "636bfe8f-c6f3-54a7-f828-b1b85740c33f",
          "service_name": "tracegen",
          "operation": "lets-go",
          "duration_nano": 125000,
          "statusCode": "STATUS_CODE_UNSET"
        },
        {
          "timestamp": "2023-07-10T15:02:30.677781Z",
          "span_id": "35D99AA84BCD627A",
          "trace_id": "636bfe8f-c6f3-54a7-f828-b1b85740c33f",
          "service_name": "tracegen",
          "operation": "okey-dokey",
          "duration_nano": 124000,
          "statusCode": "STATUS_CODE_UNSET"
        }
      ],
      "totalSpans": 2
    },
    {
      "timestamp": "2023-07-10T15:02:30.67778Z",
      "trace_id": "636bfe8f-c6f3-54a7-f828-b1b85740c33f",
      "service_name": "tracegen",
      "operation": "lets-go",
      "statusCode": "STATUS_CODE_UNSET",
      "spans": [
        {
          "timestamp": "2023-07-10T15:02:30.67778Z",
          "span_id": "3D79FEC1831E8F1A",
          "trace_id": "636bfe8f-c6f3-54a7-f828-b1b85740c33f",
          "service_name": "tracegen",
          "operation": "lets-go",
          "duration_nano": 125000,
          "statusCode": "STATUS_CODE_UNSET"
        },
        {
          "timestamp": "2023-07-10T15:02:30.677781Z",
          "span_id": "35D99AA84BCD627A",
          "trace_id": "636bfe8f-c6f3-54a7-f828-b1b85740c33f",
          "service_name": "tracegen",
          "operation": "okey-dokey",
          "duration_nano": 124000,
          "statusCode": "STATUS_CODE_UNSET"
        }
      ],
      "totalSpans": 2
    },
    {
      "timestamp": "2023-07-10T15:02:30.677783Z",
      "trace_id": "685185ef-cf46-c7c7-9a00-6553b0171911",
      "service_name": "tracegen",
      "operation": "okey-dokey",
      "statusCode": "STATUS_CODE_UNSET",
      "spans": [
        {
          "timestamp": "2023-07-10T15:02:30.677783Z",
          "span_id": "0077A5FDB210BAB9",
          "trace_id": "685185ef-cf46-c7c7-9a00-6553b0171911",
          "service_name": "tracegen",
          "operation": "okey-dokey",
          "duration_nano": 130000,
          "statusCode": "STATUS_CODE_UNSET"
        },
        {
          "timestamp": "2023-07-10T15:02:30.677783Z",
          "span_id": "BD4D0517234DC84A",
          "trace_id": "685185ef-cf46-c7c7-9a00-6553b0171911",
          "service_name": "tracegen",
          "operation": "lets-go",
          "duration_nano": 130000,
          "statusCode": "STATUS_CODE_UNSET"
        }
      ],
      "totalSpans": 2
    },
    {
      "timestamp": "2023-07-10T15:02:30.677783Z",
      "trace_id": "685185ef-cf46-c7c7-9a00-6553b0171911",
      "service_name": "tracegen",
      "operation": "okey-dokey",
      "statusCode": "STATUS_CODE_UNSET",
      "spans": [
        {
          "timestamp": "2023-07-10T15:02:30.677783Z",
          "span_id": "0077A5FDB210BAB9",
          "trace_id": "685185ef-cf46-c7c7-9a00-6553b0171911",
          "service_name": "tracegen",
          "operation": "okey-dokey",
          "duration_nano": 130000,
          "statusCode": "STATUS_CODE_UNSET"
        },
        {
          "timestamp": "2023-07-10T15:02:30.677783Z",
          "span_id": "BD4D0517234DC84A",
          "trace_id": "685185ef-cf46-c7c7-9a00-6553b0171911",
          "service_name": "tracegen",
          "operation": "lets-go",
          "duration_nano": 130000,
          "statusCode": "STATUS_CODE_UNSET"
        }
      ],
      "totalSpans": 2
    },
    {
      "timestamp": "2023-07-10T15:02:30.677793Z",
      "trace_id": "fb17567a-a567-d0ac-c5f0-bbd5abb66cb8",
      "service_name": "tracegen",
      "operation": "lets-go",
      "statusCode": "STATUS_CODE_UNSET",
      "spans": [
        {
          "timestamp": "2023-07-10T15:02:30.677793Z",
          "span_id": "C148B50CA183BF05",
          "trace_id": "fb17567a-a567-d0ac-c5f0-bbd5abb66cb8",
          "service_name": "tracegen",
          "operation": "lets-go",
          "duration_nano": 125000,
          "statusCode": "STATUS_CODE_UNSET"
        },
        {
          "timestamp": "2023-07-10T15:02:30.677794Z",
          "span_id": "91C5D79D971A4A6E",
          "trace_id": "fb17567a-a567-d0ac-c5f0-bbd5abb66cb8",
          "service_name": "tracegen",
          "operation": "okey-dokey",
          "duration_nano": 124000,
          "statusCode": "STATUS_CODE_UNSET"
        }
      ],
      "totalSpans": 2
    },
    {
      "timestamp": "2023-07-10T15:02:30.677793Z",
      "trace_id": "fb17567a-a567-d0ac-c5f0-bbd5abb66cb8",
      "service_name": "tracegen",
      "operation": "lets-go",
      "statusCode": "STATUS_CODE_UNSET",
      "spans": [
        {
          "timestamp": "2023-07-10T15:02:30.677793Z",
          "span_id": "C148B50CA183BF05",
          "trace_id": "fb17567a-a567-d0ac-c5f0-bbd5abb66cb8",
          "service_name": "tracegen",
          "operation": "lets-go",
          "duration_nano": 125000,
          "statusCode": "STATUS_CODE_UNSET"
        },
        {
          "timestamp": "2023-07-10T15:02:30.677794Z",
          "span_id": "91C5D79D971A4A6E",
          "trace_id": "fb17567a-a567-d0ac-c5f0-bbd5abb66cb8",
          "service_name": "tracegen",
          "operation": "okey-dokey",
          "duration_nano": 124000,
          "statusCode": "STATUS_CODE_UNSET"
        }
      ],
      "totalSpans": 2
    },
    {
      "timestamp": "2023-07-10T15:02:30.677804Z",
      "trace_id": "d35cd179-4e71-8be7-ba39-b7b5ae2fdaa4",
      "service_name": "tracegen",
      "operation": "lets-go",
      "statusCode": "STATUS_CODE_UNSET",
      "spans": [
        {
          "timestamp": "2023-07-10T15:02:30.677804Z",
          "span_id": "948B20672FD5954F",
          "trace_id": "d35cd179-4e71-8be7-ba39-b7b5ae2fdaa4",
          "service_name": "tracegen",
          "operation": "lets-go",
          "duration_nano": 124000,
          "statusCode": "STATUS_CODE_UNSET"
        },
        {
          "timestamp": "2023-07-10T15:02:30.677805Z",
          "span_id": "529CA18AF8EF5017",
          "trace_id": "d35cd179-4e71-8be7-ba39-b7b5ae2fdaa4",
          "service_name": "tracegen",
          "operation": "okey-dokey",
          "duration_nano": 123000,
          "statusCode": "STATUS_CODE_UNSET"
        }
      ],
      "totalSpans": 2
    },
    {
      "timestamp": "2023-07-10T15:02:30.677804Z",
      "trace_id": "d35cd179-4e71-8be7-ba39-b7b5ae2fdaa4",
      "service_name": "tracegen",
      "operation": "lets-go",
      "statusCode": "STATUS_CODE_UNSET",
      "spans": [
        {
          "timestamp": "2023-07-10T15:02:30.677804Z",
          "span_id": "948B20672FD5954F",
          "trace_id": "d35cd179-4e71-8be7-ba39-b7b5ae2fdaa4",
          "service_name": "tracegen",
          "operation": "lets-go",
          "duration_nano": 124000,
          "statusCode": "STATUS_CODE_UNSET"
        },
        {
          "timestamp": "2023-07-10T15:02:30.677805Z",
          "span_id": "529CA18AF8EF5017",
          "trace_id": "d35cd179-4e71-8be7-ba39-b7b5ae2fdaa4",
          "service_name": "tracegen",
          "operation": "okey-dokey",
          "duration_nano": 123000,
          "statusCode": "STATUS_CODE_UNSET"
        }
      ],
      "totalSpans": 2
    },
    {
      "timestamp": "2023-07-10T15:02:30.677806Z",
      "trace_id": "e156a5f9-c203-2979-8fbc-5f50b8a67f32",
      "service_name": "tracegen",
      "operation": "lets-go",
      "statusCode": "STATUS_CODE_UNSET",
      "spans": [
        {
          "timestamp": "2023-07-10T15:02:30.677806Z",
          "span_id": "ADF60B9EFA97AD89",
          "trace_id": "e156a5f9-c203-2979-8fbc-5f50b8a67f32",
          "service_name": "tracegen",
          "operation": "lets-go",
          "duration_nano": 125000,
          "statusCode": "STATUS_CODE_UNSET"
        },
        {
          "timestamp": "2023-07-10T15:02:30.677807Z",
          "span_id": "03DE70E55CBF857C",
          "trace_id": "e156a5f9-c203-2979-8fbc-5f50b8a67f32",
          "service_name": "tracegen",
          "operation": "okey-dokey",
          "duration_nano": 124000,
          "statusCode": "STATUS_CODE_UNSET"
        }
      ],
      "totalSpans": 2
    },
    {
      "timestamp": "2023-07-10T15:02:30.677806Z",
      "trace_id": "e156a5f9-c203-2979-8fbc-5f50b8a67f32",
      "service_name": "tracegen",
      "operation": "lets-go",
      "statusCode": "STATUS_CODE_UNSET",
      "spans": [
        {
          "timestamp": "2023-07-10T15:02:30.677806Z",
          "span_id": "ADF60B9EFA97AD89",
          "trace_id": "e156a5f9-c203-2979-8fbc-5f50b8a67f32",
          "service_name": "tracegen",
          "operation": "lets-go",
          "duration_nano": 125000,
          "statusCode": "STATUS_CODE_UNSET"
        },
        {
          "timestamp": "2023-07-10T15:02:30.677807Z",
          "span_id": "03DE70E55CBF857C",
          "trace_id": "e156a5f9-c203-2979-8fbc-5f50b8a67f32",
          "service_name": "tracegen",
          "operation": "okey-dokey",
          "duration_nano": 124000,
          "statusCode": "STATUS_CODE_UNSET"
        }
      ],
      "totalSpans": 2
    },
    {
      "timestamp": "2023-07-10T15:02:30.677809Z",
      "trace_id": "7637dadf-0405-3e70-e78f-f0fa26d42511",
      "service_name": "tracegen",
      "operation": "lets-go",
      "statusCode": "STATUS_CODE_UNSET",
      "spans": [
        {
          "timestamp": "2023-07-10T15:02:30.677809Z",
          "span_id": "4350413FDF6C0DCD",
          "trace_id": "7637dadf-0405-3e70-e78f-f0fa26d42511",
          "service_name": "tracegen",
          "operation": "lets-go",
          "duration_nano": 128000,
          "statusCode": "STATUS_CODE_UNSET"
        },
        {
          "timestamp": "2023-07-10T15:02:30.677814Z",
          "span_id": "BDC8BD58C638FC78",
          "trace_id": "7637dadf-0405-3e70-e78f-f0fa26d42511",
          "service_name": "tracegen",
          "operation": "okey-dokey",
          "duration_nano": 123000,
          "statusCode": "STATUS_CODE_UNSET"
        }
      ],
      "totalSpans": 2
    },
    {
      "timestamp": "2023-07-10T15:02:30.677809Z",
      "trace_id": "7637dadf-0405-3e70-e78f-f0fa26d42511",
      "service_name": "tracegen",
      "operation": "lets-go",
      "statusCode": "STATUS_CODE_UNSET",
      "spans": [
        {
          "timestamp": "2023-07-10T15:02:30.677809Z",
          "span_id": "4350413FDF6C0DCD",
          "trace_id": "7637dadf-0405-3e70-e78f-f0fa26d42511",
          "service_name": "tracegen",
          "operation": "lets-go",
          "duration_nano": 128000,
          "statusCode": "STATUS_CODE_UNSET"
        },
        {
          "timestamp": "2023-07-10T15:02:30.677814Z",
          "span_id": "BDC8BD58C638FC78",
          "trace_id": "7637dadf-0405-3e70-e78f-f0fa26d42511",
          "service_name": "tracegen",
          "operation": "okey-dokey",
          "duration_nano": 123000,
          "statusCode": "STATUS_CODE_UNSET"
        }
      ],
      "totalSpans": 2
    },
    {
      "timestamp": "2023-07-10T15:02:30.677815Z",
      "trace_id": "9fdab630-253f-d030-6f7f-ce1a359fa330",
      "service_name": "tracegen",
      "operation": "lets-go",
      "statusCode": "STATUS_CODE_UNSET",
      "spans": [
        {
          "timestamp": "2023-07-10T15:02:30.677815Z",
          "span_id": "1A9A97C656E06304",
          "trace_id": "9fdab630-253f-d030-6f7f-ce1a359fa330",
          "service_name": "tracegen",
          "operation": "lets-go",
          "duration_nano": 125000,
          "statusCode": "STATUS_CODE_UNSET"
        },
        {
          "timestamp": "2023-07-10T15:02:30.677816Z",
          "span_id": "5C6D85FF7954A628",
          "trace_id": "9fdab630-253f-d030-6f7f-ce1a359fa330",
          "service_name": "tracegen",
          "operation": "okey-dokey",
          "duration_nano": 124000,
          "statusCode": "STATUS_CODE_UNSET"
        }
      ],
      "totalSpans": 2
    },
    {
      "timestamp": "2023-07-10T15:02:30.677815Z",
      "trace_id": "9fdab630-253f-d030-6f7f-ce1a359fa330",
      "service_name": "tracegen",
      "operation": "lets-go",
      "statusCode": "STATUS_CODE_UNSET",
      "spans": [
        {
          "timestamp": "2023-07-10T15:02:30.677815Z",
          "span_id": "1A9A97C656E06304",
          "trace_id": "9fdab630-253f-d030-6f7f-ce1a359fa330",
          "service_name": "tracegen",
          "operation": "lets-go",
          "duration_nano": 125000,
          "statusCode": "STATUS_CODE_UNSET"
        },
        {
          "timestamp": "2023-07-10T15:02:30.677816Z",
          "span_id": "5C6D85FF7954A628",
          "trace_id": "9fdab630-253f-d030-6f7f-ce1a359fa330",
          "service_name": "tracegen",
          "operation": "okey-dokey",
          "duration_nano": 124000,
          "statusCode": "STATUS_CODE_UNSET"
        }
      ],
      "totalSpans": 2
    },
    {
      "timestamp": "2023-07-10T15:02:30.677819Z",
      "trace_id": "f3a4220e-79e8-dc0a-44b0-33642b2561ad",
      "service_name": "tracegen",
      "operation": "lets-go",
      "statusCode": "STATUS_CODE_UNSET",
      "spans": [
        {
          "timestamp": "2023-07-10T15:02:30.677819Z",
          "span_id": "6ED8D4E93C42E03E",
          "trace_id": "f3a4220e-79e8-dc0a-44b0-33642b2561ad",
          "service_name": "tracegen",
          "operation": "lets-go",
          "duration_nano": 124000,
          "statusCode": "STATUS_CODE_UNSET"
        },
        {
          "timestamp": "2023-07-10T15:02:30.67782Z",
          "span_id": "E3A02E872E9E95EA",
          "trace_id": "f3a4220e-79e8-dc0a-44b0-33642b2561ad",
          "service_name": "tracegen",
          "operation": "okey-dokey",
          "duration_nano": 123000,
          "statusCode": "STATUS_CODE_UNSET"
        }
      ],
      "totalSpans": 2
    },
    {
      "timestamp": "2023-07-10T15:02:30.677819Z",
      "trace_id": "f3a4220e-79e8-dc0a-44b0-33642b2561ad",
      "service_name": "tracegen",
      "operation": "lets-go",
      "statusCode": "STATUS_CODE_UNSET",
      "spans": [
        {
          "timestamp": "2023-07-10T15:02:30.677819Z",
          "span_id": "6ED8D4E93C42E03E",
          "trace_id": "f3a4220e-79e8-dc0a-44b0-33642b2561ad",
          "service_name": "tracegen",
          "operation": "lets-go",
          "duration_nano": 124000,
          "statusCode": "STATUS_CODE_UNSET"
        },
        {
          "timestamp": "2023-07-10T15:02:30.67782Z",
          "span_id": "E3A02E872E9E95EA",
          "trace_id": "f3a4220e-79e8-dc0a-44b0-33642b2561ad",
          "service_name": "tracegen",
          "operation": "okey-dokey",
          "duration_nano": 123000,
          "statusCode": "STATUS_CODE_UNSET"
        }
      ],
      "totalSpans": 2
    },
    {
      "timestamp": "2023-07-10T15:02:30.677824Z",
      "trace_id": "ac93cf21-6d07-94a2-7e87-f64a637a4a05",
      "service_name": "tracegen",
      "operation": "lets-go",
      "statusCode": "STATUS_CODE_UNSET",
      "spans": [
        {
          "timestamp": "2023-07-10T15:02:30.677824Z",
          "span_id": "2AF1B764C7572560",
          "trace_id": "ac93cf21-6d07-94a2-7e87-f64a637a4a05",
          "service_name": "tracegen",
          "operation": "lets-go",
          "duration_nano": 125000,
          "statusCode": "STATUS_CODE_UNSET"
        },
        {
          "timestamp": "2023-07-10T15:02:30.677825Z",
          "span_id": "321BA81B83ABAB3C",
          "trace_id": "ac93cf21-6d07-94a2-7e87-f64a637a4a05",
          "service_name": "tracegen",
          "operation": "okey-dokey",
          "duration_nano": 124000,
          "statusCode": "STATUS_CODE_UNSET"
        }
      ],
      "totalSpans": 2
    },
    {
      "timestamp": "2023-07-10T15:02:30.677824Z",
      "trace_id": "ac93cf21-6d07-94a2-7e87-f64a637a4a05",
      "service_name": "tracegen",
      "operation": "lets-go",
      "statusCode": "STATUS_CODE_UNSET",
      "spans": [
        {
          "timestamp": "2023-07-10T15:02:30.677824Z",
          "span_id": "2AF1B764C7572560",
          "trace_id": "ac93cf21-6d07-94a2-7e87-f64a637a4a05",
          "service_name": "tracegen",
          "operation": "lets-go",
          "duration_nano": 125000,
          "statusCode": "STATUS_CODE_UNSET"
        },
        {
          "timestamp": "2023-07-10T15:02:30.677825Z",
          "span_id": "321BA81B83ABAB3C",
          "trace_id": "ac93cf21-6d07-94a2-7e87-f64a637a4a05",
          "service_name": "tracegen",
          "operation": "okey-dokey",
          "duration_nano": 124000,
          "statusCode": "STATUS_CODE_UNSET"
        }
      ],
      "totalSpans": 2
    },
    {
      "timestamp": "2023-07-10T15:02:30.677835Z",
      "trace_id": "d0695ec7-66dd-bbdc-9577-86aaeffe9ec5",
      "service_name": "tracegen",
      "operation": "lets-go",
      "statusCode": "STATUS_CODE_UNSET",
      "spans": [
        {
          "timestamp": "2023-07-10T15:02:30.677835Z",
          "span_id": "3A2C3D8803D79AC4",
          "trace_id": "d0695ec7-66dd-bbdc-9577-86aaeffe9ec5",
          "service_name": "tracegen",
          "operation": "lets-go",
          "duration_nano": 124000,
          "statusCode": "STATUS_CODE_UNSET"
        },
        {
          "timestamp": "2023-07-10T15:02:30.677836Z",
          "span_id": "B44FBDD3FD165A7D",
          "trace_id": "d0695ec7-66dd-bbdc-9577-86aaeffe9ec5",
          "service_name": "tracegen",
          "operation": "okey-dokey",
          "duration_nano": 123000,
          "statusCode": "STATUS_CODE_UNSET"
        }
      ],
      "totalSpans": 2
    },
    {
      "timestamp": "2023-07-10T15:02:30.677835Z",
      "trace_id": "d0695ec7-66dd-bbdc-9577-86aaeffe9ec5",
      "service_name": "tracegen",
      "operation": "lets-go",
      "statusCode": "STATUS_CODE_UNSET",
      "spans": [
        {
          "timestamp": "2023-07-10T15:02:30.677835Z",
          "span_id": "3A2C3D8803D79AC4",
          "trace_id": "d0695ec7-66dd-bbdc-9577-86aaeffe9ec5",
          "service_name": "tracegen",
          "operation": "lets-go",
          "duration_nano": 124000,
          "statusCode": "STATUS_CODE_UNSET"
        },
        {
          "timestamp": "2023-07-10T15:02:30.677836Z",
          "span_id": "B44FBDD3FD165A7D",
          "trace_id": "d0695ec7-66dd-bbdc-9577-86aaeffe9ec5",
          "service_name": "tracegen",
          "operation": "okey-dokey",
          "duration_nano": 123000,
          "statusCode": "STATUS_CODE_UNSET"
        }
      ],
      "totalSpans": 2
    },
    {
      "timestamp": "2023-07-10T15:02:30.677838Z",
      "trace_id": "ac155a1f-ab02-d5dc-b77e-65d87e53ab8d",
      "service_name": "tracegen",
      "operation": "okey-dokey",
      "statusCode": "STATUS_CODE_UNSET",
      "spans": [
        {
          "timestamp": "2023-07-10T15:02:30.677838Z",
          "span_id": "B3541547AC06BBBE",
          "trace_id": "ac155a1f-ab02-d5dc-b77e-65d87e53ab8d",
          "service_name": "tracegen",
          "operation": "okey-dokey",
          "duration_nano": 124000,
          "statusCode": "STATUS_CODE_UNSET"
        },
        {
          "timestamp": "2023-07-10T15:02:30.677838Z",
          "span_id": "D9A66F89D75DF7A9",
          "trace_id": "ac155a1f-ab02-d5dc-b77e-65d87e53ab8d",
          "service_name": "tracegen",
          "operation": "lets-go",
          "duration_nano": 124000,
          "statusCode": "STATUS_CODE_UNSET"
        }
      ],
      "totalSpans": 2
    },
    {
      "timestamp": "2023-07-10T15:02:30.677838Z",
      "trace_id": "ac155a1f-ab02-d5dc-b77e-65d87e53ab8d",
      "service_name": "tracegen",
      "operation": "okey-dokey",
      "statusCode": "STATUS_CODE_UNSET",
      "spans": [
        {
          "timestamp": "2023-07-10T15:02:30.677838Z",
          "span_id": "B3541547AC06BBBE",
          "trace_id": "ac155a1f-ab02-d5dc-b77e-65d87e53ab8d",
          "service_name": "tracegen",
          "operation": "okey-dokey",
          "duration_nano": 124000,
          "statusCode": "STATUS_CODE_UNSET"
        },
        {
          "timestamp": "2023-07-10T15:02:30.677838Z",
          "span_id": "D9A66F89D75DF7A9",
          "trace_id": "ac155a1f-ab02-d5dc-b77e-65d87e53ab8d",
          "service_name": "tracegen",
          "operation": "lets-go",
          "duration_nano": 124000,
          "statusCode": "STATUS_CODE_UNSET"
        }
      ],
      "totalSpans": 2
    },
    {
      "timestamp": "2023-07-10T15:02:30.67784Z",
      "trace_id": "51b58b66-f449-6183-7844-7d1c6fb834fd",
      "service_name": "tracegen",
      "operation": "lets-go",
      "statusCode": "STATUS_CODE_UNSET",
      "spans": [
        {
          "timestamp": "2023-07-10T15:02:30.67784Z",
          "span_id": "6319FEA0EAA4E4C2",
          "trace_id": "51b58b66-f449-6183-7844-7d1c6fb834fd",
          "service_name": "tracegen",
          "operation": "lets-go",
          "duration_nano": 124000,
          "statusCode": "STATUS_CODE_UNSET"
        },
        {
          "timestamp": "2023-07-10T15:02:30.677841Z",
          "span_id": "ACF1D215C677342D",
          "trace_id": "51b58b66-f449-6183-7844-7d1c6fb834fd",
          "service_name": "tracegen",
          "operation": "okey-dokey",
          "duration_nano": 123000,
          "statusCode": "STATUS_CODE_UNSET"
        }
      ],
      "totalSpans": 2
    },
    {
      "timestamp": "2023-07-10T15:02:30.67784Z",
      "trace_id": "51b58b66-f449-6183-7844-7d1c6fb834fd",
      "service_name": "tracegen",
      "operation": "lets-go",
      "statusCode": "STATUS_CODE_UNSET",
      "spans": [
        {
          "timestamp": "2023-07-10T15:02:30.67784Z",
          "span_id": "6319FEA0EAA4E4C2",
          "trace_id": "51b58b66-f449-6183-7844-7d1c6fb834fd",
          "service_name": "tracegen",
          "operation": "lets-go",
          "duration_nano": 124000,
          "statusCode": "STATUS_CODE_UNSET"
        },
        {
          "timestamp": "2023-07-10T15:02:30.677841Z",
          "span_id": "ACF1D215C677342D",
          "trace_id": "51b58b66-f449-6183-7844-7d1c6fb834fd",
          "service_name": "tracegen",
          "operation": "okey-dokey",
          "duration_nano": 123000,
          "statusCode": "STATUS_CODE_UNSET"
        }
      ],
      "totalSpans": 2
    },
    {
      "timestamp": "2023-07-10T15:02:30.677847Z",
      "trace_id": "fcdba2a3-e163-1676-09fd-7e8a579b2d16",
      "service_name": "tracegen",
      "operation": "lets-go",
      "statusCode": "STATUS_CODE_UNSET",
      "spans": [
        {
          "timestamp": "2023-07-10T15:02:30.677847Z",
          "span_id": "BFC1E9D5F3C3DC01",
          "trace_id": "fcdba2a3-e163-1676-09fd-7e8a579b2d16",
          "service_name": "tracegen",
          "operation": "lets-go",
          "duration_nano": 126000,
          "statusCode": "STATUS_CODE_UNSET"
        },
        {
          "timestamp": "2023-07-10T15:02:30.677848Z",
          "span_id": "021083418A0CC7D6",
          "trace_id": "fcdba2a3-e163-1676-09fd-7e8a579b2d16",
          "service_name": "tracegen",
          "operation": "okey-dokey",
          "duration_nano": 125000,
          "statusCode": "STATUS_CODE_UNSET"
        }
      ],
      "totalSpans": 2
    },
    {
      "timestamp": "2023-07-10T15:02:30.677847Z",
      "trace_id": "fcdba2a3-e163-1676-09fd-7e8a579b2d16",
      "service_name": "tracegen",
      "operation": "lets-go",
      "statusCode": "STATUS_CODE_UNSET",
      "spans": [
        {
          "timestamp": "2023-07-10T15:02:30.677847Z",
          "span_id": "BFC1E9D5F3C3DC01",
          "trace_id": "fcdba2a3-e163-1676-09fd-7e8a579b2d16",
          "service_name": "tracegen",
          "operation": "lets-go",
          "duration_nano": 126000,
          "statusCode": "STATUS_CODE_UNSET"
        },
        {
          "timestamp": "2023-07-10T15:02:30.677848Z",
          "span_id": "021083418A0CC7D6",
          "trace_id": "fcdba2a3-e163-1676-09fd-7e8a579b2d16",
          "service_name": "tracegen",
          "operation": "okey-dokey",
          "duration_nano": 125000,
          "statusCode": "STATUS_CODE_UNSET"
        }
      ],
      "totalSpans": 2
    },
    {
      "timestamp": "2023-07-10T15:02:30.677877Z",
      "trace_id": "fb03a9e2-cfb5-cf88-5765-9373285acb88",
      "service_name": "tracegen",
      "operation": "okey-dokey",
      "statusCode": "STATUS_CODE_UNSET",
      "spans": [
        {
          "timestamp": "2023-07-10T15:02:30.677877Z",
          "span_id": "D732E63B1D99C410",
          "trace_id": "fb03a9e2-cfb5-cf88-5765-9373285acb88",
          "service_name": "tracegen",
          "operation": "okey-dokey",
          "duration_nano": 124000,
          "statusCode": "STATUS_CODE_UNSET"
        },
        {
          "timestamp": "2023-07-10T15:02:30.677877Z",
          "span_id": "2115BD5B480ED78A",
          "trace_id": "fb03a9e2-cfb5-cf88-5765-9373285acb88",
          "service_name": "tracegen",
          "operation": "lets-go",
          "duration_nano": 124000,
          "statusCode": "STATUS_CODE_UNSET"
        }
      ],
      "totalSpans": 2
    },
    {
      "timestamp": "2023-07-10T15:02:30.677877Z",
      "trace_id": "fb03a9e2-cfb5-cf88-5765-9373285acb88",
      "service_name": "tracegen",
      "operation": "okey-dokey",
      "statusCode": "STATUS_CODE_UNSET",
      "spans": [
        {
          "timestamp": "2023-07-10T15:02:30.677877Z",
          "span_id": "D732E63B1D99C410",
          "trace_id": "fb03a9e2-cfb5-cf88-5765-9373285acb88",
          "service_name": "tracegen",
          "operation": "okey-dokey",
          "duration_nano": 124000,
          "statusCode": "STATUS_CODE_UNSET"
        },
        {
          "timestamp": "2023-07-10T15:02:30.677877Z",
          "span_id": "2115BD5B480ED78A",
          "trace_id": "fb03a9e2-cfb5-cf88-5765-9373285acb88",
          "service_name": "tracegen",
          "operation": "lets-go",
          "duration_nano": 124000,
          "statusCode": "STATUS_CODE_UNSET"
        }
      ],
      "totalSpans": 2
    },
    {
      "timestamp": "2023-07-10T15:02:30.67788Z",
      "trace_id": "a1b1e40c-63d1-cd61-c962-e6672540ad11",
      "service_name": "tracegen",
      "operation": "lets-go",
      "statusCode": "STATUS_CODE_UNSET",
      "spans": [
        {
          "timestamp": "2023-07-10T15:02:30.67788Z",
          "span_id": "479F386B26842545",
          "trace_id": "a1b1e40c-63d1-cd61-c962-e6672540ad11",
          "service_name": "tracegen",
          "operation": "lets-go",
          "duration_nano": 129000,
          "statusCode": "STATUS_CODE_UNSET"
        },
        {
          "timestamp": "2023-07-10T15:02:30.677885Z",
          "span_id": "AC44E5C2E91E801A",
          "trace_id": "a1b1e40c-63d1-cd61-c962-e6672540ad11",
          "service_name": "tracegen",
          "operation": "okey-dokey",
          "duration_nano": 124000,
          "statusCode": "STATUS_CODE_UNSET"
        }
      ],
      "totalSpans": 2
    },
    {
      "timestamp": "2023-07-10T15:02:30.67788Z",
      "trace_id": "a1b1e40c-63d1-cd61-c962-e6672540ad11",
      "service_name": "tracegen",
      "operation": "lets-go",
      "statusCode": "STATUS_CODE_UNSET",
      "spans": [
        {
          "timestamp": "2023-07-10T15:02:30.67788Z",
          "span_id": "479F386B26842545",
          "trace_id": "a1b1e40c-63d1-cd61-c962-e6672540ad11",
          "service_name": "tracegen",
          "operation": "lets-go",
          "duration_nano": 129000,
          "statusCode": "STATUS_CODE_UNSET"
        },
        {
          "timestamp": "2023-07-10T15:02:30.677885Z",
          "span_id": "AC44E5C2E91E801A",
          "trace_id": "a1b1e40c-63d1-cd61-c962-e6672540ad11",
          "service_name": "tracegen",
          "operation": "okey-dokey",
          "duration_nano": 124000,
          "statusCode": "STATUS_CODE_UNSET"
        }
      ],
      "totalSpans": 2
    }
  ],
  "totalTraces": 200
}
