1|Молоко|50.0|10
2|МолОко|70.0|11
3|МолоКО|55.0|15
4|Кефир|55.90|25
5|Масло|75.0|6
6|Хлеб|30.0|10
7|Помидоры|65.0|20
8|Яблоки|40.0|19
9|Бананы|80.5|22
10|Сыр|100.0|18
11|Кокос|30.0|15
12|Молоко|70.0|12
