%!PS-Adobe-3.0
%%Creator: PCBNEW
%%CreationDate: Tue Apr 28 15:00:50 2020
%%Title: /home/markju-adam/Dokumente/FPGA/Cyc1000/Shield/KiCad/Shield_Pi4B_Cyc1000_HegerBoardv2_1/Output/Shield_Pi4B_Cyc1000_HegerBoardv2_1-PTH-drl_map.ps
%%Pages: 1
%%PageOrder: Ascend
%%BoundingBox: 0 0 596 842
%%DocumentMedia: A4 595 842 0 () ()
%%Orientation: Landscape
%%EndComments
%%BeginProlog
/line { newpath moveto lineto stroke } bind def
/cir0 { newpath 0 360 arc stroke } bind def
/cir1 { newpath 0 360 arc gsave fill grestore stroke } bind def
/cir2 { newpath 0 360 arc gsave fill grestore stroke } bind def
/arc0 { newpath arc stroke } bind def
/arc1 { newpath 4 index 4 index moveto arc closepath gsave fill
    grestore stroke } bind def
/arc2 { newpath 4 index 4 index moveto arc closepath gsave fill
    grestore stroke } bind def
/poly0 { stroke } bind def
/poly1 { closepath gsave fill grestore stroke } bind def
/poly2 { closepath gsave fill grestore stroke } bind def
/rect0 { rectstroke } bind def
/rect1 { rectfill } bind def
/rect2 { rectfill } bind def
/linemode0 { 0 setlinecap 0 setlinejoin 0 setlinewidth } bind def
/linemode1 { 1 setlinecap 1 setlinejoin } bind def
/dashedline { [200] 100 setdash } bind def
/solidline { [] 0 setdash } bind def
/phantomshow { moveto
    /KicadFont findfont 0.000001 scalefont setfont
    show } bind def
/textshow { gsave
    findfont exch scalefont setfont concat 1 scale 0 0 moveto show
    } bind def
/reencodefont {
  findfont dup length dict begin
  { 1 index /FID ne
    { def }
    { pop pop } ifelse
  } forall
  /Encoding ISOLatin1Encoding def
  currentdict
  end } bind def
/KicadFont /Helvetica reencodefont definefont pop
/KicadFont-Bold /Helvetica-Bold reencodefont definefont pop
/KicadFont-Oblique /Helvetica-Oblique reencodefont definefont pop
/KicadFont-BoldOblique /Helvetica-BoldOblique reencodefont definefont pop
%%EndProlog
%%Page: 1 1
%%BeginPageSetup
gsave
0.0072 0.0072 scale
linemode1
82680 0 translate 90 rotate
94.478 setlinewidth
%%EndPageSetup
0 0 0 setrgbcolor
74.3921 setlinewidth
newpath
34287.6 76474 moveto
34287.6 64571.3 lineto
stroke
0 0 0 setrgbcolor
80410.7 76474 2231.76 -0 90 arc0
0 0 0 setrgbcolor
80410.7 39278 2231.76 -90 -0 arc0
0 0 0 setrgbcolor
36519.3 39278 2231.76 -180 -90 arc0
0 0 0 setrgbcolor
36519.3 76474 2231.76 90 180 arc0
0 0 0 setrgbcolor
newpath
80410.7 78705.8 moveto
36519.3 78705.8 lineto
stroke
0 0 0 setrgbcolor
newpath
82642.4 39278 moveto
82642.4 76474 lineto
stroke
0 0 0 setrgbcolor
newpath
36519.3 37046.2 moveto
80410.7 37046.2 lineto
stroke
0 0 0 setrgbcolor
newpath
34287.6 64571.3 moveto
34287.6 39278 lineto
stroke
78.7396 setlinewidth
newpath
40142.2 77418.8 moveto
40886.1 76674.9 lineto
stroke
newpath
40886.1 77418.8 moveto
40142.2 76674.9 lineto
stroke
newpath
40142.2 75529.3 moveto
40886.1 74785.3 lineto
stroke
newpath
40886.1 75529.3 moveto
40142.2 74785.3 lineto
stroke
newpath
42031.8 77418.8 moveto
42775.7 76674.9 lineto
stroke
newpath
42775.7 77418.8 moveto
42031.8 76674.9 lineto
stroke
newpath
42031.8 75529.3 moveto
42775.7 74785.3 lineto
stroke
newpath
42775.7 75529.3 moveto
42031.8 74785.3 lineto
stroke
newpath
43921.3 77418.8 moveto
44665.3 76674.9 lineto
stroke
newpath
44665.3 77418.8 moveto
43921.3 76674.9 lineto
stroke
newpath
43921.3 75529.3 moveto
44665.3 74785.3 lineto
stroke
newpath
44665.3 75529.3 moveto
43921.3 74785.3 lineto
stroke
newpath
45810.9 77418.8 moveto
46554.8 76674.9 lineto
stroke
newpath
46554.8 77418.8 moveto
45810.9 76674.9 lineto
stroke
newpath
45810.9 75529.3 moveto
46554.8 74785.3 lineto
stroke
newpath
46554.8 75529.3 moveto
45810.9 74785.3 lineto
stroke
newpath
47700.5 77418.8 moveto
48444.4 76674.9 lineto
stroke
newpath
48444.4 77418.8 moveto
47700.5 76674.9 lineto
stroke
newpath
47700.5 75529.3 moveto
48444.4 74785.3 lineto
stroke
newpath
48444.4 75529.3 moveto
47700.5 74785.3 lineto
stroke
newpath
49590 77418.8 moveto
50333.9 76674.9 lineto
stroke
newpath
50333.9 77418.8 moveto
49590 76674.9 lineto
stroke
newpath
49590 75529.3 moveto
50333.9 74785.3 lineto
stroke
newpath
50333.9 75529.3 moveto
49590 74785.3 lineto
stroke
newpath
51479.6 77418.8 moveto
52223.5 76674.9 lineto
stroke
newpath
52223.5 77418.8 moveto
51479.6 76674.9 lineto
stroke
newpath
51479.6 75529.3 moveto
52223.5 74785.3 lineto
stroke
newpath
52223.5 75529.3 moveto
51479.6 74785.3 lineto
stroke
newpath
53369.1 77418.8 moveto
54113.1 76674.9 lineto
stroke
newpath
54113.1 77418.8 moveto
53369.1 76674.9 lineto
stroke
newpath
53369.1 75529.3 moveto
54113.1 74785.3 lineto
stroke
newpath
54113.1 75529.3 moveto
53369.1 74785.3 lineto
stroke
newpath
55258.7 77418.8 moveto
56002.6 76674.9 lineto
stroke
newpath
56002.6 77418.8 moveto
55258.7 76674.9 lineto
stroke
newpath
55258.7 75529.3 moveto
56002.6 74785.3 lineto
stroke
newpath
56002.6 75529.3 moveto
55258.7 74785.3 lineto
stroke
newpath
57148.3 77418.8 moveto
57892.2 76674.9 lineto
stroke
newpath
57892.2 77418.8 moveto
57148.3 76674.9 lineto
stroke
newpath
57148.3 75529.3 moveto
57892.2 74785.3 lineto
stroke
newpath
57892.2 75529.3 moveto
57148.3 74785.3 lineto
stroke
newpath
59037.8 77418.8 moveto
59781.7 76674.9 lineto
stroke
newpath
59781.7 77418.8 moveto
59037.8 76674.9 lineto
stroke
newpath
59037.8 75529.3 moveto
59781.7 74785.3 lineto
stroke
newpath
59781.7 75529.3 moveto
59037.8 74785.3 lineto
stroke
newpath
60927.4 77418.8 moveto
61671.3 76674.9 lineto
stroke
newpath
61671.3 77418.8 moveto
60927.4 76674.9 lineto
stroke
newpath
60927.4 75529.3 moveto
61671.3 74785.3 lineto
stroke
newpath
61671.3 75529.3 moveto
60927.4 74785.3 lineto
stroke
newpath
62816.9 77418.8 moveto
63560.9 76674.9 lineto
stroke
newpath
63560.9 77418.8 moveto
62816.9 76674.9 lineto
stroke
newpath
62816.9 75529.3 moveto
63560.9 74785.3 lineto
stroke
newpath
63560.9 75529.3 moveto
62816.9 74785.3 lineto
stroke
newpath
64706.5 77418.8 moveto
65450.4 76674.9 lineto
stroke
newpath
65450.4 77418.8 moveto
64706.5 76674.9 lineto
stroke
newpath
64706.5 75529.3 moveto
65450.4 74785.3 lineto
stroke
newpath
65450.4 75529.3 moveto
64706.5 74785.3 lineto
stroke
newpath
66596.1 77418.8 moveto
67340 76674.9 lineto
stroke
newpath
67340 77418.8 moveto
66596.1 76674.9 lineto
stroke
newpath
66596.1 75529.3 moveto
67340 74785.3 lineto
stroke
newpath
67340 75529.3 moveto
66596.1 74785.3 lineto
stroke
newpath
68485.6 77418.8 moveto
69229.5 76674.9 lineto
stroke
newpath
69229.5 77418.8 moveto
68485.6 76674.9 lineto
stroke
newpath
68485.6 75529.3 moveto
69229.5 74785.3 lineto
stroke
newpath
69229.5 75529.3 moveto
68485.6 74785.3 lineto
stroke
newpath
70375.2 77418.8 moveto
71119.1 76674.9 lineto
stroke
newpath
71119.1 77418.8 moveto
70375.2 76674.9 lineto
stroke
newpath
70375.2 75529.3 moveto
71119.1 74785.3 lineto
stroke
newpath
71119.1 75529.3 moveto
70375.2 74785.3 lineto
stroke
newpath
72264.7 77418.8 moveto
73008.7 76674.9 lineto
stroke
newpath
73008.7 77418.8 moveto
72264.7 76674.9 lineto
stroke
newpath
72264.7 75529.3 moveto
73008.7 74785.3 lineto
stroke
newpath
73008.7 75529.3 moveto
72264.7 74785.3 lineto
stroke
newpath
74154.3 77418.8 moveto
74898.2 76674.9 lineto
stroke
newpath
74898.2 77418.8 moveto
74154.3 76674.9 lineto
stroke
newpath
74154.3 75529.3 moveto
74898.2 74785.3 lineto
stroke
newpath
74898.2 75529.3 moveto
74154.3 74785.3 lineto
stroke
newpath
76043.9 77418.8 moveto
76787.8 76674.9 lineto
stroke
newpath
76787.8 77418.8 moveto
76043.9 76674.9 lineto
stroke
newpath
76043.9 75529.3 moveto
76787.8 74785.3 lineto
stroke
newpath
76787.8 75529.3 moveto
76043.9 74785.3 lineto
stroke
41467.9 47722.2 409.157 cir0
41467.9 45832.7 409.157 cir0
43357.4 47722.2 409.157 cir0
43357.4 45832.7 409.157 cir0
45247 47722.2 409.157 cir0
45247 45832.7 409.157 cir0
47136.6 47722.2 409.157 cir0
47136.6 45832.7 409.157 cir0
49026.1 47722.2 409.157 cir0
49026.1 45832.7 409.157 cir0
50915.7 47722.2 409.157 cir0
50915.7 45832.7 409.157 cir0
52805.2 47722.2 409.157 cir0
52805.2 45832.7 409.157 cir0
54694.8 47722.2 409.157 cir0
54694.8 45832.7 409.157 cir0
56584.4 47722.2 409.157 cir0
56584.4 45832.7 409.157 cir0
58473.9 47722.2 409.157 cir0
58473.9 45832.7 409.157 cir0
60363.5 47722.2 409.157 cir0
60363.5 45832.7 409.157 cir0
62253 47722.2 409.157 cir0
62253 45832.7 409.157 cir0
64142.6 47722.2 409.157 cir0
64142.6 45832.7 409.157 cir0
66032.2 47722.2 409.157 cir0
66032.2 45832.7 409.157 cir0
67921.7 47722.2 409.157 cir0
67921.7 45832.7 409.157 cir0
69811.3 47722.2 409.157 cir0
69811.3 45832.7 409.157 cir0
71700.8 47722.2 409.157 cir0
71700.8 45832.7 409.157 cir0
73590.4 47722.2 409.157 cir0
73590.4 45832.7 409.157 cir0
75480 47722.2 409.157 cir0
75480 45832.7 409.157 cir0
77369.5 47722.2 409.157 cir0
77369.5 45832.7 409.157 cir0
52211.7 69914.3 409.157 cir0
52211.7 68024.8 409.157 cir0
52211.7 56686.5 409.157 cir0
52211.7 54796.9 409.157 cir0
54101.2 69914.3 409.157 cir0
54101.2 68024.8 409.157 cir0
54101.2 56686.5 409.157 cir0
54101.2 54796.9 409.157 cir0
55990.8 69914.3 409.157 cir0
55990.8 68024.8 409.157 cir0
55990.8 56686.5 409.157 cir0
55990.8 54796.9 409.157 cir0
57880.4 69914.3 409.157 cir0
57880.4 68024.8 409.157 cir0
57880.4 54796.9 409.157 cir0
59769.9 69914.3 409.157 cir0
59769.9 68024.8 409.157 cir0
59769.9 54796.9 409.157 cir0
61659.5 69914.3 409.157 cir0
61659.5 68024.8 409.157 cir0
61659.5 54796.9 409.157 cir0
63549 69914.3 409.157 cir0
63549 54796.9 409.157 cir0
65438.6 69914.3 409.157 cir0
65438.6 54796.9 409.157 cir0
67328.2 69914.3 409.157 cir0
67328.2 54796.9 409.157 cir0
69217.7 69914.3 409.157 cir0
69217.7 54796.9 409.157 cir0
71107.3 69914.3 409.157 cir0
71107.3 54796.9 409.157 cir0
72996.8 69914.3 409.157 cir0
72996.8 54796.9 409.157 cir0
74886.4 69914.3 409.157 cir0
74886.4 54796.9 409.157 cir0
76776 69914.3 409.157 cir0
76776 54796.9 409.157 cir0
78664.9 67079.8 409.157 cir0
78664.9 65190.2 409.157 cir0
78664.9 63300.7 409.157 cir0
78664.9 61411.1 409.157 cir0
78664.9 59521.6 409.157 cir0
78664.9 57632 409.157 cir0
80554.5 67079.8 409.157 cir0
80554.5 65190.2 409.157 cir0
80554.5 63300.7 409.157 cir0
80554.5 61411.1 409.157 cir0
80554.5 59521.6 409.157 cir0
80554.5 57632 409.157 cir0
newpath
37147.2 70864.9 moveto
37147.2 69377 lineto
stroke
newpath
36403.3 70120.9 moveto
37891.1 70120.9 lineto
stroke
newpath
37147.2 55363 moveto
37147.2 53875.2 lineto
stroke
newpath
36403.3 54619.1 moveto
37891.1 54619.1 lineto
stroke
newpath
79826 70865.1 moveto
79826 69377.3 lineto
stroke
newpath
79082 70121.2 moveto
80569.9 70121.2 lineto
stroke
newpath
79826 55363 moveto
79826 53875.2 lineto
stroke
newpath
79082 54619.1 moveto
80569.9 54619.1 lineto
stroke
newpath
80748.9 75391.9 moveto
80748.9 76812.2 lineto
79328.6 76812.2 lineto
79328.6 75391.9 lineto
80748.9 75391.9 lineto
poly0
newpath
80748.9 38939.8 moveto
80748.9 40360.1 lineto
79328.6 40360.1 lineto
79328.6 38939.8 lineto
80748.9 38939.8 lineto
poly0
newpath
37601.4 75391.9 moveto
37601.4 76812.2 lineto
36181.1 76812.2 lineto
36181.1 75391.9 lineto
37601.4 75391.9 lineto
poly0
newpath
37601.4 38939.8 moveto
37601.4 40360.1 lineto
36181.1 40360.1 lineto
36181.1 38939.8 lineto
37601.4 38939.8 lineto
poly0
118.11 setlinewidth
0 0 0 setrgbcolor
0 0 0 setrgbcolor
newpath
35378 35175.5 moveto
35378 36356.6 lineto
35659.2 36356.6 lineto
35828 36300.3 lineto
35940.5 36187.9 lineto
35996.7 36075.4 lineto
36052.9 35850.4 lineto
36052.9 35681.7 lineto
35996.7 35456.7 lineto
35940.5 35344.2 lineto
35828 35231.7 lineto
35659.2 35175.5 lineto
35378 35175.5 lineto
stroke
newpath
36559.1 35175.5 moveto
36559.1 35962.9 lineto
stroke
newpath
36559.1 35737.9 moveto
36615.4 35850.4 lineto
36671.6 35906.6 lineto
36784.1 35962.9 lineto
36896.6 35962.9 lineto
stroke
newpath
37290.3 35175.5 moveto
37290.3 35962.9 lineto
stroke
newpath
37290.3 36356.6 moveto
37234.1 36300.3 lineto
37290.3 36244.1 lineto
37346.5 36300.3 lineto
37290.3 36356.6 lineto
37290.3 36244.1 lineto
stroke
newpath
38021.5 35175.5 moveto
37909 35231.7 lineto
37852.7 35344.2 lineto
37852.7 36356.6 lineto
stroke
newpath
38640.1 35175.5 moveto
38527.6 35231.7 lineto
38471.4 35344.2 lineto
38471.4 36356.6 lineto
stroke
newpath
39990 35175.5 moveto
39990 36356.6 lineto
40383.7 35512.9 lineto
40777.4 36356.6 lineto
40777.4 35175.5 lineto
stroke
newpath
41846 35175.5 moveto
41846 35794.2 lineto
41789.7 35906.6 lineto
41677.2 35962.9 lineto
41452.3 35962.9 lineto
41339.8 35906.6 lineto
stroke
newpath
41846 35231.7 moveto
41733.5 35175.5 lineto
41452.3 35175.5 lineto
41339.8 35231.7 lineto
41283.5 35344.2 lineto
41283.5 35456.7 lineto
41339.8 35569.2 lineto
41452.3 35625.4 lineto
41733.5 35625.4 lineto
41846 35681.7 lineto
stroke
newpath
42408.4 35962.9 moveto
42408.4 34781.8 lineto
stroke
newpath
42408.4 35906.6 moveto
42520.9 35962.9 lineto
42745.9 35962.9 lineto
42858.3 35906.6 lineto
42914.6 35850.4 lineto
42970.8 35737.9 lineto
42970.8 35400.5 lineto
42914.6 35288 lineto
42858.3 35231.7 lineto
42745.9 35175.5 lineto
42520.9 35175.5 lineto
42408.4 35231.7 lineto
stroke
newpath
43477 35288 moveto
43533.3 35231.7 lineto
43477 35175.5 lineto
43420.8 35231.7 lineto
43477 35288 lineto
43477 35175.5 lineto
stroke
newpath
43477 35906.6 moveto
43533.3 35850.4 lineto
43477 35794.2 lineto
43420.8 35850.4 lineto
43477 35906.6 lineto
43477 35794.2 lineto
stroke
newpath
33506.4 33601.4 moveto
34250.4 32857.5 lineto
stroke
newpath
34250.4 33601.4 moveto
33506.4 32857.5 lineto
stroke
0 0 0 setrgbcolor
0 0 0 setrgbcolor
newpath
35996.7 32695.2 moveto
35321.8 32695.2 lineto
stroke
newpath
35659.2 32695.2 moveto
35659.2 33876.3 lineto
35546.8 33707.5 lineto
35434.3 33595.1 lineto
35321.8 33538.8 lineto
stroke
newpath
36502.9 32807.7 moveto
36559.1 32751.4 lineto
36502.9 32695.2 lineto
36446.6 32751.4 lineto
36502.9 32807.7 lineto
36502.9 32695.2 lineto
stroke
newpath
37290.3 33876.3 moveto
37402.8 33876.3 lineto
37515.3 33820 lineto
37571.5 33763.8 lineto
37627.8 33651.3 lineto
37684 33426.3 lineto
37684 33145.1 lineto
37627.8 32920.1 lineto
37571.5 32807.7 lineto
37515.3 32751.4 lineto
37402.8 32695.2 lineto
37290.3 32695.2 lineto
37177.8 32751.4 lineto
37121.6 32807.7 lineto
37065.3 32920.1 lineto
37009.1 33145.1 lineto
37009.1 33426.3 lineto
37065.3 33651.3 lineto
37121.6 33763.8 lineto
37177.8 33820 lineto
37290.3 33876.3 lineto
stroke
newpath
38415.2 33876.3 moveto
38527.6 33876.3 lineto
38640.1 33820 lineto
38696.4 33763.8 lineto
38752.6 33651.3 lineto
38808.9 33426.3 lineto
38808.9 33145.1 lineto
38752.6 32920.1 lineto
38696.4 32807.7 lineto
38640.1 32751.4 lineto
38527.6 32695.2 lineto
38415.2 32695.2 lineto
38302.7 32751.4 lineto
38246.4 32807.7 lineto
38190.2 32920.1 lineto
38133.9 33145.1 lineto
38133.9 33426.3 lineto
38190.2 33651.3 lineto
38246.4 33763.8 lineto
38302.7 33820 lineto
38415.2 33876.3 lineto
stroke
newpath
39315 32695.2 moveto
39315 33482.6 lineto
stroke
newpath
39315 33370.1 moveto
39371.3 33426.3 lineto
39483.8 33482.6 lineto
39652.5 33482.6 lineto
39765 33426.3 lineto
39821.2 33313.8 lineto
39821.2 32695.2 lineto
stroke
newpath
39821.2 33313.8 moveto
39877.5 33426.3 lineto
39990 33482.6 lineto
40158.7 33482.6 lineto
40271.2 33426.3 lineto
40327.4 33313.8 lineto
40327.4 32695.2 lineto
stroke
newpath
40889.8 32695.2 moveto
40889.8 33482.6 lineto
stroke
newpath
40889.8 33370.1 moveto
40946.1 33426.3 lineto
41058.6 33482.6 lineto
41227.3 33482.6 lineto
41339.8 33426.3 lineto
41396 33313.8 lineto
41396 32695.2 lineto
stroke
newpath
41396 33313.8 moveto
41452.3 33426.3 lineto
41564.8 33482.6 lineto
41733.5 33482.6 lineto
41846 33426.3 lineto
41902.2 33313.8 lineto
41902.2 32695.2 lineto
stroke
newpath
44208.2 33932.5 moveto
43195.8 32414 lineto
stroke
newpath
45726.7 33876.3 moveto
45839.2 33876.3 lineto
45951.7 33820 lineto
46008 33763.8 lineto
46064.2 33651.3 lineto
46120.4 33426.3 lineto
46120.4 33145.1 lineto
46064.2 32920.1 lineto
46008 32807.7 lineto
45951.7 32751.4 lineto
45839.2 32695.2 lineto
45726.7 32695.2 lineto
45614.3 32751.4 lineto
45558 32807.7 lineto
45501.8 32920.1 lineto
45445.5 33145.1 lineto
45445.5 33426.3 lineto
45501.8 33651.3 lineto
45558 33763.8 lineto
45614.3 33820 lineto
45726.7 33876.3 lineto
stroke
newpath
46626.6 32807.7 moveto
46682.9 32751.4 lineto
46626.6 32695.2 lineto
46570.4 32751.4 lineto
46626.6 32807.7 lineto
46626.6 32695.2 lineto
stroke
newpath
47414 33876.3 moveto
47526.5 33876.3 lineto
47639 33820 lineto
47695.2 33763.8 lineto
47751.5 33651.3 lineto
47807.7 33426.3 lineto
47807.7 33145.1 lineto
47751.5 32920.1 lineto
47695.2 32807.7 lineto
47639 32751.4 lineto
47526.5 32695.2 lineto
47414 32695.2 lineto
47301.5 32751.4 lineto
47245.3 32807.7 lineto
47189.1 32920.1 lineto
47132.8 33145.1 lineto
47132.8 33426.3 lineto
47189.1 33651.3 lineto
47245.3 33763.8 lineto
47301.5 33820 lineto
47414 33876.3 lineto
stroke
newpath
48201.4 33876.3 moveto
48932.6 33876.3 lineto
48538.9 33426.3 lineto
48707.6 33426.3 lineto
48820.1 33370.1 lineto
48876.3 33313.8 lineto
48932.6 33201.4 lineto
48932.6 32920.1 lineto
48876.3 32807.7 lineto
48820.1 32751.4 lineto
48707.6 32695.2 lineto
48370.2 32695.2 lineto
48257.7 32751.4 lineto
48201.4 32807.7 lineto
stroke
newpath
49495 32695.2 moveto
49720 32695.2 lineto
49832.5 32751.4 lineto
49888.7 32807.7 lineto
50001.2 32976.4 lineto
50057.4 33201.4 lineto
50057.4 33651.3 lineto
50001.2 33763.8 lineto
49945 33820 lineto
49832.5 33876.3 lineto
49607.5 33876.3 lineto
49495 33820 lineto
49438.8 33763.8 lineto
49382.5 33651.3 lineto
49382.5 33370.1 lineto
49438.8 33257.6 lineto
49495 33201.4 lineto
49607.5 33145.1 lineto
49832.5 33145.1 lineto
49945 33201.4 lineto
50001.2 33257.6 lineto
50057.4 33370.1 lineto
stroke
newpath
50507.4 33876.3 moveto
50507.4 33651.3 lineto
stroke
newpath
50957.3 33876.3 moveto
50957.3 33651.3 lineto
stroke
newpath
52700.9 32245.2 moveto
52644.6 32301.5 lineto
52532.1 32470.2 lineto
52475.9 32582.7 lineto
52419.7 32751.4 lineto
52363.4 33032.6 lineto
52363.4 33257.6 lineto
52419.7 33538.8 lineto
52475.9 33707.5 lineto
52532.1 33820 lineto
52644.6 33988.8 lineto
52700.9 34045 lineto
stroke
newpath
53657 33482.6 moveto
53657 32695.2 lineto
stroke
newpath
53375.8 33932.5 moveto
53094.6 33088.9 lineto
53825.7 33088.9 lineto
stroke
newpath
54500.6 33876.3 moveto
54613.1 33876.3 lineto
54725.6 33820 lineto
54781.9 33763.8 lineto
54838.1 33651.3 lineto
54894.3 33426.3 lineto
54894.3 33145.1 lineto
54838.1 32920.1 lineto
54781.9 32807.7 lineto
54725.6 32751.4 lineto
54613.1 32695.2 lineto
54500.6 32695.2 lineto
54388.2 32751.4 lineto
54331.9 32807.7 lineto
54275.7 32920.1 lineto
54219.4 33145.1 lineto
54219.4 33426.3 lineto
54275.7 33651.3 lineto
54331.9 33763.8 lineto
54388.2 33820 lineto
54500.6 33876.3 lineto
stroke
newpath
56300.4 32695.2 moveto
56300.4 33876.3 lineto
stroke
newpath
56806.6 32695.2 moveto
56806.6 33313.8 lineto
56750.4 33426.3 lineto
56637.9 33482.6 lineto
56469.1 33482.6 lineto
56356.7 33426.3 lineto
56300.4 33370.1 lineto
stroke
newpath
57537.8 32695.2 moveto
57425.3 32751.4 lineto
57369 32807.7 lineto
57312.8 32920.1 lineto
57312.8 33257.6 lineto
57369 33370.1 lineto
57425.3 33426.3 lineto
57537.8 33482.6 lineto
57706.5 33482.6 lineto
57819 33426.3 lineto
57875.2 33370.1 lineto
57931.5 33257.6 lineto
57931.5 32920.1 lineto
57875.2 32807.7 lineto
57819 32751.4 lineto
57706.5 32695.2 lineto
57537.8 32695.2 lineto
stroke
newpath
58606.4 32695.2 moveto
58493.9 32751.4 lineto
58437.6 32863.9 lineto
58437.6 33876.3 lineto
stroke
newpath
59506.3 32751.4 moveto
59393.8 32695.2 lineto
59168.8 32695.2 lineto
59056.3 32751.4 lineto
59000.1 32863.9 lineto
59000.1 33313.8 lineto
59056.3 33426.3 lineto
59168.8 33482.6 lineto
59393.8 33482.6 lineto
59506.3 33426.3 lineto
59562.5 33313.8 lineto
59562.5 33201.4 lineto
59000.1 33088.9 lineto
stroke
newpath
60012.5 32751.4 moveto
60124.9 32695.2 lineto
60349.9 32695.2 lineto
60462.4 32751.4 lineto
60518.6 32863.9 lineto
60518.6 32920.1 lineto
60462.4 33032.6 lineto
60349.9 33088.9 lineto
60181.2 33088.9 lineto
60068.7 33145.1 lineto
60012.5 33257.6 lineto
60012.5 33313.8 lineto
60068.7 33426.3 lineto
60181.2 33482.6 lineto
60349.9 33482.6 lineto
60462.4 33426.3 lineto
stroke
newpath
60912.3 32245.2 moveto
60968.6 32301.5 lineto
61081.1 32470.2 lineto
61137.3 32582.7 lineto
61193.6 32751.4 lineto
61249.8 33032.6 lineto
61249.8 33257.6 lineto
61193.6 33538.8 lineto
61137.3 33707.5 lineto
61081.1 33820 lineto
60968.6 33988.8 lineto
60912.3 34045 lineto
stroke
33841.2 31670.4 409.157 cir0
0 0 0 setrgbcolor
0 0 0 setrgbcolor
newpath
35996.7 31136.1 moveto
35321.8 31136.1 lineto
stroke
newpath
35659.2 31136.1 moveto
35659.2 32317.2 lineto
35546.8 32148.5 lineto
35434.3 32036 lineto
35321.8 31979.8 lineto
stroke
newpath
36502.9 31248.6 moveto
36559.1 31192.4 lineto
36502.9 31136.1 lineto
36446.6 31192.4 lineto
36502.9 31248.6 lineto
36502.9 31136.1 lineto
stroke
newpath
37684 31136.1 moveto
37009.1 31136.1 lineto
stroke
newpath
37346.5 31136.1 moveto
37346.5 32317.2 lineto
37234.1 32148.5 lineto
37121.6 32036 lineto
37009.1 31979.8 lineto
stroke
newpath
38415.2 32317.2 moveto
38527.6 32317.2 lineto
38640.1 32261 lineto
38696.4 32204.7 lineto
38752.6 32092.2 lineto
38808.9 31867.3 lineto
38808.9 31586.1 lineto
38752.6 31361.1 lineto
38696.4 31248.6 lineto
38640.1 31192.4 lineto
38527.6 31136.1 lineto
38415.2 31136.1 lineto
38302.7 31192.4 lineto
38246.4 31248.6 lineto
38190.2 31361.1 lineto
38133.9 31586.1 lineto
38133.9 31867.3 lineto
38190.2 32092.2 lineto
38246.4 32204.7 lineto
38302.7 32261 lineto
38415.2 32317.2 lineto
stroke
newpath
39315 31136.1 moveto
39315 31923.5 lineto
stroke
newpath
39315 31811 moveto
39371.3 31867.3 lineto
39483.8 31923.5 lineto
39652.5 31923.5 lineto
39765 31867.3 lineto
39821.2 31754.8 lineto
39821.2 31136.1 lineto
stroke
newpath
39821.2 31754.8 moveto
39877.5 31867.3 lineto
39990 31923.5 lineto
40158.7 31923.5 lineto
40271.2 31867.3 lineto
40327.4 31754.8 lineto
40327.4 31136.1 lineto
stroke
newpath
40889.8 31136.1 moveto
40889.8 31923.5 lineto
stroke
newpath
40889.8 31811 moveto
40946.1 31867.3 lineto
41058.6 31923.5 lineto
41227.3 31923.5 lineto
41339.8 31867.3 lineto
41396 31754.8 lineto
41396 31136.1 lineto
stroke
newpath
41396 31754.8 moveto
41452.3 31867.3 lineto
41564.8 31923.5 lineto
41733.5 31923.5 lineto
41846 31867.3 lineto
41902.2 31754.8 lineto
41902.2 31136.1 lineto
stroke
newpath
44208.2 32373.5 moveto
43195.8 30854.9 lineto
stroke
newpath
45726.7 32317.2 moveto
45839.2 32317.2 lineto
45951.7 32261 lineto
46008 32204.7 lineto
46064.2 32092.2 lineto
46120.4 31867.3 lineto
46120.4 31586.1 lineto
46064.2 31361.1 lineto
46008 31248.6 lineto
45951.7 31192.4 lineto
45839.2 31136.1 lineto
45726.7 31136.1 lineto
45614.3 31192.4 lineto
45558 31248.6 lineto
45501.8 31361.1 lineto
45445.5 31586.1 lineto
45445.5 31867.3 lineto
45501.8 32092.2 lineto
45558 32204.7 lineto
45614.3 32261 lineto
45726.7 32317.2 lineto
stroke
newpath
46626.6 31248.6 moveto
46682.9 31192.4 lineto
46626.6 31136.1 lineto
46570.4 31192.4 lineto
46626.6 31248.6 lineto
46626.6 31136.1 lineto
stroke
newpath
47414 32317.2 moveto
47526.5 32317.2 lineto
47639 32261 lineto
47695.2 32204.7 lineto
47751.5 32092.2 lineto
47807.7 31867.3 lineto
47807.7 31586.1 lineto
47751.5 31361.1 lineto
47695.2 31248.6 lineto
47639 31192.4 lineto
47526.5 31136.1 lineto
47414 31136.1 lineto
47301.5 31192.4 lineto
47245.3 31248.6 lineto
47189.1 31361.1 lineto
47132.8 31586.1 lineto
47132.8 31867.3 lineto
47189.1 32092.2 lineto
47245.3 32204.7 lineto
47301.5 32261 lineto
47414 32317.2 lineto
stroke
newpath
48820.1 31923.5 moveto
48820.1 31136.1 lineto
stroke
newpath
48538.9 32373.5 moveto
48257.7 31529.8 lineto
48988.8 31529.8 lineto
stroke
newpath
49326.3 32317.2 moveto
50057.4 32317.2 lineto
49663.7 31867.3 lineto
49832.5 31867.3 lineto
49945 31811 lineto
50001.2 31754.8 lineto
50057.4 31642.3 lineto
50057.4 31361.1 lineto
50001.2 31248.6 lineto
49945 31192.4 lineto
49832.5 31136.1 lineto
49495 31136.1 lineto
49382.5 31192.4 lineto
49326.3 31248.6 lineto
stroke
newpath
50507.4 32317.2 moveto
50507.4 32092.2 lineto
stroke
newpath
50957.3 32317.2 moveto
50957.3 32092.2 lineto
stroke
newpath
52700.9 30686.2 moveto
52644.6 30742.4 lineto
52532.1 30911.1 lineto
52475.9 31023.6 lineto
52419.7 31192.4 lineto
52363.4 31473.6 lineto
52363.4 31698.5 lineto
52419.7 31979.8 lineto
52475.9 32148.5 lineto
52532.1 32261 lineto
52644.6 32429.7 lineto
52700.9 32485.9 lineto
stroke
newpath
53319.5 31811 moveto
53207.1 31867.3 lineto
53150.8 31923.5 lineto
53094.6 32036 lineto
53094.6 32092.2 lineto
53150.8 32204.7 lineto
53207.1 32261 lineto
53319.5 32317.2 lineto
53544.5 32317.2 lineto
53657 32261 lineto
53713.2 32204.7 lineto
53769.5 32092.2 lineto
53769.5 32036 lineto
53713.2 31923.5 lineto
53657 31867.3 lineto
53544.5 31811 lineto
53319.5 31811 lineto
53207.1 31754.8 lineto
53150.8 31698.5 lineto
53094.6 31586.1 lineto
53094.6 31361.1 lineto
53150.8 31248.6 lineto
53207.1 31192.4 lineto
53319.5 31136.1 lineto
53544.5 31136.1 lineto
53657 31192.4 lineto
53713.2 31248.6 lineto
53769.5 31361.1 lineto
53769.5 31586.1 lineto
53713.2 31698.5 lineto
53657 31754.8 lineto
53544.5 31811 lineto
stroke
newpath
54331.9 31136.1 moveto
54556.9 31136.1 lineto
54669.4 31192.4 lineto
54725.6 31248.6 lineto
54838.1 31417.3 lineto
54894.3 31642.3 lineto
54894.3 32092.2 lineto
54838.1 32204.7 lineto
54781.9 32261 lineto
54669.4 32317.2 lineto
54444.4 32317.2 lineto
54331.9 32261 lineto
54275.7 32204.7 lineto
54219.4 32092.2 lineto
54219.4 31811 lineto
54275.7 31698.5 lineto
54331.9 31642.3 lineto
54444.4 31586.1 lineto
54669.4 31586.1 lineto
54781.9 31642.3 lineto
54838.1 31698.5 lineto
54894.3 31811 lineto
stroke
newpath
56300.4 31136.1 moveto
56300.4 32317.2 lineto
stroke
newpath
56806.6 31136.1 moveto
56806.6 31754.8 lineto
56750.4 31867.3 lineto
56637.9 31923.5 lineto
56469.1 31923.5 lineto
56356.7 31867.3 lineto
56300.4 31811 lineto
stroke
newpath
57537.8 31136.1 moveto
57425.3 31192.4 lineto
57369 31248.6 lineto
57312.8 31361.1 lineto
57312.8 31698.5 lineto
57369 31811 lineto
57425.3 31867.3 lineto
57537.8 31923.5 lineto
57706.5 31923.5 lineto
57819 31867.3 lineto
57875.2 31811 lineto
57931.5 31698.5 lineto
57931.5 31361.1 lineto
57875.2 31248.6 lineto
57819 31192.4 lineto
57706.5 31136.1 lineto
57537.8 31136.1 lineto
stroke
newpath
58606.4 31136.1 moveto
58493.9 31192.4 lineto
58437.6 31304.8 lineto
58437.6 32317.2 lineto
stroke
newpath
59506.3 31192.4 moveto
59393.8 31136.1 lineto
59168.8 31136.1 lineto
59056.3 31192.4 lineto
59000.1 31304.8 lineto
59000.1 31754.8 lineto
59056.3 31867.3 lineto
59168.8 31923.5 lineto
59393.8 31923.5 lineto
59506.3 31867.3 lineto
59562.5 31754.8 lineto
59562.5 31642.3 lineto
59000.1 31529.8 lineto
stroke
newpath
60012.5 31192.4 moveto
60124.9 31136.1 lineto
60349.9 31136.1 lineto
60462.4 31192.4 lineto
60518.6 31304.8 lineto
60518.6 31361.1 lineto
60462.4 31473.6 lineto
60349.9 31529.8 lineto
60181.2 31529.8 lineto
60068.7 31586.1 lineto
60012.5 31698.5 lineto
60012.5 31754.8 lineto
60068.7 31867.3 lineto
60181.2 31923.5 lineto
60349.9 31923.5 lineto
60462.4 31867.3 lineto
stroke
newpath
60912.3 30686.2 moveto
60968.6 30742.4 lineto
61081.1 30911.1 lineto
61137.3 31023.6 lineto
61193.6 31192.4 lineto
61249.8 31473.6 lineto
61249.8 31698.5 lineto
61193.6 31979.8 lineto
61137.3 32148.5 lineto
61081.1 32261 lineto
60968.6 32429.7 lineto
60912.3 32485.9 lineto
stroke
newpath
33506.4 30855.3 moveto
33506.4 29367.4 lineto
stroke
newpath
32762.5 30111.4 moveto
34250.4 30111.4 lineto
stroke
0 0 0 setrgbcolor
0 0 0 setrgbcolor
newpath
35321.8 30645.7 moveto
35378 30701.9 lineto
35490.5 30758.2 lineto
35771.7 30758.2 lineto
35884.2 30701.9 lineto
35940.5 30645.7 lineto
35996.7 30533.2 lineto
35996.7 30420.7 lineto
35940.5 30252 lineto
35265.5 29577.1 lineto
35996.7 29577.1 lineto
stroke
newpath
36502.9 29689.5 moveto
36559.1 29633.3 lineto
36502.9 29577.1 lineto
36446.6 29633.3 lineto
36502.9 29689.5 lineto
36502.9 29577.1 lineto
stroke
newpath
37290.3 30758.2 moveto
37402.8 30758.2 lineto
37515.3 30701.9 lineto
37571.5 30645.7 lineto
37627.8 30533.2 lineto
37684 30308.2 lineto
37684 30027 lineto
37627.8 29802 lineto
37571.5 29689.5 lineto
37515.3 29633.3 lineto
37402.8 29577.1 lineto
37290.3 29577.1 lineto
37177.8 29633.3 lineto
37121.6 29689.5 lineto
37065.3 29802 lineto
37009.1 30027 lineto
37009.1 30308.2 lineto
37065.3 30533.2 lineto
37121.6 30645.7 lineto
37177.8 30701.9 lineto
37290.3 30758.2 lineto
stroke
newpath
38415.2 30758.2 moveto
38527.6 30758.2 lineto
38640.1 30701.9 lineto
38696.4 30645.7 lineto
38752.6 30533.2 lineto
38808.9 30308.2 lineto
38808.9 30027 lineto
38752.6 29802 lineto
38696.4 29689.5 lineto
38640.1 29633.3 lineto
38527.6 29577.1 lineto
38415.2 29577.1 lineto
38302.7 29633.3 lineto
38246.4 29689.5 lineto
38190.2 29802 lineto
38133.9 30027 lineto
38133.9 30308.2 lineto
38190.2 30533.2 lineto
38246.4 30645.7 lineto
38302.7 30701.9 lineto
38415.2 30758.2 lineto
stroke
newpath
39315 29577.1 moveto
39315 30364.5 lineto
stroke
newpath
39315 30252 moveto
39371.3 30308.2 lineto
39483.8 30364.5 lineto
39652.5 30364.5 lineto
39765 30308.2 lineto
39821.2 30195.7 lineto
39821.2 29577.1 lineto
stroke
newpath
39821.2 30195.7 moveto
39877.5 30308.2 lineto
39990 30364.5 lineto
40158.7 30364.5 lineto
40271.2 30308.2 lineto
40327.4 30195.7 lineto
40327.4 29577.1 lineto
stroke
newpath
40889.8 29577.1 moveto
40889.8 30364.5 lineto
stroke
newpath
40889.8 30252 moveto
40946.1 30308.2 lineto
41058.6 30364.5 lineto
41227.3 30364.5 lineto
41339.8 30308.2 lineto
41396 30195.7 lineto
41396 29577.1 lineto
stroke
newpath
41396 30195.7 moveto
41452.3 30308.2 lineto
41564.8 30364.5 lineto
41733.5 30364.5 lineto
41846 30308.2 lineto
41902.2 30195.7 lineto
41902.2 29577.1 lineto
stroke
newpath
44208.2 30814.4 moveto
43195.8 29295.8 lineto
stroke
newpath
45726.7 30758.2 moveto
45839.2 30758.2 lineto
45951.7 30701.9 lineto
46008 30645.7 lineto
46064.2 30533.2 lineto
46120.4 30308.2 lineto
46120.4 30027 lineto
46064.2 29802 lineto
46008 29689.5 lineto
45951.7 29633.3 lineto
45839.2 29577.1 lineto
45726.7 29577.1 lineto
45614.3 29633.3 lineto
45558 29689.5 lineto
45501.8 29802 lineto
45445.5 30027 lineto
45445.5 30308.2 lineto
45501.8 30533.2 lineto
45558 30645.7 lineto
45614.3 30701.9 lineto
45726.7 30758.2 lineto
stroke
newpath
46626.6 29689.5 moveto
46682.9 29633.3 lineto
46626.6 29577.1 lineto
46570.4 29633.3 lineto
46626.6 29689.5 lineto
46626.6 29577.1 lineto
stroke
newpath
47414 30758.2 moveto
47526.5 30758.2 lineto
47639 30701.9 lineto
47695.2 30645.7 lineto
47751.5 30533.2 lineto
47807.7 30308.2 lineto
47807.7 30027 lineto
47751.5 29802 lineto
47695.2 29689.5 lineto
47639 29633.3 lineto
47526.5 29577.1 lineto
47414 29577.1 lineto
47301.5 29633.3 lineto
47245.3 29689.5 lineto
47189.1 29802 lineto
47132.8 30027 lineto
47132.8 30308.2 lineto
47189.1 30533.2 lineto
47245.3 30645.7 lineto
47301.5 30701.9 lineto
47414 30758.2 lineto
stroke
newpath
48201.4 30758.2 moveto
48988.8 30758.2 lineto
48482.6 29577.1 lineto
stroke
newpath
49495 29577.1 moveto
49720 29577.1 lineto
49832.5 29633.3 lineto
49888.7 29689.5 lineto
50001.2 29858.3 lineto
50057.4 30083.2 lineto
50057.4 30533.2 lineto
50001.2 30645.7 lineto
49945 30701.9 lineto
49832.5 30758.2 lineto
49607.5 30758.2 lineto
49495 30701.9 lineto
49438.8 30645.7 lineto
49382.5 30533.2 lineto
49382.5 30252 lineto
49438.8 30139.5 lineto
49495 30083.2 lineto
49607.5 30027 lineto
49832.5 30027 lineto
49945 30083.2 lineto
50001.2 30139.5 lineto
50057.4 30252 lineto
stroke
newpath
50507.4 30758.2 moveto
50507.4 30533.2 lineto
stroke
newpath
50957.3 30758.2 moveto
50957.3 30533.2 lineto
stroke
newpath
52700.9 29127.1 moveto
52644.6 29183.4 lineto
52532.1 29352.1 lineto
52475.9 29464.6 lineto
52419.7 29633.3 lineto
52363.4 29914.5 lineto
52363.4 30139.5 lineto
52419.7 30420.7 lineto
52475.9 30589.4 lineto
52532.1 30701.9 lineto
52644.6 30870.7 lineto
52700.9 30926.9 lineto
stroke
newpath
53657 30364.5 moveto
53657 29577.1 lineto
stroke
newpath
53375.8 30814.4 moveto
53094.6 29970.8 lineto
53825.7 29970.8 lineto
stroke
newpath
55175.6 29577.1 moveto
55175.6 30758.2 lineto
stroke
newpath
55681.7 29577.1 moveto
55681.7 30195.7 lineto
55625.5 30308.2 lineto
55513 30364.5 lineto
55344.3 30364.5 lineto
55231.8 30308.2 lineto
55175.6 30252 lineto
stroke
newpath
56412.9 29577.1 moveto
56300.4 29633.3 lineto
56244.2 29689.5 lineto
56187.9 29802 lineto
56187.9 30139.5 lineto
56244.2 30252 lineto
56300.4 30308.2 lineto
56412.9 30364.5 lineto
56581.6 30364.5 lineto
56694.1 30308.2 lineto
56750.4 30252 lineto
56806.6 30139.5 lineto
56806.6 29802 lineto
56750.4 29689.5 lineto
56694.1 29633.3 lineto
56581.6 29577.1 lineto
56412.9 29577.1 lineto
stroke
newpath
57481.5 29577.1 moveto
57369 29633.3 lineto
57312.8 29745.8 lineto
57312.8 30758.2 lineto
stroke
newpath
58381.4 29633.3 moveto
58268.9 29577.1 lineto
58043.9 29577.1 lineto
57931.5 29633.3 lineto
57875.2 29745.8 lineto
57875.2 30195.7 lineto
57931.5 30308.2 lineto
58043.9 30364.5 lineto
58268.9 30364.5 lineto
58381.4 30308.2 lineto
58437.6 30195.7 lineto
58437.6 30083.2 lineto
57875.2 29970.8 lineto
stroke
newpath
58887.6 29633.3 moveto
59000.1 29577.1 lineto
59225 29577.1 lineto
59337.5 29633.3 lineto
59393.8 29745.8 lineto
59393.8 29802 lineto
59337.5 29914.5 lineto
59225 29970.8 lineto
59056.3 29970.8 lineto
58943.8 30027 lineto
58887.6 30139.5 lineto
58887.6 30195.7 lineto
58943.8 30308.2 lineto
59056.3 30364.5 lineto
59225 30364.5 lineto
59337.5 30308.2 lineto
stroke
newpath
59787.5 29127.1 moveto
59843.7 29183.4 lineto
59956.2 29352.1 lineto
60012.5 29464.6 lineto
60068.7 29633.3 lineto
60124.9 29914.5 lineto
60124.9 30139.5 lineto
60068.7 30420.7 lineto
60012.5 30589.4 lineto
59956.2 30701.9 lineto
59843.7 30870.7 lineto
59787.5 30926.9 lineto
stroke
newpath
33956.2 27401.6 moveto
33956.2 28821.9 lineto
32535.9 28821.9 lineto
32535.9 27401.6 lineto
33956.2 27401.6 lineto
poly0
0 0 0 setrgbcolor
0 0 0 setrgbcolor
newpath
35321.8 28646 moveto
35378 28702.3 lineto
35490.5 28758.5 lineto
35771.7 28758.5 lineto
35884.2 28702.3 lineto
35940.5 28646 lineto
35996.7 28533.5 lineto
35996.7 28421.1 lineto
35940.5 28252.3 lineto
35265.5 27577.4 lineto
35996.7 27577.4 lineto
stroke
newpath
36502.9 27689.9 moveto
36559.1 27633.7 lineto
36502.9 27577.4 lineto
36446.6 27633.7 lineto
36502.9 27689.9 lineto
36502.9 27577.4 lineto
stroke
newpath
36952.8 28758.5 moveto
37740.2 28758.5 lineto
37234.1 27577.4 lineto
stroke
newpath
38415.2 28758.5 moveto
38527.6 28758.5 lineto
38640.1 28702.3 lineto
38696.4 28646 lineto
38752.6 28533.5 lineto
38808.9 28308.6 lineto
38808.9 28027.4 lineto
38752.6 27802.4 lineto
38696.4 27689.9 lineto
38640.1 27633.7 lineto
38527.6 27577.4 lineto
38415.2 27577.4 lineto
38302.7 27633.7 lineto
38246.4 27689.9 lineto
38190.2 27802.4 lineto
38133.9 28027.4 lineto
38133.9 28308.6 lineto
38190.2 28533.5 lineto
38246.4 28646 lineto
38302.7 28702.3 lineto
38415.2 28758.5 lineto
stroke
newpath
39315 27577.4 moveto
39315 28364.8 lineto
stroke
newpath
39315 28252.3 moveto
39371.3 28308.6 lineto
39483.8 28364.8 lineto
39652.5 28364.8 lineto
39765 28308.6 lineto
39821.2 28196.1 lineto
39821.2 27577.4 lineto
stroke
newpath
39821.2 28196.1 moveto
39877.5 28308.6 lineto
39990 28364.8 lineto
40158.7 28364.8 lineto
40271.2 28308.6 lineto
40327.4 28196.1 lineto
40327.4 27577.4 lineto
stroke
newpath
40889.8 27577.4 moveto
40889.8 28364.8 lineto
stroke
newpath
40889.8 28252.3 moveto
40946.1 28308.6 lineto
41058.6 28364.8 lineto
41227.3 28364.8 lineto
41339.8 28308.6 lineto
41396 28196.1 lineto
41396 27577.4 lineto
stroke
newpath
41396 28196.1 moveto
41452.3 28308.6 lineto
41564.8 28364.8 lineto
41733.5 28364.8 lineto
41846 28308.6 lineto
41902.2 28196.1 lineto
41902.2 27577.4 lineto
stroke
newpath
44208.2 28814.8 moveto
43195.8 27296.2 lineto
stroke
newpath
45726.7 28758.5 moveto
45839.2 28758.5 lineto
45951.7 28702.3 lineto
46008 28646 lineto
46064.2 28533.5 lineto
46120.4 28308.6 lineto
46120.4 28027.4 lineto
46064.2 27802.4 lineto
46008 27689.9 lineto
45951.7 27633.7 lineto
45839.2 27577.4 lineto
45726.7 27577.4 lineto
45614.3 27633.7 lineto
45558 27689.9 lineto
45501.8 27802.4 lineto
45445.5 28027.4 lineto
45445.5 28308.6 lineto
45501.8 28533.5 lineto
45558 28646 lineto
45614.3 28702.3 lineto
45726.7 28758.5 lineto
stroke
newpath
46626.6 27689.9 moveto
46682.9 27633.7 lineto
46626.6 27577.4 lineto
46570.4 27633.7 lineto
46626.6 27689.9 lineto
46626.6 27577.4 lineto
stroke
newpath
47807.7 27577.4 moveto
47132.8 27577.4 lineto
stroke
newpath
47470.3 27577.4 moveto
47470.3 28758.5 lineto
47357.8 28589.8 lineto
47245.3 28477.3 lineto
47132.8 28421.1 lineto
stroke
newpath
48538.9 28758.5 moveto
48651.4 28758.5 lineto
48763.9 28702.3 lineto
48820.1 28646 lineto
48876.3 28533.5 lineto
48932.6 28308.6 lineto
48932.6 28027.4 lineto
48876.3 27802.4 lineto
48820.1 27689.9 lineto
48763.9 27633.7 lineto
48651.4 27577.4 lineto
48538.9 27577.4 lineto
48426.4 27633.7 lineto
48370.2 27689.9 lineto
48313.9 27802.4 lineto
48257.7 28027.4 lineto
48257.7 28308.6 lineto
48313.9 28533.5 lineto
48370.2 28646 lineto
48426.4 28702.3 lineto
48538.9 28758.5 lineto
stroke
newpath
49945 28758.5 moveto
49720 28758.5 lineto
49607.5 28702.3 lineto
49551.3 28646 lineto
49438.8 28477.3 lineto
49382.5 28252.3 lineto
49382.5 27802.4 lineto
49438.8 27689.9 lineto
49495 27633.7 lineto
49607.5 27577.4 lineto
49832.5 27577.4 lineto
49945 27633.7 lineto
50001.2 27689.9 lineto
50057.4 27802.4 lineto
50057.4 28083.6 lineto
50001.2 28196.1 lineto
49945 28252.3 lineto
49832.5 28308.6 lineto
49607.5 28308.6 lineto
49495 28252.3 lineto
49438.8 28196.1 lineto
49382.5 28083.6 lineto
stroke
newpath
50507.4 28758.5 moveto
50507.4 28533.5 lineto
stroke
newpath
50957.3 28758.5 moveto
50957.3 28533.5 lineto
stroke
newpath
52700.9 27127.5 moveto
52644.6 27183.7 lineto
52532.1 27352.4 lineto
52475.9 27464.9 lineto
52419.7 27633.7 lineto
52363.4 27914.9 lineto
52363.4 28139.8 lineto
52419.7 28421.1 lineto
52475.9 28589.8 lineto
52532.1 28702.3 lineto
52644.6 28871 lineto
52700.9 28927.2 lineto
stroke
newpath
53657 28364.8 moveto
53657 27577.4 lineto
stroke
newpath
53375.8 28814.8 moveto
53094.6 27971.1 lineto
53825.7 27971.1 lineto
stroke
newpath
55175.6 27577.4 moveto
55175.6 28758.5 lineto
stroke
newpath
55681.7 27577.4 moveto
55681.7 28196.1 lineto
55625.5 28308.6 lineto
55513 28364.8 lineto
55344.3 28364.8 lineto
55231.8 28308.6 lineto
55175.6 28252.3 lineto
stroke
newpath
56412.9 27577.4 moveto
56300.4 27633.7 lineto
56244.2 27689.9 lineto
56187.9 27802.4 lineto
56187.9 28139.8 lineto
56244.2 28252.3 lineto
56300.4 28308.6 lineto
56412.9 28364.8 lineto
56581.6 28364.8 lineto
56694.1 28308.6 lineto
56750.4 28252.3 lineto
56806.6 28139.8 lineto
56806.6 27802.4 lineto
56750.4 27689.9 lineto
56694.1 27633.7 lineto
56581.6 27577.4 lineto
56412.9 27577.4 lineto
stroke
newpath
57481.5 27577.4 moveto
57369 27633.7 lineto
57312.8 27746.1 lineto
57312.8 28758.5 lineto
stroke
newpath
58381.4 27633.7 moveto
58268.9 27577.4 lineto
58043.9 27577.4 lineto
57931.5 27633.7 lineto
57875.2 27746.1 lineto
57875.2 28196.1 lineto
57931.5 28308.6 lineto
58043.9 28364.8 lineto
58268.9 28364.8 lineto
58381.4 28308.6 lineto
58437.6 28196.1 lineto
58437.6 28083.6 lineto
57875.2 27971.1 lineto
stroke
newpath
58887.6 27633.7 moveto
59000.1 27577.4 lineto
59225 27577.4 lineto
59337.5 27633.7 lineto
59393.8 27746.1 lineto
59393.8 27802.4 lineto
59337.5 27914.9 lineto
59225 27971.1 lineto
59056.3 27971.1 lineto
58943.8 28027.4 lineto
58887.6 28139.8 lineto
58887.6 28196.1 lineto
58943.8 28308.6 lineto
59056.3 28364.8 lineto
59225 28364.8 lineto
59337.5 28308.6 lineto
stroke
newpath
59787.5 27127.5 moveto
59843.7 27183.7 lineto
59956.2 27352.4 lineto
60012.5 27464.9 lineto
60068.7 27633.7 lineto
60124.9 27914.9 lineto
60124.9 28139.8 lineto
60068.7 28421.1 lineto
60012.5 28589.8 lineto
59956.2 28702.3 lineto
59843.7 28871 lineto
59787.5 28927.2 lineto
stroke
showpage
grestore
%%EOF
