%!PS-Adobe-3.0
%%Creator: PCBNEW
%%CreationDate: Tue Apr 28 15:00:50 2020
%%Title: /home/markju-adam/Dokumente/FPGA/Cyc1000/Shield/KiCad/Shield_Pi4B_Cyc1000_HegerBoardv2_1/Output/Shield_Pi4B_Cyc1000_HegerBoardv2_1-NPTH-drl_map.ps
%%Pages: 1
%%PageOrder: Ascend
%%BoundingBox: 0 0 596 842
%%DocumentMedia: A4 595 842 0 () ()
%%Orientation: Landscape
%%EndComments
%%BeginProlog
/line { newpath moveto lineto stroke } bind def
/cir0 { newpath 0 360 arc stroke } bind def
/cir1 { newpath 0 360 arc gsave fill grestore stroke } bind def
/cir2 { newpath 0 360 arc gsave fill grestore stroke } bind def
/arc0 { newpath arc stroke } bind def
/arc1 { newpath 4 index 4 index moveto arc closepath gsave fill
    grestore stroke } bind def
/arc2 { newpath 4 index 4 index moveto arc closepath gsave fill
    grestore stroke } bind def
/poly0 { stroke } bind def
/poly1 { closepath gsave fill grestore stroke } bind def
/poly2 { closepath gsave fill grestore stroke } bind def
/rect0 { rectstroke } bind def
/rect1 { rectfill } bind def
/rect2 { rectfill } bind def
/linemode0 { 0 setlinecap 0 setlinejoin 0 setlinewidth } bind def
/linemode1 { 1 setlinecap 1 setlinejoin } bind def
/dashedline { [200] 100 setdash } bind def
/solidline { [] 0 setdash } bind def
/phantomshow { moveto
    /KicadFont findfont 0.000001 scalefont setfont
    show } bind def
/textshow { gsave
    findfont exch scalefont setfont concat 1 scale 0 0 moveto show
    } bind def
/reencodefont {
  findfont dup length dict begin
  { 1 index /FID ne
    { def }
    { pop pop } ifelse
  } forall
  /Encoding ISOLatin1Encoding def
  currentdict
  end } bind def
/KicadFont /Helvetica reencodefont definefont pop
/KicadFont-Bold /Helvetica-Bold reencodefont definefont pop
/KicadFont-Oblique /Helvetica-Oblique reencodefont definefont pop
/KicadFont-BoldOblique /Helvetica-BoldOblique reencodefont definefont pop
%%EndProlog
%%Page: 1 1
%%BeginPageSetup
gsave
0.0072 0.0072 scale
linemode1
82680 0 translate 90 rotate
94.478 setlinewidth
%%EndPageSetup
0 0 0 setrgbcolor
74.3921 setlinewidth
newpath
34287.6 76474 moveto
34287.6 64571.3 lineto
stroke
0 0 0 setrgbcolor
80410.7 76474 2231.76 -0 90 arc0
0 0 0 setrgbcolor
80410.7 39278 2231.76 -90 -0 arc0
0 0 0 setrgbcolor
36519.3 39278 2231.76 -180 -90 arc0
0 0 0 setrgbcolor
36519.3 76474 2231.76 90 180 arc0
0 0 0 setrgbcolor
newpath
80410.7 78705.8 moveto
36519.3 78705.8 lineto
stroke
0 0 0 setrgbcolor
newpath
82642.4 39278 moveto
82642.4 76474 lineto
stroke
0 0 0 setrgbcolor
newpath
36519.3 37046.2 moveto
80410.7 37046.2 lineto
stroke
0 0 0 setrgbcolor
newpath
34287.6 64571.3 moveto
34287.6 39278 lineto
stroke
78.7396 setlinewidth
118.11 setlinewidth
0 0 0 setrgbcolor
0 0 0 setrgbcolor
newpath
35378 35175.5 moveto
35378 36356.6 lineto
35659.2 36356.6 lineto
35828 36300.3 lineto
35940.5 36187.9 lineto
35996.7 36075.4 lineto
36052.9 35850.4 lineto
36052.9 35681.7 lineto
35996.7 35456.7 lineto
35940.5 35344.2 lineto
35828 35231.7 lineto
35659.2 35175.5 lineto
35378 35175.5 lineto
stroke
newpath
36559.1 35175.5 moveto
36559.1 35962.9 lineto
stroke
newpath
36559.1 35737.9 moveto
36615.4 35850.4 lineto
36671.6 35906.6 lineto
36784.1 35962.9 lineto
36896.6 35962.9 lineto
stroke
newpath
37290.3 35175.5 moveto
37290.3 35962.9 lineto
stroke
newpath
37290.3 36356.6 moveto
37234.1 36300.3 lineto
37290.3 36244.1 lineto
37346.5 36300.3 lineto
37290.3 36356.6 lineto
37290.3 36244.1 lineto
stroke
newpath
38021.5 35175.5 moveto
37909 35231.7 lineto
37852.7 35344.2 lineto
37852.7 36356.6 lineto
stroke
newpath
38640.1 35175.5 moveto
38527.6 35231.7 lineto
38471.4 35344.2 lineto
38471.4 36356.6 lineto
stroke
newpath
39990 35175.5 moveto
39990 36356.6 lineto
40383.7 35512.9 lineto
40777.4 36356.6 lineto
40777.4 35175.5 lineto
stroke
newpath
41846 35175.5 moveto
41846 35794.2 lineto
41789.7 35906.6 lineto
41677.2 35962.9 lineto
41452.3 35962.9 lineto
41339.8 35906.6 lineto
stroke
newpath
41846 35231.7 moveto
41733.5 35175.5 lineto
41452.3 35175.5 lineto
41339.8 35231.7 lineto
41283.5 35344.2 lineto
41283.5 35456.7 lineto
41339.8 35569.2 lineto
41452.3 35625.4 lineto
41733.5 35625.4 lineto
41846 35681.7 lineto
stroke
newpath
42408.4 35962.9 moveto
42408.4 34781.8 lineto
stroke
newpath
42408.4 35906.6 moveto
42520.9 35962.9 lineto
42745.9 35962.9 lineto
42858.3 35906.6 lineto
42914.6 35850.4 lineto
42970.8 35737.9 lineto
42970.8 35400.5 lineto
42914.6 35288 lineto
42858.3 35231.7 lineto
42745.9 35175.5 lineto
42520.9 35175.5 lineto
42408.4 35231.7 lineto
stroke
newpath
43477 35288 moveto
43533.3 35231.7 lineto
43477 35175.5 lineto
43420.8 35231.7 lineto
43477 35288 lineto
43477 35175.5 lineto
stroke
newpath
43477 35906.6 moveto
43533.3 35850.4 lineto
43477 35794.2 lineto
43420.8 35850.4 lineto
43477 35906.6 lineto
43477 35794.2 lineto
stroke
showpage
grestore
%%EOF
