<?xml version="1.0" standalone="no"?>
 <!DOCTYPE svg PUBLIC "-//W3C//DTD SVG 1.1//EN" 
 "http://www.w3.org/Graphics/SVG/1.1/DTD/svg11.dtd"> 
<svg
  xmlns:svg="http://www.w3.org/2000/svg"
  xmlns="http://www.w3.org/2000/svg"
  xmlns:xlink="http://www.w3.org/1999/xlink"
  version="1.1"
  width="100.0252mm" height="80.0354mm" viewBox="0.0000 0.0000 100.0252 80.0354">
<title>SVG Image created as fdrumPCB-B_Cu.svg date 2024/03/22 08:37:58 </title>
  <desc>Image generated by PCBNEW </desc>
<g style="fill:#000000; fill-opacity:1.0000;stroke:#000000; stroke-opacity:1.0000;
stroke-linecap:round; stroke-linejoin:round;"
 transform="translate(0 0) scale(1 1)">
</g>
<g style="fill:none; 
stroke:#000000; stroke-width:1.2000; stroke-opacity:1; 
stroke-linecap:round; stroke-linejoin:round;">
<path d="M33.8550 63.5250
L32.8550 63.5250
" />
<path d="M28.3550 68.0250
L28.3550 69.0250
" />
<path d="M32.8550 73.5250
L33.8550 73.5250
" />
<path d="M33.7750 44.4750
L32.7750 44.4750
" />
<path d="M28.2750 48.9750
L28.2750 49.9750
" />
<path d="M32.7750 54.4750
L33.7750 54.4750
" />
<path d="M33.8550 25.3450
L32.8550 25.3450
" />
<path d="M28.3550 29.8450
L28.3550 30.8450
" />
<path d="M32.8550 35.3450
L33.8550 35.3450
" />
<path d="M33.8550 6.2950
L32.8550 6.2950
" />
<path d="M28.3550 10.7950
L28.3550 11.7950
" />
<path d="M32.8550 16.2950
L33.8550 16.2950
" />
</g>
<g style="fill:#000000; fill-opacity:1.0000; stroke:none;">
<circle cx="42.2450" cy="53.2850" r="0.7000" /> 
<circle cx="49.8650" cy="53.2850" r="0.7000" /> 
<path style="fill:#000000; fill-opacity:1.0000; stroke:none;fill-rule:evenodd;"
d="M 93.4650,12.2250
93.4650,10.5250
95.1650,10.5250
95.1650,12.2250
Z" /> 
</g>
<g style="fill:#000000; fill-opacity:1.0000; stroke:none;">
<circle cx="91.7750" cy="11.3750" r="0.8500" /> 
<circle cx="94.3150" cy="13.9150" r="0.8500" /> 
<circle cx="91.7750" cy="13.9150" r="0.8500" /> 
<circle cx="94.3150" cy="16.4550" r="0.8500" /> 
<circle cx="91.7750" cy="16.4550" r="0.8500" /> 
<circle cx="94.3150" cy="18.9950" r="0.8500" /> 
<circle cx="91.7750" cy="18.9950" r="0.8500" /> 
<circle cx="94.3150" cy="21.5350" r="0.8500" /> 
<circle cx="91.7750" cy="21.5350" r="0.8500" /> 
<circle cx="94.3150" cy="24.0750" r="0.8500" /> 
<circle cx="91.7750" cy="24.0750" r="0.8500" /> 
<circle cx="94.3150" cy="26.6150" r="0.8500" /> 
<circle cx="91.7750" cy="26.6150" r="0.8500" /> 
<circle cx="94.3150" cy="29.1550" r="0.8500" /> 
<circle cx="91.7750" cy="29.1550" r="0.8500" /> 
<circle cx="94.3150" cy="31.6950" r="0.8500" /> 
<circle cx="91.7750" cy="31.6950" r="0.8500" /> 
<circle cx="94.3150" cy="34.2350" r="0.8500" /> 
<circle cx="91.7750" cy="34.2350" r="0.8500" /> 
<circle cx="94.3150" cy="36.7750" r="0.8500" /> 
<circle cx="91.7750" cy="36.7750" r="0.8500" /> 
<circle cx="94.3150" cy="39.3150" r="0.8500" /> 
<circle cx="91.7750" cy="39.3150" r="0.8500" /> 
<circle cx="94.3150" cy="41.8550" r="0.8500" /> 
<circle cx="91.7750" cy="41.8550" r="0.8500" /> 
<circle cx="94.3150" cy="44.3950" r="0.8500" /> 
<circle cx="91.7750" cy="44.3950" r="0.8500" /> 
<circle cx="94.3150" cy="46.9350" r="0.8500" /> 
<circle cx="91.7750" cy="46.9350" r="0.8500" /> 
<circle cx="94.3150" cy="49.4750" r="0.8500" /> 
<circle cx="91.7750" cy="49.4750" r="0.8500" /> 
<circle cx="94.3150" cy="52.0150" r="0.8500" /> 
<circle cx="91.7750" cy="52.0150" r="0.8500" /> 
<circle cx="94.3150" cy="54.5550" r="0.8500" /> 
<circle cx="91.7750" cy="54.5550" r="0.8500" /> 
<circle cx="94.3150" cy="57.0950" r="0.8500" /> 
<circle cx="91.7750" cy="57.0950" r="0.8500" /> 
<circle cx="94.3150" cy="59.6350" r="0.8500" /> 
<circle cx="91.7750" cy="59.6350" r="0.8500" /> 
<circle cx="49.8650" cy="41.8550" r="0.8000" /> 
<path style="fill:#000000; fill-opacity:1.0000; stroke:none;fill-rule:evenodd;"
d="M 41.4450,42.6550
41.4450,41.0550
43.0450,41.0550
43.0450,42.6550
Z" /> 
<circle cx="42.2450" cy="76.1450" r="0.8000" /> 
<path style="fill:#000000; fill-opacity:1.0000; stroke:none;fill-rule:evenodd;"
d="M 50.6650,75.3450
50.6650,76.9450
49.0650,76.9450
49.0650,75.3450
Z" /> 
<circle cx="49.8650" cy="26.6650" r="0.7000" /> 
<circle cx="42.2450" cy="26.6650" r="0.7000" /> 
<path style="fill:#000000; fill-opacity:1.0000; stroke:none;fill-rule:evenodd;"
d="M 65.5250,12.2250
65.5250,10.5250
67.2250,10.5250
67.2250,12.2250
Z" /> 
</g>
<g style="fill:#000000; fill-opacity:1.0000; stroke:none;">
<circle cx="63.8350" cy="11.3750" r="0.8500" /> 
<circle cx="66.3750" cy="13.9150" r="0.8500" /> 
<circle cx="63.8350" cy="13.9150" r="0.8500" /> 
<circle cx="66.3750" cy="16.4550" r="0.8500" /> 
<circle cx="63.8350" cy="16.4550" r="0.8500" /> 
<circle cx="66.3750" cy="18.9950" r="0.8500" /> 
<circle cx="63.8350" cy="18.9950" r="0.8500" /> 
<circle cx="66.3750" cy="21.5350" r="0.8500" /> 
<circle cx="63.8350" cy="21.5350" r="0.8500" /> 
<circle cx="66.3750" cy="24.0750" r="0.8500" /> 
<circle cx="63.8350" cy="24.0750" r="0.8500" /> 
<circle cx="66.3750" cy="26.6150" r="0.8500" /> 
<circle cx="63.8350" cy="26.6150" r="0.8500" /> 
<circle cx="66.3750" cy="29.1550" r="0.8500" /> 
<circle cx="63.8350" cy="29.1550" r="0.8500" /> 
<circle cx="66.3750" cy="31.6950" r="0.8500" /> 
<circle cx="63.8350" cy="31.6950" r="0.8500" /> 
<circle cx="66.3750" cy="34.2350" r="0.8500" /> 
<circle cx="63.8350" cy="34.2350" r="0.8500" /> 
<circle cx="66.3750" cy="36.7750" r="0.8500" /> 
<circle cx="63.8350" cy="36.7750" r="0.8500" /> 
<circle cx="66.3750" cy="39.3150" r="0.8500" /> 
<circle cx="63.8350" cy="39.3150" r="0.8500" /> 
<circle cx="66.3750" cy="41.8550" r="0.8500" /> 
<circle cx="63.8350" cy="41.8550" r="0.8500" /> 
<circle cx="66.3750" cy="44.3950" r="0.8500" /> 
<circle cx="63.8350" cy="44.3950" r="0.8500" /> 
<circle cx="66.3750" cy="46.9350" r="0.8500" /> 
<circle cx="63.8350" cy="46.9350" r="0.8500" /> 
<circle cx="66.3750" cy="49.4750" r="0.8500" /> 
<circle cx="63.8350" cy="49.4750" r="0.8500" /> 
<circle cx="66.3750" cy="52.0150" r="0.8500" /> 
<circle cx="63.8350" cy="52.0150" r="0.8500" /> 
<circle cx="66.3750" cy="54.5550" r="0.8500" /> 
<circle cx="63.8350" cy="54.5550" r="0.8500" /> 
<circle cx="66.3750" cy="57.0950" r="0.8500" /> 
<circle cx="63.8350" cy="57.0950" r="0.8500" /> 
<circle cx="66.3750" cy="59.6350" r="0.8500" /> 
<circle cx="63.8350" cy="59.6350" r="0.8500" /> 
</g>
<g style="fill:none; 
stroke:#000000; stroke-width:1.2000; stroke-opacity:1; 
stroke-linecap:round; stroke-linejoin:round;">
<path d="M92.1750 11.3750
L91.3750 11.3750
" />
<path d="M92.1750 13.9150
L91.3750 13.9150
" />
<path d="M92.1750 16.4550
L91.3750 16.4550
" />
<path d="M92.1750 18.9950
L91.3750 18.9950
" />
<path d="M92.1750 21.5350
L91.3750 21.5350
" />
<path d="M92.1750 24.0750
L91.3750 24.0750
" />
<path d="M92.1750 26.6150
L91.3750 26.6150
" />
<path d="M92.1750 29.1550
L91.3750 29.1550
" />
<path d="M92.1750 31.6950
L91.3750 31.6950
" />
<path d="M92.1750 34.2350
L91.3750 34.2350
" />
<path d="M92.1750 36.7750
L91.3750 36.7750
" />
<path d="M92.1750 39.3150
L91.3750 39.3150
" />
<path d="M92.1750 41.8550
L91.3750 41.8550
" />
<path d="M92.1750 44.3950
L91.3750 44.3950
" />
<path d="M92.1750 46.9350
L91.3750 46.9350
" />
<path d="M92.1750 49.4750
L91.3750 49.4750
" />
<path d="M92.1750 52.0150
L91.3750 52.0150
" />
<path d="M92.1713 54.5523
L91.3713 54.5523
" />
<path d="M92.1713 57.0923
L91.3713 57.0923
" />
<path d="M66.7750 57.0950
L65.9750 57.0950
" />
<path d="M66.7750 54.5550
L65.9750 54.5550
" />
<path d="M66.7750 52.0150
L65.9750 52.0150
" />
<path d="M66.7750 49.4750
L65.9750 49.4750
" />
<path d="M66.7750 46.9350
L65.9750 46.9350
" />
<path d="M66.7750 44.3950
L65.9750 44.3950
" />
<path d="M66.7750 41.8550
L65.9750 41.8550
" />
<path d="M66.7750 39.3150
L65.9750 39.3150
" />
<path d="M66.7750 36.7750
L65.9750 36.7750
" />
<path d="M66.7750 34.2350
L65.9750 34.2350
" />
<path d="M66.7750 31.6950
L65.9750 31.6950
" />
<path d="M66.7750 29.1550
L65.9750 29.1550
" />
<path d="M66.7750 26.6150
L65.9750 26.6150
" />
<path d="M66.7750 24.0750
L65.9750 24.0750
" />
<path d="M66.7750 21.5350
L65.9750 21.5350
" />
<path d="M66.7750 18.9950
L65.9750 18.9950
" />
<path d="M66.7750 16.4550
L65.9750 16.4550
" />
<path d="M66.7750 13.9150
L65.9750 13.9150
" />
<path style="fill:#000000; fill-opacity:1.0000; stroke:none;fill-rule:evenodd;"
d="M 65.3750,10.7750
67.3750,10.7750
67.3750,11.9750
65.3750,11.9750
Z" /> 
</g>
<g style="fill:#000000; fill-opacity:1.0000; stroke:none;">
<circle cx="42.2450" cy="30.4750" r="0.7000" /> 
<circle cx="49.8650" cy="30.4750" r="0.7000" /> 
</g>
<g style="fill:#000000; fill-opacity:1.0000; stroke:none;">
<circle cx="49.8650" cy="45.6650" r="0.7000" /> 
<circle cx="42.2450" cy="45.6650" r="0.7000" /> 
</g>
<g style="fill:#000000; fill-opacity:1.0000; stroke:none;">
<circle cx="49.8650" cy="3.7550" r="0.8000" /> 
<path style="fill:#000000; fill-opacity:1.0000; stroke:none;fill-rule:evenodd;"
d="M 41.4450,4.5550
41.4450,2.9550
43.0450,2.9550
43.0450,4.5550
Z" /> 
<circle cx="42.2450" cy="72.3350" r="0.7000" /> 
<circle cx="49.8650" cy="72.3350" r="0.7000" /> 
</g>
<g style="fill:#000000; fill-opacity:1.0000; stroke:none;">
<circle cx="49.8650" cy="22.8050" r="0.8000" /> 
<path style="fill:#000000; fill-opacity:1.0000; stroke:none;fill-rule:evenodd;"
d="M 41.4450,23.6050
41.4450,22.0050
43.0450,22.0050
43.0450,23.6050
Z" /> 
<circle cx="42.2450" cy="11.3750" r="0.7000" /> 
<circle cx="49.8650" cy="11.3750" r="0.7000" /> 
</g>
<g style="fill:#000000; fill-opacity:1.0000; stroke:none;">
<circle cx="49.8650" cy="60.9050" r="0.8000" /> 
<path style="fill:#000000; fill-opacity:1.0000; stroke:none;fill-rule:evenodd;"
d="M 41.4450,61.7050
41.4450,60.1050
43.0450,60.1050
43.0450,61.7050
Z" /> 
<circle cx="42.2450" cy="15.1850" r="0.7000" /> 
<circle cx="49.8650" cy="15.1850" r="0.7000" /> 
</g>
<g style="fill:#000000; fill-opacity:1.0000; stroke:none;">
<circle cx="49.8650" cy="64.7150" r="0.7000" /> 
<circle cx="42.2450" cy="64.7150" r="0.7000" /> 
</g>
<g style="fill:#000000; fill-opacity:1.0000; stroke:none;">
<circle cx="42.2450" cy="18.9950" r="0.8000" /> 
<path style="fill:#000000; fill-opacity:1.0000; stroke:none;fill-rule:evenodd;"
d="M 50.6650,18.1950
50.6650,19.7950
49.0650,19.7950
49.0650,18.1950
Z" /> 
<circle cx="42.2450" cy="34.2350" r="0.7000" /> 
<circle cx="49.8650" cy="34.2350" r="0.7000" /> 
</g>
<g style="fill:#000000; fill-opacity:1.0000; stroke:none;">
<circle cx="42.2450" cy="68.5250" r="0.7000" /> 
<circle cx="49.8650" cy="68.5250" r="0.7000" /> 
</g>
<g style="fill:#000000; fill-opacity:1.0000; stroke:none;">
<circle cx="49.8650" cy="7.5650" r="0.7000" /> 
<circle cx="42.2450" cy="7.5650" r="0.7000" /> 
</g>
<g style="fill:#000000; fill-opacity:1.0000; stroke:none;">
<circle cx="42.2450" cy="49.4750" r="0.7000" /> 
<circle cx="49.8650" cy="49.4750" r="0.7000" /> 
</g>
<g style="fill:#000000; fill-opacity:1.0000; stroke:none;">
<circle cx="42.2450" cy="57.0950" r="0.8000" /> 
<path style="fill:#000000; fill-opacity:1.0000; stroke:none;fill-rule:evenodd;"
d="M 50.6650,56.2950
50.6650,57.8950
49.0650,57.8950
49.0650,56.2950
Z" /> 
<circle cx="42.2450" cy="38.0450" r="0.8000" /> 
<path style="fill:#000000; fill-opacity:1.0000; stroke:none;fill-rule:evenodd;"
d="M 50.6650,37.2450
50.6650,38.8450
49.0650,38.8450
49.0650,37.2450
Z" /> 
</g>
<g style="fill:none; 
stroke:#000000; stroke-width:0.4000; stroke-opacity:1; 
stroke-linecap:round; stroke-linejoin:round;">
<path d="M61.6188 46.6112 A5.4415 5.4415 0.0 0 0 60.0250 50.4590" />
<path d="M61.6188 46.6112
L63.8350 44.3950
" />
<path d="M63.8350 29.1550
L53.9988 38.9912
" />
<path d="M50.3140 40.1360
L63.8350 26.6150
" />
<path d="M60.3970 22.8050 A2.1680 2.1680 0.0 0 0 61.9300 22.1700" />
<path d="M63.2000 21.5350 A1.5330 1.5330 0.0 0 0 62.1160 21.9840" />
<path d="M62.1160 21.9840
L61.9300 22.1700
" />
<path d="M63.8350 11.3750
L55.2688 2.8088
" />
<path d="M63.8350 11.3750
L66.3750 11.3750
" />
<path d="M51.4210 1.2150
L46.5811 1.2150
" />
<path d="M43.5150 2.4850
L42.2450 3.7550
" />
<path d="M46.5811 1.2150 A4.3360 4.3360 0.0 0 0 43.5150 2.4850" />
<path d="M55.2688 2.8088 A5.4416 5.4416 0.0 0 0 51.4210 1.2150" />
<path d="M49.8650 11.3750
L49.8650 7.5650
" />
<path d="M49.8650 15.1850
L49.8650 18.9950
" />
<path d="M49.8650 7.5650
L49.8650 3.7550
" />
<path d="M66.3750 24.0750
L63.8350 24.0750
" />
<path d="M49.8650 11.3750
L49.8650 15.1850
" />
<path d="M42.2450 38.0450
L42.2450 34.2350
" />
<path d="M84.1550 21.2490
L84.1550 24.6150
" />
<path d="M28.3550 31.4435
L28.3550 29.2465
" />
<path d="M42.2450 38.0450
L35.6829 38.0450
" />
<path d="M32.5675 17.7045
L29.1318 14.2688
" />
<path d="M28.3550 12.3935
L28.3550 11.2950
" />
<path d="M85.7488 17.4012
L91.7750 11.3750
" />
<path d="M32.5675 23.9355
L29.1318 27.3712
" />
<path d="M63.8350 44.3950
L66.3750 44.3950
" />
<path d="M32.0080 55.7480
L29.1730 52.9130
" />
<path d="M28.2750 50.4878
L28.2750 48.3765
" />
<path d="M43.5150 77.4150
L42.2450 76.1450
" />
<path d="M29.1318 33.3188
L32.5675 36.7545
" />
<path d="M86.4090 26.6150
L91.7750 26.6150
" />
<path d="M29.0518 46.5012
L32.5675 42.9855
" />
<path d="M42.2450 57.0950
L42.2450 53.2850
" />
<path d="M46.5811 78.6850
L50.1510 78.6850
" />
<path d="M66.3750 44.3950
L82.5612 28.2088
" />
<path d="M42.2450 76.1450
L42.2450 72.3350
" />
<path d="M28.2750 50.4878
L28.2750 50.6593
" />
<path d="M35.6090 76.1450
L42.2450 76.1450
" />
<path d="M28.2750 50.6593
L28.2750 50.7450
" />
<path d="M31.7612 74.5512
L29.2813 72.0713
" />
<path d="M32.0080 62.2520
L29.2813 64.9787
" />
<path d="M53.9988 77.0912
L58.4312 72.6588
" />
<path d="M35.6829 18.9950
L42.2450 18.9950
" />
<path d="M42.2450 57.0950
L35.2600 57.0950
" />
<path d="M28.3550 68.5250
L28.3550 67.2150
" />
<path d="M28.3550 68.5250
L28.3550 69.8350
" />
<path d="M42.2450 18.9950
L42.2450 15.1850
" />
<path d="M60.0250 50.4590
L60.0250 68.8110
" />
<path d="M33.3550 59.0000 A4.5991 4.5991 0.0 0 0 32.0080 55.7480" />
<path d="M29.0518 46.5012 A2.6521 2.6521 0.0 0 0 28.2750 48.3765" />
<path d="M33.8579 20.8200 A4.4059 4.4059 0.0 0 0 32.5675 17.7045" />
<path d="M58.4312 72.6588 A5.4416 5.4416 0.0 0 0 60.0250 68.8110" />
<path d="M28.2750 50.7450 A3.0661 3.0661 0.0 0 0 29.1730 52.9130" />
<path d="M28.3550 12.3935 A2.6521 2.6521 0.0 0 0 29.1318 14.2688" />
<path d="M28.3550 69.8350 A3.1626 3.1626 0.0 0 0 29.2813 72.0713" />
<path d="M31.7612 74.5512 A5.4416 5.4416 0.0 0 0 35.6090 76.1450" />
<path d="M84.1550 24.6150 A2.1384 2.1384 0.0 0 0 86.4090 26.6150" />
<path d="M32.0080 62.2520 A4.5991 4.5991 0.0 0 0 33.3550 59.0000" />
<path d="M32.5675 23.9355 A4.4059 4.4059 0.0 0 0 33.8579 20.8200" />
<path d="M32.5675 42.9855 A4.4059 4.4059 0.0 0 0 33.8579 39.8700" />
<path d="M29.1318 27.3712 A2.6521 2.6521 0.0 0 0 28.3550 29.2465" />
<path d="M50.1510 78.6850 A5.4416 5.4416 0.0 0 0 53.9988 77.0912" />
<path d="M32.5675 36.7545 A4.4059 4.4059 0.0 0 0 35.6829 38.0450" />
<path d="M35.6829 38.0450 A1.8250 1.8250 0.0 0 0 33.8579 39.8700" />
<path d="M32.5675 17.7045 A4.4059 4.4059 0.0 0 0 35.6829 18.9950" />
<path d="M33.8579 39.8700 A4.4059 4.4059 0.0 0 0 32.5675 36.7545" />
<path d="M29.2813 64.9787 A3.1626 3.1626 0.0 0 0 28.3550 67.2150" />
<path d="M35.2600 57.0950 A1.9050 1.9050 0.0 0 0 33.3550 59.0000" />
<path d="M32.0080 55.7480 A4.5991 4.5991 0.0 0 0 35.2600 57.0950" />
<path d="M82.5612 28.2088 A5.1513 5.1513 0.0 0 0 84.1550 24.6150" />
<path d="M86.4090 26.6150 A5.4415 5.4415 0.0 0 0 82.5612 28.2088" />
<path d="M28.3550 31.4435 A2.6521 2.6521 0.0 0 0 29.1318 33.3188" />
<path d="M35.6829 18.9950 A1.8250 1.8250 0.0 0 0 33.8579 20.8200" />
<path d="M43.5150 77.4150 A4.3361 4.3361 0.0 0 0 46.5811 78.6850" />
<path d="M85.7488 17.4012 A5.4415 5.4415 0.0 0 0 84.1550 21.2490" />
<path d="M49.8650 30.4750
L49.8650 34.2350
" />
<path d="M49.8650 30.4750
L49.8650 26.6650
" />
<path d="M49.8650 22.8050
L60.3970 22.8050
" />
<path d="M64.4700 21.5350
L63.2000 21.5350
" />
<path d="M49.8650 22.8050
L49.8650 26.6650
" />
<path d="M49.8650 34.2350
L49.8650 38.0450
" />
<path d="M64.4700 21.5350
L66.3750 21.5350
" />
<path d="M49.8650 45.6650
L49.8650 41.8550
" />
<path d="M49.8650 53.2850
L49.8650 57.0950
" />
<path d="M63.8350 26.6150
L66.3750 26.6150
" />
<path d="M49.8650 41.2200
L49.8650 41.8550
" />
<path d="M49.8650 49.4750
L49.8650 45.6650
" />
<path d="M49.8650 53.2850
L49.8650 49.4750
" />
<path d="M50.3140 40.1360 A1.5330 1.5330 0.0 0 0 49.8650 41.2200" />
<path d="M52.4050 56.5689
L52.4050 42.8390
" />
<path d="M49.8650 68.5250
L49.8650 64.7150
" />
<path d="M51.1350 59.6350
L49.8650 60.9050
" />
<path d="M49.8650 64.7150
L49.8650 60.9050
" />
<path d="M49.8650 72.3350
L49.8650 68.5250
" />
<path d="M49.8650 72.3350
L49.8650 76.1450
" />
<path d="M63.8350 29.1550
L66.3750 29.1550
" />
<path d="M51.1350 59.6350 A4.3361 4.3361 0.0 0 0 52.4050 56.5689" />
<path d="M53.9988 38.9912 A5.4415 5.4415 0.0 0 0 52.4050 42.8390" />
<path d="M38.7286 14.8914
L42.2450 11.3750
" />
<path d="M35.3400 16.2950
L33.3550 16.2950
" />
<path d="M35.3400 16.2950 A4.7922 4.7922 0.0 0 0 38.7286 14.8914" />
<path d="M38.7963 33.9237
L42.2450 30.4750
" />
<path d="M35.3650 35.3450
L33.3550 35.3450
" />
<path d="M35.3650 35.3450 A4.8526 4.8526 0.0 0 0 38.7963 33.9237" />
<path d="M38.6486 53.0714
L42.2450 49.4750
" />
<path d="M35.2600 54.4750
L33.2750 54.4750
" />
<path d="M35.2600 54.4750 A4.7922 4.7922 0.0 0 0 38.6486 53.0714" />
<path d="M35.3000 73.5250
L33.3550 73.5250
" />
<path d="M38.6203 72.1497
L42.2450 68.5250
" />
<path d="M35.3000 73.5250 A4.6956 4.6956 0.0 0 0 38.6203 72.1497" />
<path style="fill:#000000; fill-opacity:1.0000; stroke:none;fill-rule:evenodd;"
d="M 43.3820,2.3489
43.6487,2.6218
43.6521,2.6301
43.6506,2.6356
43.5329,2.8477
43.5328,2.8477
43.4109,3.1033
43.4109,3.1033
43.2889,3.3950
43.1670,3.7227
43.0490,4.0745
43.0431,4.0812
43.0342,4.0819
43.0334,4.0816
42.2488,3.7576
42.2424,3.7512
41.9192,2.9685
41.9192,2.9595
41.9255,2.9532
41.9280,2.9525
42.2059,2.9044
42.4982,2.8178
42.7906,2.6952
43.0829,2.5366
43.3671,2.3474
43.3759,2.3456
Z" /> 
<path style="fill:#000000; fill-opacity:1.0000; stroke:none;fill-rule:evenodd;"
d="M 50.5002,7.8281
50.5065,7.8344
50.5065,7.8434
50.5062,7.8441
50.3761,8.1075
50.3755,8.1086
50.2539,8.2990
50.1552,8.4655
50.1552,8.4655
50.0891,8.6675
50.0659,8.9542
50.0618,8.9622
50.0542,8.9650
49.6758,8.9650
49.6675,8.9616
49.6641,8.9542
49.6409,8.6676
49.6409,8.6676
49.6409,8.6675
49.6083,8.5680
49.5748,8.4655
49.4761,8.2990
49.3545,8.1086
49.3539,8.1075
49.2238,7.8441
49.2232,7.8351
49.2291,7.8284
49.2298,7.8281
49.8605,7.5659
49.8695,7.5659
Z" /> 
<path style="fill:#000000; fill-opacity:1.0000; stroke:none;fill-rule:evenodd;"
d="M 50.0625,9.9784
50.0659,9.9858
50.0891,10.2724
50.1552,10.4745
50.1552,10.4745
50.2539,10.6410
50.3755,10.8314
50.3761,10.8325
50.5062,11.0959
50.5068,11.1049
50.5009,11.1116
50.5002,11.1119
49.8695,11.3741
49.8605,11.3741
49.8605,11.3741
49.2298,11.1119
49.2235,11.1056
49.2235,11.0966
49.2238,11.0960
49.3539,10.8325
49.3545,10.8314
49.4761,10.6410
49.5748,10.4745
49.6409,10.2724
49.6641,9.9858
49.6682,9.9778
49.6758,9.9750
50.0542,9.9750
Z" /> 
<path style="fill:#000000; fill-opacity:1.0000; stroke:none;fill-rule:evenodd;"
d="M 50.5002,15.4481
50.5065,15.4544
50.5065,15.4634
50.5062,15.4641
50.3761,15.7275
50.3755,15.7286
50.2539,15.9190
50.1552,16.0855
50.1552,16.0855
50.0891,16.2875
50.0659,16.5742
50.0618,16.5822
50.0542,16.5850
49.6758,16.5850
49.6675,16.5816
49.6641,16.5742
49.6409,16.2876
49.6409,16.2876
49.6409,16.2875
49.6083,16.1880
49.5748,16.0855
49.4761,15.9190
49.3545,15.7286
49.3539,15.7275
49.2238,15.4641
49.2232,15.4551
49.2291,15.4484
49.2298,15.4481
49.8605,15.1859
49.8695,15.1859
Z" /> 
<path style="fill:#000000; fill-opacity:1.0000; stroke:none;fill-rule:evenodd;"
d="M 50.0663,17.3984
50.0683,17.4011
50.1850,17.6150
50.1850,17.6150
50.3050,17.8050
50.3050,17.8050
50.4250,17.9650
50.5450,18.0950
50.6552,18.1868
50.6593,18.1947
50.6567,18.2033
50.6560,18.2041
49.8733,18.9877
49.8650,18.9911
49.8567,18.9877
49.8567,18.9877
49.4767,18.6072
49.0740,18.2041
49.0706,18.1958
49.0741,18.1875
49.0748,18.1868
49.1850,18.0950
49.3050,17.9650
49.4250,17.8050
49.5450,17.6150
49.6617,17.4011
49.6686,17.3955
49.6719,17.3950
50.0581,17.3950
Z" /> 
<path style="fill:#000000; fill-opacity:1.0000; stroke:none;fill-rule:evenodd;"
d="M 50.0625,6.1684
50.0659,6.1758
50.0891,6.4624
50.1552,6.6645
50.1552,6.6645
50.2539,6.8310
50.3755,7.0214
50.3761,7.0225
50.5062,7.2859
50.5068,7.2949
50.5009,7.3016
50.5002,7.3019
49.8695,7.5641
49.8605,7.5641
49.8605,7.5641
49.2298,7.3019
49.2235,7.2956
49.2235,7.2866
49.2238,7.2860
49.3539,7.0225
49.3545,7.0214
49.4761,6.8310
49.5748,6.6645
49.6409,6.4624
49.6641,6.1758
49.6682,6.1678
49.6758,6.1650
50.0542,6.1650
Z" /> 
<path style="fill:#000000; fill-opacity:1.0000; stroke:none;fill-rule:evenodd;"
d="M 50.5515,4.0393
50.5925,4.0563
50.5988,4.0627
50.5988,4.0716
50.5984,4.0724
50.4454,4.3764
50.4446,4.3777
50.2985,4.5945
50.1775,4.7833
50.0953,5.0135
50.0659,5.3443
50.0618,5.3523
50.0543,5.3550
49.6757,5.3550
49.6674,5.3516
49.6641,5.3443
49.6347,5.0135
49.6347,5.0135
49.5525,4.7833
49.4315,4.5945
49.2854,4.3777
49.2846,4.3764
49.1316,4.0724
49.1309,4.0635
49.1367,4.0567
49.1375,4.0563
49.8605,3.7559
49.8695,3.7559
Z" /> 
<path style="fill:#000000; fill-opacity:1.0000; stroke:none;fill-rule:evenodd;"
d="M 65.1417,23.8135
65.1470,23.8207
65.1469,23.8266
65.1388,23.8570
65.1388,23.8570
65.1197,24.0750
65.1197,24.0750
65.1388,24.2930
65.1388,24.2930
65.1469,24.3234
65.1458,24.3323
65.1387,24.3377
65.1328,24.3378
65.0754,24.3234
65.0682,24.3180
65.0669,24.3092
65.0669,24.3091
65.0712,24.2930
65.0903,24.0750
65.0903,24.0750
65.0712,23.8570
65.0712,23.8570
65.0669,23.8410
65.0681,23.8321
65.0752,23.8267
65.0752,23.8267
65.1328,23.8122
Z" /> 
<path style="fill:#000000; fill-opacity:1.0000; stroke:none;fill-rule:evenodd;"
d="M 50.0625,13.7884
50.0659,13.7958
50.0891,14.0824
50.1552,14.2845
50.1552,14.2845
50.2539,14.4510
50.3755,14.6414
50.3761,14.6425
50.5062,14.9059
50.5068,14.9149
50.5009,14.9216
50.5002,14.9219
49.8695,15.1841
49.8605,15.1841
49.8605,15.1841
49.2298,14.9219
49.2235,14.9156
49.2235,14.9066
49.2238,14.9060
49.3539,14.6425
49.3545,14.6414
49.4761,14.4510
49.5748,14.2845
49.6409,14.0824
49.6641,13.7958
49.6682,13.7878
49.6758,13.7850
50.0542,13.7850
Z" /> 
<path style="fill:#000000; fill-opacity:1.0000; stroke:none;fill-rule:evenodd;"
d="M 50.5002,11.6381
50.5065,11.6444
50.5065,11.6534
50.5062,11.6541
50.3761,11.9175
50.3755,11.9186
50.2539,12.1090
50.1552,12.2755
50.1552,12.2755
50.0891,12.4775
50.0659,12.7642
50.0618,12.7722
50.0542,12.7750
49.6758,12.7750
49.6675,12.7716
49.6641,12.7642
49.6409,12.4776
49.6409,12.4776
49.6409,12.4775
49.6083,12.3780
49.5748,12.2755
49.4761,12.1090
49.3545,11.9186
49.3539,11.9175
49.2238,11.6541
49.2232,11.6451
49.2291,11.6384
49.2298,11.6381
49.8605,11.3759
49.8695,11.3759
Z" /> 
<path style="fill:#000000; fill-opacity:1.0000; stroke:none;fill-rule:evenodd;"
d="M 42.4426,36.4484
42.4459,36.4557
42.4753,36.7865
42.5575,37.0167
42.6785,37.2055
42.8246,37.4223
42.8254,37.4236
42.9784,37.7276
42.9791,37.7365
42.9733,37.7433
42.9725,37.7437
42.2495,38.0441
42.2405,38.0441
42.2405,38.0441
41.5175,37.7437
41.5112,37.7373
41.5112,37.7284
41.5115,37.7276
41.6646,37.4236
41.6654,37.4223
41.8115,37.2055
41.9325,37.0167
42.0147,36.7865
42.0441,36.4557
42.0482,36.4477
42.0557,36.4450
42.4343,36.4450
Z" /> 
<path style="fill:#000000; fill-opacity:1.0000; stroke:none;fill-rule:evenodd;"
d="M 42.8802,34.4981
42.8865,34.5044
42.8865,34.5134
42.8862,34.5141
42.7561,34.7775
42.7555,34.7786
42.6339,34.9690
42.5352,35.1355
42.5352,35.1355
42.4691,35.3375
42.4459,35.6242
42.4418,35.6322
42.4342,35.6350
42.0558,35.6350
42.0475,35.6316
42.0441,35.6242
42.0209,35.3376
42.0209,35.3376
42.0209,35.3375
41.9883,35.2380
41.9548,35.1355
41.8561,34.9690
41.7345,34.7786
41.7339,34.7775
41.6038,34.5141
41.6032,34.5051
41.6091,34.4984
41.6098,34.4981
42.2405,34.2359
42.2495,34.2359
Z" /> 
<path style="fill:#000000; fill-opacity:1.0000; stroke:none;fill-rule:evenodd;"
d="M 41.9433,37.3167
41.9437,37.3175
42.2441,38.0405
42.2441,38.0495
42.2441,38.0495
42.2441,38.0495
41.9437,38.7725
41.9373,38.7788
41.9284,38.7788
41.9276,38.7784
41.6236,38.6254
41.6223,38.6246
41.4055,38.4785
41.2167,38.3575
41.2167,38.3575
41.2167,38.3575
40.9865,38.2753
40.9865,38.2753
40.9865,38.2753
40.6557,38.2459
40.6477,38.2418
40.6450,38.2343
40.6450,37.8557
40.6484,37.8474
40.6557,37.8441
40.9865,37.8147
41.2167,37.7325
41.4055,37.6115
41.6223,37.4654
41.6236,37.4646
41.9276,37.3116
41.9365,37.3109
Z" /> 
<path style="fill:#000000; fill-opacity:1.0000; stroke:none;fill-rule:evenodd;"
d="M 90.7136,12.0394
90.8134,12.1819
90.9681,12.3366
91.0547,12.3972
91.0595,12.4048
91.0576,12.4135
91.0548,12.4164
90.9327,12.5026
90.9239,12.5045
90.9176,12.5013
90.6467,12.2304
90.6433,12.2221
90.6438,12.2187
90.6721,12.1260
90.6721,12.1260
90.6721,12.1259
90.6927,12.0432
90.6980,12.0361
90.7069,12.0347
Z" /> 
<path style="fill:#000000; fill-opacity:1.0000; stroke:none;fill-rule:evenodd;"
d="M 42.9814,75.8437
42.9878,75.8500
42.9880,75.8508
43.0948,76.1740
43.0952,76.1754
43.1451,76.4321
43.1931,76.6511
43.2407,76.7515
43.2977,76.8720
43.2977,76.8720
43.2977,76.8720
43.4007,76.9950
43.5109,77.1267
43.5136,77.1353
43.5102,77.1425
43.2425,77.4102
43.2342,77.4136
43.2267,77.4109
43.1248,77.3256
42.9720,77.1977
42.9720,77.1977
42.9720,77.1977
42.8395,77.1349
42.7511,77.0931
42.5321,77.0451
42.2754,76.9952
42.2740,76.9948
41.9508,76.8880
41.9440,76.8822
41.9434,76.8733
41.9436,76.8725
42.2424,76.1488
42.2488,76.1424
42.2488,76.1424
42.9725,75.8437
Z" /> 
<path style="fill:#000000; fill-opacity:1.0000; stroke:none;fill-rule:evenodd;"
d="M 90.5417,26.3535
90.5470,26.3607
90.5469,26.3666
90.5388,26.3970
90.5388,26.3970
90.5197,26.6150
90.5197,26.6150
90.5388,26.8330
90.5388,26.8330
90.5469,26.8634
90.5458,26.8723
90.5387,26.8777
90.5328,26.8778
90.4008,26.8447
90.4008,26.8447
90.1966,26.8164
90.1889,26.8119
90.1865,26.8048
90.1865,26.4252
90.1900,26.4169
90.1966,26.4136
90.4008,26.3853
90.5328,26.3522
Z" /> 
<path style="fill:#000000; fill-opacity:1.0000; stroke:none;fill-rule:evenodd;"
d="M 42.4426,55.4984
42.4459,55.5057
42.4753,55.8365
42.5575,56.0667
42.6785,56.2555
42.8246,56.4723
42.8254,56.4736
42.9784,56.7776
42.9791,56.7865
42.9733,56.7933
42.9725,56.7937
42.2495,57.0941
42.2405,57.0941
42.2405,57.0941
41.5175,56.7937
41.5112,56.7873
41.5112,56.7784
41.5115,56.7776
41.6646,56.4736
41.6654,56.4723
41.8115,56.2555
41.9325,56.0667
42.0147,55.8365
42.0441,55.5057
42.0482,55.4977
42.0557,55.4950
42.4343,55.4950
Z" /> 
<path style="fill:#000000; fill-opacity:1.0000; stroke:none;fill-rule:evenodd;"
d="M 42.8802,53.5481
42.8865,53.5544
42.8865,53.5634
42.8862,53.5641
42.7561,53.8275
42.7555,53.8286
42.6339,54.0190
42.5352,54.1855
42.5352,54.1855
42.4691,54.3875
42.4459,54.6742
42.4418,54.6822
42.4342,54.6850
42.0558,54.6850
42.0475,54.6816
42.0441,54.6742
42.0209,54.3876
42.0209,54.3876
42.0209,54.3875
41.9883,54.2880
41.9548,54.1855
41.8561,54.0190
41.7345,53.8286
41.7339,53.8275
41.6038,53.5641
41.6032,53.5551
41.6091,53.5484
41.6098,53.5481
42.2405,53.2859
42.2495,53.2859
Z" /> 
<path style="fill:#000000; fill-opacity:1.0000; stroke:none;fill-rule:evenodd;"
d="M 42.8802,72.5981
42.8865,72.6044
42.8865,72.6134
42.8862,72.6141
42.7561,72.8775
42.7555,72.8786
42.6339,73.0690
42.5352,73.2355
42.5352,73.2355
42.4691,73.4375
42.4459,73.7242
42.4418,73.7322
42.4342,73.7350
42.0558,73.7350
42.0475,73.7316
42.0441,73.7242
42.0209,73.4376
42.0209,73.4376
42.0209,73.4375
41.9883,73.3380
41.9548,73.2355
41.8561,73.0690
41.7345,72.8786
41.7339,72.8775
41.6038,72.6141
41.6032,72.6051
41.6091,72.5984
41.6098,72.5981
42.2405,72.3359
42.2495,72.3359
Z" /> 
<path style="fill:#000000; fill-opacity:1.0000; stroke:none;fill-rule:evenodd;"
d="M 42.4426,74.5484
42.4459,74.5557
42.4753,74.8865
42.5575,75.1167
42.6785,75.3055
42.8246,75.5223
42.8254,75.5236
42.9784,75.8276
42.9791,75.8365
42.9733,75.8433
42.9725,75.8437
42.2495,76.1441
42.2405,76.1441
42.2405,76.1441
41.5175,75.8437
41.5112,75.8373
41.5112,75.8284
41.5115,75.8276
41.6646,75.5236
41.6654,75.5223
41.8115,75.3055
41.9325,75.1167
42.0147,74.8865
42.0441,74.5557
42.0482,74.5477
42.0557,74.5450
42.4343,74.5450
Z" /> 
<path style="fill:#000000; fill-opacity:1.0000; stroke:none;fill-rule:evenodd;"
d="M 41.9433,75.4167
41.9437,75.4175
42.2441,76.1405
42.2441,76.1495
42.2441,76.1495
42.2441,76.1495
41.9437,76.8725
41.9373,76.8788
41.9284,76.8788
41.9276,76.8784
41.6236,76.7254
41.6223,76.7246
41.4055,76.5785
41.2167,76.4575
41.2167,76.4575
41.2167,76.4575
40.9865,76.3753
40.9865,76.3753
40.9865,76.3753
40.6557,76.3459
40.6477,76.3418
40.6450,76.3343
40.6450,75.9557
40.6484,75.9474
40.6557,75.9441
40.9865,75.9147
41.2167,75.8325
41.4055,75.7115
41.6223,75.5654
41.6236,75.5646
41.9276,75.4116
41.9365,75.4109
Z" /> 
<path style="fill:#000000; fill-opacity:1.0000; stroke:none;fill-rule:evenodd;"
d="M 41.9433,18.2667
41.9437,18.2675
42.2441,18.9905
42.2441,18.9995
42.2441,18.9995
42.2441,18.9995
41.9437,19.7225
41.9373,19.7288
41.9284,19.7288
41.9276,19.7284
41.6236,19.5754
41.6223,19.5746
41.4055,19.4285
41.2167,19.3075
41.2167,19.3075
41.2167,19.3075
40.9865,19.2253
40.9865,19.2253
40.9865,19.2253
40.6557,19.1959
40.6477,19.1918
40.6450,19.1843
40.6450,18.8057
40.6484,18.7974
40.6557,18.7941
40.9865,18.7647
41.2167,18.6825
41.4055,18.5615
41.6223,18.4154
41.6236,18.4146
41.9276,18.2616
41.9365,18.2609
Z" /> 
<path style="fill:#000000; fill-opacity:1.0000; stroke:none;fill-rule:evenodd;"
d="M 41.9433,56.3667
41.9437,56.3675
42.2441,57.0905
42.2441,57.0995
42.2441,57.0995
42.2441,57.0995
41.9437,57.8225
41.9373,57.8288
41.9284,57.8288
41.9276,57.8284
41.6236,57.6754
41.6223,57.6746
41.4055,57.5285
41.2167,57.4075
41.2167,57.4075
41.2167,57.4075
40.9865,57.3253
40.9865,57.3253
40.9865,57.3253
40.6557,57.2959
40.6477,57.2918
40.6450,57.2843
40.6450,56.9057
40.6484,56.8974
40.6557,56.8941
40.9865,56.8647
41.2167,56.7825
41.4055,56.6615
41.6223,56.5154
41.6236,56.5146
41.9276,56.3616
41.9365,56.3609
Z" /> 
<path style="fill:#000000; fill-opacity:1.0000; stroke:none;fill-rule:evenodd;"
d="M 42.8802,15.4481
42.8865,15.4544
42.8865,15.4634
42.8862,15.4641
42.7561,15.7275
42.7555,15.7286
42.6339,15.9190
42.5352,16.0855
42.5352,16.0855
42.4691,16.2875
42.4459,16.5742
42.4418,16.5822
42.4342,16.5850
42.0558,16.5850
42.0475,16.5816
42.0441,16.5742
42.0209,16.2876
42.0209,16.2876
42.0209,16.2875
41.9883,16.1880
41.9548,16.0855
41.8561,15.9190
41.7345,15.7286
41.7339,15.7275
41.6038,15.4641
41.6032,15.4551
41.6091,15.4484
41.6098,15.4481
42.2405,15.1859
42.2495,15.1859
Z" /> 
<path style="fill:#000000; fill-opacity:1.0000; stroke:none;fill-rule:evenodd;"
d="M 42.4426,17.3984
42.4459,17.4057
42.4753,17.7365
42.5575,17.9667
42.6785,18.1555
42.8246,18.3723
42.8254,18.3736
42.9784,18.6776
42.9791,18.6865
42.9733,18.6933
42.9725,18.6937
42.2495,18.9941
42.2405,18.9941
42.2405,18.9941
41.5175,18.6937
41.5112,18.6873
41.5112,18.6784
41.5115,18.6776
41.6646,18.3736
41.6654,18.3723
41.8115,18.1555
41.9325,17.9667
42.0147,17.7365
42.0441,17.4057
42.0482,17.3977
42.0557,17.3950
42.4343,17.3950
Z" /> 
<path style="fill:#000000; fill-opacity:1.0000; stroke:none;fill-rule:evenodd;"
d="M 50.5002,30.7381
50.5065,30.7444
50.5065,30.7534
50.5062,30.7541
50.3761,31.0175
50.3755,31.0186
50.2539,31.2090
50.1552,31.3755
50.1552,31.3755
50.0891,31.5775
50.0659,31.8642
50.0618,31.8722
50.0542,31.8750
49.6758,31.8750
49.6675,31.8716
49.6641,31.8642
49.6409,31.5776
49.6409,31.5776
49.6409,31.5775
49.6083,31.4780
49.5748,31.3755
49.4761,31.2090
49.3545,31.0186
49.3539,31.0175
49.2238,30.7541
49.2232,30.7451
49.2291,30.7384
49.2298,30.7381
49.8605,30.4759
49.8695,30.4759
Z" /> 
<path style="fill:#000000; fill-opacity:1.0000; stroke:none;fill-rule:evenodd;"
d="M 50.0625,32.8384
50.0659,32.8458
50.0891,33.1324
50.1552,33.3345
50.1552,33.3345
50.2539,33.5010
50.3755,33.6914
50.3761,33.6925
50.5062,33.9559
50.5068,33.9649
50.5009,33.9716
50.5002,33.9719
49.8695,34.2341
49.8605,34.2341
49.8605,34.2341
49.2298,33.9719
49.2235,33.9656
49.2235,33.9566
49.2238,33.9560
49.3539,33.6925
49.3545,33.6914
49.4761,33.5010
49.5748,33.3345
49.6409,33.1324
49.6641,32.8458
49.6682,32.8378
49.6758,32.8350
50.0542,32.8350
Z" /> 
<path style="fill:#000000; fill-opacity:1.0000; stroke:none;fill-rule:evenodd;"
d="M 50.0625,29.0784
50.0659,29.0858
50.0891,29.3724
50.1552,29.5745
50.1552,29.5745
50.2539,29.7410
50.3755,29.9314
50.3761,29.9325
50.5062,30.1959
50.5068,30.2049
50.5009,30.2116
50.5002,30.2119
49.8695,30.4741
49.8605,30.4741
49.8605,30.4741
49.2298,30.2119
49.2235,30.2056
49.2235,30.1966
49.2238,30.1960
49.3539,29.9325
49.3545,29.9314
49.4761,29.7410
49.5748,29.5745
49.6409,29.3724
49.6641,29.0858
49.6682,29.0778
49.6758,29.0750
50.0542,29.0750
Z" /> 
<path style="fill:#000000; fill-opacity:1.0000; stroke:none;fill-rule:evenodd;"
d="M 50.5002,26.9281
50.5065,26.9344
50.5065,26.9434
50.5062,26.9441
50.3761,27.2075
50.3755,27.2086
50.2539,27.3990
50.1552,27.5655
50.1552,27.5655
50.0891,27.7675
50.0659,28.0542
50.0618,28.0622
50.0542,28.0650
49.6758,28.0650
49.6675,28.0616
49.6641,28.0542
49.6409,27.7676
49.6409,27.7676
49.6409,27.7675
49.6083,27.6680
49.5748,27.5655
49.4761,27.3990
49.3545,27.2086
49.3539,27.2075
49.2238,26.9441
49.2232,26.9351
49.2291,26.9284
49.2298,26.9281
49.8605,26.6659
49.8695,26.6659
Z" /> 
<path style="fill:#000000; fill-opacity:1.0000; stroke:none;fill-rule:evenodd;"
d="M 50.1816,22.0712
50.1824,22.0715
50.4864,22.2246
50.4877,22.2254
50.6335,22.3237
50.7045,22.3715
50.8646,22.4741
50.8933,22.4925
51.1235,22.5747
51.4543,22.6041
51.4623,22.6082
51.4650,22.6157
51.4650,22.9943
51.4616,23.0026
51.4543,23.0059
51.1235,23.0353
50.8933,23.1175
50.7045,23.2385
50.4877,23.3846
50.4864,23.3854
50.1824,23.5384
50.1735,23.5391
50.1667,23.5333
50.1663,23.5325
50.1052,23.3854
49.8659,22.8095
49.8659,22.8005
50.1663,22.0775
50.1727,22.0712
Z" /> 
<path style="fill:#000000; fill-opacity:1.0000; stroke:none;fill-rule:evenodd;"
d="M 50.5515,23.0893
50.5925,23.1063
50.5988,23.1127
50.5988,23.1216
50.5984,23.1224
50.4454,23.4264
50.4446,23.4277
50.2985,23.6445
50.1775,23.8333
50.0953,24.0635
50.0659,24.3943
50.0618,24.4023
50.0543,24.4050
49.6757,24.4050
49.6674,24.4016
49.6641,24.3943
49.6347,24.0635
49.6347,24.0635
49.5525,23.8333
49.4315,23.6445
49.2854,23.4277
49.2846,23.4264
49.1316,23.1224
49.1309,23.1135
49.1367,23.1067
49.1375,23.1063
49.8605,22.8059
49.8695,22.8059
Z" /> 
<path style="fill:#000000; fill-opacity:1.0000; stroke:none;fill-rule:evenodd;"
d="M 50.0625,25.2684
50.0659,25.2758
50.0891,25.5624
50.1552,25.7645
50.1552,25.7645
50.2539,25.9310
50.3755,26.1214
50.3761,26.1225
50.5062,26.3859
50.5068,26.3949
50.5009,26.4016
50.5002,26.4019
49.8695,26.6641
49.8605,26.6641
49.8605,26.6641
49.2298,26.4019
49.2235,26.3956
49.2235,26.3866
49.2238,26.3860
49.3539,26.1225
49.3545,26.1214
49.4761,25.9310
49.5748,25.7645
49.6409,25.5624
49.6641,25.2758
49.6682,25.2678
49.6758,25.2650
50.0542,25.2650
Z" /> 
<path style="fill:#000000; fill-opacity:1.0000; stroke:none;fill-rule:evenodd;"
d="M 50.5002,34.4981
50.5065,34.5044
50.5065,34.5134
50.5062,34.5141
50.3761,34.7775
50.3755,34.7786
50.2539,34.9690
50.1552,35.1355
50.1552,35.1355
50.0891,35.3375
50.0659,35.6242
50.0618,35.6322
50.0542,35.6350
49.6758,35.6350
49.6675,35.6316
49.6641,35.6242
49.6409,35.3376
49.6409,35.3376
49.6409,35.3375
49.6083,35.2380
49.5748,35.1355
49.4761,34.9690
49.3545,34.7786
49.3539,34.7775
49.2238,34.5141
49.2232,34.5051
49.2291,34.4984
49.2298,34.4981
49.8605,34.2359
49.8695,34.2359
Z" /> 
<path style="fill:#000000; fill-opacity:1.0000; stroke:none;fill-rule:evenodd;"
d="M 50.0663,36.4484
50.0683,36.4511
50.1850,36.6650
50.1850,36.6650
50.3050,36.8550
50.3050,36.8550
50.4250,37.0150
50.5450,37.1450
50.6552,37.2368
50.6593,37.2447
50.6567,37.2533
50.6560,37.2541
49.8733,38.0377
49.8650,38.0411
49.8567,38.0377
49.8567,38.0377
49.4767,37.6572
49.0740,37.2541
49.0706,37.2458
49.0741,37.2375
49.0748,37.2368
49.1850,37.1450
49.3050,37.0150
49.4250,36.8550
49.5450,36.6650
49.6617,36.4511
49.6686,36.4455
49.6719,36.4450
50.0581,36.4450
Z" /> 
<path style="fill:#000000; fill-opacity:1.0000; stroke:none;fill-rule:evenodd;"
d="M 50.0625,44.2684
50.0659,44.2758
50.0891,44.5624
50.1552,44.7645
50.1552,44.7645
50.2539,44.9310
50.3755,45.1214
50.3761,45.1225
50.5062,45.3859
50.5068,45.3949
50.5009,45.4016
50.5002,45.4019
49.8695,45.6641
49.8605,45.6641
49.8605,45.6641
49.2298,45.4019
49.2235,45.3956
49.2235,45.3866
49.2238,45.3860
49.3539,45.1225
49.3545,45.1214
49.4761,44.9310
49.5748,44.7645
49.6409,44.5624
49.6641,44.2758
49.6682,44.2678
49.6758,44.2650
50.0542,44.2650
Z" /> 
<path style="fill:#000000; fill-opacity:1.0000; stroke:none;fill-rule:evenodd;"
d="M 50.5515,42.1393
50.5925,42.1563
50.5988,42.1627
50.5988,42.1716
50.5984,42.1724
50.4454,42.4764
50.4446,42.4777
50.2985,42.6945
50.1775,42.8833
50.0953,43.1135
50.0659,43.4443
50.0618,43.4523
50.0543,43.4550
49.6757,43.4550
49.6674,43.4516
49.6641,43.4443
49.6347,43.1135
49.6347,43.1135
49.5525,42.8833
49.4315,42.6945
49.2854,42.4777
49.2846,42.4764
49.1316,42.1724
49.1309,42.1635
49.1367,42.1567
49.1375,42.1563
49.8605,41.8559
49.8695,41.8559
Z" /> 
<path style="fill:#000000; fill-opacity:1.0000; stroke:none;fill-rule:evenodd;"
d="M 50.0663,55.4984
50.0683,55.5011
50.1850,55.7150
50.1850,55.7150
50.3050,55.9050
50.3050,55.9050
50.4250,56.0650
50.5450,56.1950
50.6552,56.2868
50.6593,56.2947
50.6567,56.3033
50.6560,56.3041
49.8733,57.0877
49.8650,57.0911
49.8567,57.0877
49.8567,57.0877
49.4767,56.7072
49.0740,56.3041
49.0706,56.2958
49.0741,56.2875
49.0748,56.2868
49.1850,56.1950
49.3050,56.0650
49.4250,55.9050
49.5450,55.7150
49.6617,55.5011
49.6686,55.4955
49.6719,55.4950
50.0581,55.4950
Z" /> 
<path style="fill:#000000; fill-opacity:1.0000; stroke:none;fill-rule:evenodd;"
d="M 50.5002,53.5481
50.5065,53.5544
50.5065,53.5634
50.5062,53.5641
50.3761,53.8275
50.3755,53.8286
50.2539,54.0190
50.1552,54.1855
50.1552,54.1855
50.0891,54.3875
50.0659,54.6742
50.0618,54.6822
50.0542,54.6850
49.6758,54.6850
49.6675,54.6816
49.6641,54.6742
49.6409,54.3876
49.6409,54.3876
49.6409,54.3875
49.6083,54.2880
49.5748,54.1855
49.4761,54.0190
49.3545,53.8286
49.3539,53.8275
49.2238,53.5641
49.2232,53.5551
49.2291,53.5484
49.2298,53.5481
49.8605,53.2859
49.8695,53.2859
Z" /> 
<path style="fill:#000000; fill-opacity:1.0000; stroke:none;fill-rule:evenodd;"
d="M 65.1417,26.3535
65.1470,26.3607
65.1469,26.3666
65.1388,26.3970
65.1388,26.3970
65.1197,26.6150
65.1197,26.6150
65.1388,26.8330
65.1388,26.8330
65.1469,26.8634
65.1458,26.8723
65.1387,26.8777
65.1328,26.8778
65.0754,26.8634
65.0682,26.8580
65.0669,26.8492
65.0669,26.8491
65.0712,26.8330
65.0903,26.6150
65.0903,26.6150
65.0712,26.3970
65.0712,26.3970
65.0669,26.3810
65.0681,26.3721
65.0752,26.3667
65.0752,26.3667
65.1328,26.3522
Z" /> 
<path style="fill:#000000; fill-opacity:1.0000; stroke:none;fill-rule:evenodd;"
d="M 50.5002,45.9281
50.5065,45.9344
50.5065,45.9434
50.5062,45.9441
50.3761,46.2075
50.3755,46.2086
50.2539,46.3990
50.1552,46.5655
50.1552,46.5655
50.0891,46.7675
50.0659,47.0542
50.0618,47.0622
50.0542,47.0650
49.6758,47.0650
49.6675,47.0616
49.6641,47.0542
49.6409,46.7676
49.6409,46.7676
49.6409,46.7675
49.6083,46.6680
49.5748,46.5655
49.4761,46.3990
49.3545,46.2086
49.3539,46.2075
49.2238,45.9441
49.2232,45.9351
49.2291,45.9284
49.2298,45.9281
49.8605,45.6659
49.8695,45.6659
Z" /> 
<path style="fill:#000000; fill-opacity:1.0000; stroke:none;fill-rule:evenodd;"
d="M 50.0625,48.0784
50.0659,48.0858
50.0891,48.3724
50.1552,48.5745
50.1552,48.5745
50.2539,48.7410
50.3755,48.9314
50.3761,48.9325
50.5062,49.1959
50.5068,49.2049
50.5009,49.2116
50.5002,49.2119
49.8695,49.4741
49.8605,49.4741
49.8605,49.4741
49.2298,49.2119
49.2235,49.2056
49.2235,49.1966
49.2238,49.1960
49.3539,48.9325
49.3545,48.9314
49.4761,48.7410
49.5748,48.5745
49.6409,48.3724
49.6641,48.0858
49.6682,48.0778
49.6758,48.0750
50.0542,48.0750
Z" /> 
<path style="fill:#000000; fill-opacity:1.0000; stroke:none;fill-rule:evenodd;"
d="M 50.5002,49.7381
50.5065,49.7444
50.5065,49.7534
50.5062,49.7541
50.3761,50.0175
50.3755,50.0186
50.2539,50.2090
50.1552,50.3755
50.1552,50.3755
50.0891,50.5775
50.0659,50.8642
50.0618,50.8722
50.0542,50.8750
49.6758,50.8750
49.6675,50.8716
49.6641,50.8642
49.6409,50.5776
49.6409,50.5776
49.6409,50.5775
49.6083,50.4780
49.5748,50.3755
49.4761,50.2090
49.3545,50.0186
49.3539,50.0175
49.2238,49.7541
49.2232,49.7451
49.2291,49.7384
49.2298,49.7381
49.8605,49.4759
49.8695,49.4759
Z" /> 
<path style="fill:#000000; fill-opacity:1.0000; stroke:none;fill-rule:evenodd;"
d="M 50.0625,51.8884
50.0659,51.8958
50.0891,52.1824
50.1552,52.3845
50.1552,52.3845
50.2539,52.5510
50.3755,52.7414
50.3761,52.7425
50.5062,53.0059
50.5068,53.0149
50.5009,53.0216
50.5002,53.0219
49.8695,53.2841
49.8605,53.2841
49.8605,53.2841
49.2298,53.0219
49.2235,53.0156
49.2235,53.0066
49.2238,53.0060
49.3539,52.7425
49.3545,52.7414
49.4761,52.5510
49.5748,52.3845
49.6409,52.1824
49.6641,51.8958
49.6682,51.8878
49.6758,51.8850
50.0542,51.8850
Z" /> 
<path style="fill:#000000; fill-opacity:1.0000; stroke:none;fill-rule:evenodd;"
d="M 50.0098,40.2050
50.3162,40.4276
50.3208,40.4352
50.3197,40.4423
50.2024,40.6771
50.2133,40.8740
50.3132,41.0607
50.4577,41.2730
50.4583,41.2741
50.5981,41.5375
50.5989,41.5464
50.5932,41.5533
50.5922,41.5538
49.8689,41.8539
49.8599,41.8540
49.8599,41.8539
49.1370,41.5535
49.1307,41.5471
49.1307,41.5382
49.1308,41.5379
49.1310,41.5375
49.2895,41.1860
49.2900,41.1850
49.4303,40.9404
49.4310,40.9393
49.5769,40.7410
49.5772,40.7406
49.7576,40.5173
49.9936,40.2074
50.0014,40.2029
Z" /> 
<path style="fill:#000000; fill-opacity:1.0000; stroke:none;fill-rule:evenodd;"
d="M 50.5002,64.9781
50.5065,64.9844
50.5065,64.9934
50.5062,64.9941
50.3761,65.2575
50.3755,65.2586
50.2539,65.4490
50.1552,65.6155
50.1552,65.6155
50.0891,65.8175
50.0659,66.1042
50.0618,66.1122
50.0542,66.1150
49.6758,66.1150
49.6675,66.1116
49.6641,66.1042
49.6409,65.8176
49.6409,65.8176
49.6409,65.8175
49.6083,65.7180
49.5748,65.6155
49.4761,65.4490
49.3545,65.2586
49.3539,65.2575
49.2238,64.9941
49.2232,64.9851
49.2291,64.9784
49.2298,64.9781
49.8605,64.7159
49.8695,64.7159
Z" /> 
<path style="fill:#000000; fill-opacity:1.0000; stroke:none;fill-rule:evenodd;"
d="M 50.0625,67.1284
50.0659,67.1358
50.0891,67.4224
50.1552,67.6245
50.1552,67.6245
50.2539,67.7910
50.3755,67.9814
50.3761,67.9825
50.5062,68.2459
50.5068,68.2549
50.5009,68.2616
50.5002,68.2619
49.8695,68.5241
49.8605,68.5241
49.8605,68.5241
49.2298,68.2619
49.2235,68.2556
49.2235,68.2466
49.2238,68.2460
49.3539,67.9825
49.3545,67.9814
49.4761,67.7910
49.5748,67.6245
49.6409,67.4224
49.6641,67.1358
49.6682,67.1278
49.6758,67.1250
50.0542,67.1250
Z" /> 
<path style="fill:#000000; fill-opacity:1.0000; stroke:none;fill-rule:evenodd;"
d="M 50.8625,59.6398
51.1302,59.9075
51.1336,59.9158
51.1309,59.9233
50.9177,60.1780
50.8131,60.3989
50.7651,60.6179
50.7152,60.8746
50.7148,60.8760
50.6080,61.1992
50.6022,61.2060
50.5933,61.2066
50.5925,61.2063
49.8688,60.9076
49.8624,60.9012
49.8624,60.9012
49.5637,60.1775
49.5637,60.1686
49.5700,60.1622
49.5708,60.1620
49.8940,60.0552
49.8954,60.0548
50.1521,60.0049
50.3711,59.9569
50.5920,59.8523
50.8467,59.6391
50.8553,59.6364
Z" /> 
<path style="fill:#000000; fill-opacity:1.0000; stroke:none;fill-rule:evenodd;"
d="M 50.5515,61.1893
50.5925,61.2063
50.5988,61.2127
50.5988,61.2216
50.5984,61.2224
50.4454,61.5264
50.4446,61.5277
50.2985,61.7445
50.1775,61.9333
50.0953,62.1635
50.0659,62.4943
50.0618,62.5023
50.0543,62.5050
49.6757,62.5050
49.6674,62.5016
49.6641,62.4943
49.6347,62.1635
49.6347,62.1635
49.5525,61.9333
49.4315,61.7445
49.2854,61.5277
49.2846,61.5264
49.1316,61.2224
49.1309,61.2135
49.1367,61.2067
49.1375,61.2063
49.8605,60.9059
49.8695,60.9059
Z" /> 
<path style="fill:#000000; fill-opacity:1.0000; stroke:none;fill-rule:evenodd;"
d="M 50.0625,63.3184
50.0659,63.3258
50.0891,63.6124
50.1552,63.8145
50.1552,63.8145
50.2539,63.9810
50.3755,64.1714
50.3761,64.1725
50.5062,64.4359
50.5068,64.4449
50.5009,64.4516
50.5002,64.4519
49.8695,64.7141
49.8605,64.7141
49.8605,64.7141
49.2298,64.4519
49.2235,64.4456
49.2235,64.4366
49.2238,64.4360
49.3539,64.1725
49.3545,64.1714
49.4761,63.9810
49.5748,63.8145
49.6409,63.6124
49.6641,63.3258
49.6682,63.3178
49.6758,63.3150
50.0542,63.3150
Z" /> 
<path style="fill:#000000; fill-opacity:1.0000; stroke:none;fill-rule:evenodd;"
d="M 50.5002,68.7881
50.5065,68.7944
50.5065,68.8034
50.5062,68.8041
50.3761,69.0675
50.3755,69.0686
50.2539,69.2590
50.1552,69.4255
50.1552,69.4255
50.0891,69.6275
50.0659,69.9142
50.0618,69.9222
50.0542,69.9250
49.6758,69.9250
49.6675,69.9216
49.6641,69.9142
49.6409,69.6276
49.6409,69.6276
49.6409,69.6275
49.6083,69.5280
49.5748,69.4255
49.4761,69.2590
49.3545,69.0686
49.3539,69.0675
49.2238,68.8041
49.2232,68.7951
49.2291,68.7884
49.2298,68.7881
49.8605,68.5259
49.8695,68.5259
Z" /> 
<path style="fill:#000000; fill-opacity:1.0000; stroke:none;fill-rule:evenodd;"
d="M 50.0625,70.9384
50.0659,70.9458
50.0891,71.2324
50.1552,71.4345
50.1552,71.4345
50.2539,71.6010
50.3755,71.7914
50.3761,71.7925
50.5062,72.0559
50.5068,72.0649
50.5009,72.0716
50.5002,72.0719
49.8695,72.3341
49.8605,72.3341
49.8605,72.3341
49.2298,72.0719
49.2235,72.0656
49.2235,72.0566
49.2238,72.0560
49.3539,71.7925
49.3545,71.7914
49.4761,71.6010
49.5748,71.4345
49.6409,71.2324
49.6641,70.9458
49.6682,70.9378
49.6758,70.9350
50.0542,70.9350
Z" /> 
<path style="fill:#000000; fill-opacity:1.0000; stroke:none;fill-rule:evenodd;"
d="M 50.0663,74.5484
50.0683,74.5511
50.1850,74.7650
50.1850,74.7650
50.3050,74.9550
50.3050,74.9550
50.4250,75.1150
50.5450,75.2450
50.6552,75.3368
50.6593,75.3447
50.6567,75.3533
50.6560,75.3541
49.8733,76.1377
49.8650,76.1411
49.8567,76.1377
49.8567,76.1377
49.4767,75.7572
49.0740,75.3541
49.0706,75.3458
49.0741,75.3375
49.0748,75.3368
49.1850,75.2450
49.3050,75.1150
49.4250,74.9550
49.5450,74.7650
49.6617,74.5511
49.6686,74.5455
49.6719,74.5450
50.0581,74.5450
Z" /> 
<path style="fill:#000000; fill-opacity:1.0000; stroke:none;fill-rule:evenodd;"
d="M 50.5002,72.5981
50.5065,72.6044
50.5065,72.6134
50.5062,72.6141
50.3761,72.8775
50.3755,72.8786
50.2539,73.0690
50.1552,73.2355
50.1552,73.2355
50.0891,73.4375
50.0659,73.7242
50.0618,73.7322
50.0542,73.7350
49.6758,73.7350
49.6675,73.7316
49.6641,73.7242
49.6409,73.4376
49.6409,73.4376
49.6409,73.4375
49.6083,73.3380
49.5748,73.2355
49.4761,73.0690
49.3545,72.8786
49.3539,72.8775
49.2238,72.6141
49.2232,72.6051
49.2291,72.5984
49.2298,72.5981
49.8605,72.3359
49.8695,72.3359
Z" /> 
<path style="fill:#000000; fill-opacity:1.0000; stroke:none;fill-rule:evenodd;"
d="M 65.1417,28.8935
65.1470,28.9007
65.1469,28.9066
65.1388,28.9370
65.1388,28.9370
65.1197,29.1550
65.1197,29.1550
65.1388,29.3730
65.1388,29.3730
65.1469,29.4034
65.1458,29.4123
65.1387,29.4177
65.1328,29.4178
65.0754,29.4034
65.0682,29.3980
65.0669,29.3892
65.0669,29.3891
65.0712,29.3730
65.0903,29.1550
65.0903,29.1550
65.0712,28.9370
65.0712,28.9370
65.0669,28.9210
65.0681,28.9121
65.0752,28.9067
65.0752,28.9067
65.1328,28.8922
Z" /> 
<path style="fill:#000000; fill-opacity:1.0000; stroke:none;fill-rule:evenodd;"
d="M 41.6098,11.1119
42.2412,11.3724
42.2475,11.3788
42.2476,11.3788
42.5081,12.0102
42.5081,12.0191
42.5018,12.0255
42.5011,12.0257
42.2228,12.1200
42.2216,12.1204
42.0009,12.1690
41.8134,12.2170
41.6238,12.3131
41.6238,12.3131
41.4047,12.4994
41.3962,12.5021
41.3888,12.4987
41.1213,12.2312
41.1178,12.2229
41.1206,12.2153
41.3069,11.9962
41.4030,11.8066
41.4510,11.6190
41.4996,11.3984
41.5000,11.3972
41.5062,11.3788
41.5943,11.1189
41.6002,11.1122
41.6091,11.1116
Z" /> 
<path style="fill:#000000; fill-opacity:1.0000; stroke:none;fill-rule:evenodd;"
d="M 41.6098,30.2119
42.2412,30.4724
42.2475,30.4788
42.2476,30.4788
42.5081,31.1102
42.5081,31.1191
42.5018,31.1255
42.5011,31.1257
42.2228,31.2200
42.2216,31.2204
42.0009,31.2690
41.8134,31.3170
41.6238,31.4131
41.6238,31.4131
41.4047,31.5994
41.3962,31.6021
41.3888,31.5987
41.1213,31.3312
41.1178,31.3229
41.1206,31.3153
41.3069,31.0962
41.4030,30.9066
41.4510,30.7190
41.4996,30.4984
41.5000,30.4972
41.5062,30.4788
41.5943,30.2189
41.6002,30.2122
41.6091,30.2116
Z" /> 
<path style="fill:#000000; fill-opacity:1.0000; stroke:none;fill-rule:evenodd;"
d="M 41.6098,49.2119
42.2412,49.4724
42.2475,49.4788
42.2476,49.4788
42.5081,50.1102
42.5081,50.1191
42.5018,50.1255
42.5011,50.1257
42.2228,50.2200
42.2216,50.2204
42.0009,50.2690
41.8134,50.3170
41.6238,50.4131
41.6238,50.4131
41.4047,50.5994
41.3962,50.6021
41.3888,50.5987
41.1213,50.3312
41.1178,50.3229
41.1206,50.3153
41.3069,50.0962
41.4030,49.9066
41.4510,49.7190
41.4996,49.4984
41.5000,49.4972
41.5062,49.4788
41.5943,49.2189
41.6002,49.2122
41.6091,49.2116
Z" /> 
<path style="fill:#000000; fill-opacity:1.0000; stroke:none;fill-rule:evenodd;"
d="M 41.6098,68.2619
42.2412,68.5224
42.2475,68.5288
42.2476,68.5288
42.5081,69.1602
42.5081,69.1691
42.5018,69.1755
42.5011,69.1757
42.2228,69.2700
42.2216,69.2704
42.0009,69.3190
41.8134,69.3670
41.6238,69.4631
41.6238,69.4631
41.4047,69.6494
41.3962,69.6521
41.3888,69.6487
41.1213,69.3812
41.1178,69.3729
41.1206,69.3653
41.3069,69.1462
41.4030,68.9566
41.4510,68.7690
41.4996,68.5484
41.5000,68.5472
41.5062,68.5288
41.5943,68.2689
41.6002,68.2622
41.6091,68.2616
Z" /> 
<path style="fill:#000000; fill-opacity:1.0000; stroke:none;fill-rule:evenodd;"
d="M 65.1417,21.2735
65.1470,21.2807
65.1469,21.2866
65.1388,21.3170
65.1388,21.3170
65.1197,21.5350
65.1197,21.5350
65.1388,21.7530
65.1388,21.7530
65.1469,21.7834
65.1458,21.7923
65.1387,21.7977
65.1328,21.7978
65.0754,21.7834
65.0682,21.7780
65.0669,21.7692
65.0669,21.7691
65.0712,21.7530
65.0903,21.5350
65.0903,21.5350
65.0712,21.3170
65.0712,21.3170
65.0669,21.3010
65.0681,21.2921
65.0752,21.2867
65.0752,21.2867
65.1328,21.2722
Z" /> 
<path style="fill:#000000; fill-opacity:1.0000; stroke:none;fill-rule:evenodd;"
d="M 28.6150,12.9242
28.6807,12.6738
28.7464,12.4473
28.8121,12.2449
28.8778,12.0665
28.9435,11.9121
28.3548,11.2940
27.8561,12.1283
27.9299,12.2573
28.0037,12.4103
28.0775,12.5873
28.1513,12.7882
28.2251,13.0132
Z" /> 
<path style="fill:#000000; fill-opacity:1.0000; stroke:none;fill-rule:evenodd;"
d="M 35.0435,16.0950
34.8292,16.0653
34.6149,16.0116
34.4006,15.9339
34.1863,15.8322
33.9721,15.7065
33.3540,16.2950
33.9721,16.8835
34.1863,16.7578
34.4006,16.6561
34.6149,16.5784
34.8292,16.5247
35.0435,16.4950
Z" /> 
<path style="fill:#000000; fill-opacity:1.0000; stroke:none;fill-rule:evenodd;"
d="M 35.0435,35.1450
34.8292,35.1153
34.6149,35.0616
34.4006,34.9839
34.1863,34.8822
33.9721,34.7565
33.3540,35.3450
33.9721,35.9335
34.1863,35.8078
34.4006,35.7061
34.6149,35.6284
34.8292,35.5747
35.0435,35.5450
Z" /> 
<path style="fill:#000000; fill-opacity:1.0000; stroke:none;fill-rule:evenodd;"
d="M 28.1451,47.7568
28.0713,47.9818
27.9975,48.1827
27.9237,48.3597
27.8499,48.5127
27.7761,48.6417
28.2748,49.4760
28.8635,48.8579
28.7978,48.7035
28.7321,48.5251
28.6664,48.3227
28.6007,48.0962
28.5350,47.8458
Z" /> 
<path style="fill:#000000; fill-opacity:1.0000; stroke:none;fill-rule:evenodd;"
d="M 28.4750,50.7450
28.5348,50.6259
28.5946,50.5227
28.6543,50.4354
28.7141,50.3639
28.7739,50.3083
28.2750,49.4740
27.7761,50.3083
27.8359,50.3639
27.8957,50.4354
27.9554,50.5227
28.0152,50.6259
28.0750,50.7450
Z" /> 
<path style="fill:#000000; fill-opacity:1.0000; stroke:none;fill-rule:evenodd;"
d="M 34.9635,54.2750
34.7492,54.2453
34.5349,54.1916
34.3206,54.1139
34.1063,54.0122
33.8921,53.8865
33.2740,54.4750
33.8921,55.0635
34.1063,54.9378
34.3206,54.8361
34.5349,54.7584
34.7492,54.7047
34.9635,54.6750
Z" /> 
<path style="fill:#000000; fill-opacity:1.0000; stroke:none;fill-rule:evenodd;"
d="M 28.1585,67.0151
28.0980,67.1949
28.0375,67.3524
27.9771,67.4877
27.9166,67.6008
27.8561,67.6917
28.3549,68.5260
28.8539,67.6917
28.7943,67.6072
28.7347,67.5018
28.6751,67.3755
28.6156,67.2282
28.5560,67.0599
Z" /> 
<path style="fill:#000000; fill-opacity:1.0000; stroke:none;fill-rule:evenodd;"
d="M 28.5560,69.9901
28.6156,69.8218
28.6751,69.6745
28.7347,69.5482
28.7943,69.4428
28.8539,69.3583
28.3549,68.5240
27.8561,69.3583
27.9166,69.4492
27.9771,69.5623
28.0375,69.6976
28.0980,69.8551
28.1585,70.0349
Z" /> 
<path style="fill:#000000; fill-opacity:1.0000; stroke:none;fill-rule:evenodd;"
d="M 35.0435,73.3250
34.8292,73.2953
34.6149,73.2416
34.4006,73.1639
34.1863,73.0622
33.9721,72.9365
33.3540,73.5250
33.9721,74.1135
34.1863,73.9878
34.4006,73.8861
34.6149,73.8084
34.8292,73.7547
35.0435,73.7250
Z" /> 
</g>
<g style="fill:#FFFFFF; fill-opacity:1.0000; stroke:none;">
<circle cx="28.3550" cy="63.5250" r="0.6000" /> 
</g>
<g style="fill:#FFFFFF; fill-opacity:1.0000; stroke:none;">
<circle cx="25.8550" cy="63.5250" r="0.6000" /> 
</g>
<g style="fill:#FFFFFF; fill-opacity:1.0000; stroke:none;">
<circle cx="33.3550" cy="68.5250" r="0.6000" /> 
</g>
<g style="fill:#FFFFFF; fill-opacity:1.0000; stroke:none;">
<circle cx="28.3550" cy="73.5250" r="0.6000" /> 
</g>
<g style="fill:#FFFFFF; fill-opacity:1.0000; stroke:none;">
<circle cx="25.8550" cy="73.5250" r="0.6000" /> 
</g>
<g style="fill:none; 
stroke:#FFFFFF; stroke-width:0.4000; stroke-opacity:1; 
stroke-linecap:round; stroke-linejoin:round;">
<path d="M33.8550 63.5250
L32.8550 63.5250
" />
<path d="M28.3550 68.0250
L28.3550 69.0250
" />
<path d="M32.8550 73.5250
L33.8550 73.5250
" />
</g>
<g style="fill:#FFFFFF; fill-opacity:1.0000; stroke:none;">
<circle cx="28.2750" cy="44.4750" r="0.6000" /> 
</g>
<g style="fill:#FFFFFF; fill-opacity:1.0000; stroke:none;">
<circle cx="25.7750" cy="44.4750" r="0.6000" /> 
</g>
<g style="fill:#FFFFFF; fill-opacity:1.0000; stroke:none;">
<circle cx="33.2750" cy="49.4750" r="0.6000" /> 
</g>
<g style="fill:#FFFFFF; fill-opacity:1.0000; stroke:none;">
<circle cx="28.2750" cy="54.4750" r="0.6000" /> 
</g>
<g style="fill:#FFFFFF; fill-opacity:1.0000; stroke:none;">
<circle cx="25.7750" cy="54.4750" r="0.6000" /> 
</g>
<g style="fill:none; 
stroke:#FFFFFF; stroke-width:0.4000; stroke-opacity:1; 
stroke-linecap:round; stroke-linejoin:round;">
<path d="M33.7750 44.4750
L32.7750 44.4750
" />
<path d="M28.2750 48.9750
L28.2750 49.9750
" />
<path d="M32.7750 54.4750
L33.7750 54.4750
" />
</g>
<g style="fill:#FFFFFF; fill-opacity:1.0000; stroke:none;">
<circle cx="28.3550" cy="25.3450" r="0.6000" /> 
</g>
<g style="fill:#FFFFFF; fill-opacity:1.0000; stroke:none;">
<circle cx="25.8550" cy="25.3450" r="0.6000" /> 
</g>
<g style="fill:#FFFFFF; fill-opacity:1.0000; stroke:none;">
<circle cx="33.3550" cy="30.3450" r="0.6000" /> 
</g>
<g style="fill:#FFFFFF; fill-opacity:1.0000; stroke:none;">
<circle cx="28.3550" cy="35.3450" r="0.6000" /> 
</g>
<g style="fill:#FFFFFF; fill-opacity:1.0000; stroke:none;">
<circle cx="25.8550" cy="35.3450" r="0.6000" /> 
</g>
<g style="fill:none; 
stroke:#FFFFFF; stroke-width:0.4000; stroke-opacity:1; 
stroke-linecap:round; stroke-linejoin:round;">
<path d="M33.8550 25.3450
L32.8550 25.3450
" />
<path d="M28.3550 29.8450
L28.3550 30.8450
" />
<path d="M32.8550 35.3450
L33.8550 35.3450
" />
</g>
<g style="fill:#FFFFFF; fill-opacity:1.0000; stroke:none;">
<circle cx="28.3550" cy="6.2950" r="0.6000" /> 
</g>
<g style="fill:#FFFFFF; fill-opacity:1.0000; stroke:none;">
<circle cx="25.8550" cy="6.2950" r="0.6000" /> 
</g>
<g style="fill:#FFFFFF; fill-opacity:1.0000; stroke:none;">
<circle cx="33.3550" cy="11.2950" r="0.6000" /> 
</g>
<g style="fill:#FFFFFF; fill-opacity:1.0000; stroke:none;">
<circle cx="28.3550" cy="16.2950" r="0.6000" /> 
</g>
<g style="fill:#FFFFFF; fill-opacity:1.0000; stroke:none;">
<circle cx="25.8550" cy="16.2950" r="0.6000" /> 
</g>
<g style="fill:none; 
stroke:#FFFFFF; stroke-width:0.4000; stroke-opacity:1; 
stroke-linecap:round; stroke-linejoin:round;">
<path d="M33.8550 6.2950
L32.8550 6.2950
" />
<path d="M28.3550 10.7950
L28.3550 11.7950
" />
<path d="M32.8550 16.2950
L33.8550 16.2950
" />
</g>
<g style="fill:#FFFFFF; fill-opacity:1.0000; stroke:none;">
<circle cx="7.5250" cy="72.5250" r="2.0000" /> 
</g>
<g style="fill:#FFFFFF; fill-opacity:1.0000; stroke:none;">
<circle cx="92.5250" cy="72.5250" r="2.0000" /> 
</g>
<g style="fill:#FFFFFF; fill-opacity:1.0000; stroke:none;">
<circle cx="92.5250" cy="7.5250" r="2.0000" /> 
</g>
<g style="fill:#FFFFFF; fill-opacity:1.0000; stroke:none;">
<circle cx="7.5250" cy="7.5250" r="2.0000" /> 
</g>
<g style="fill:#FFFFFF; fill-opacity:1.0000; stroke:none;">
<circle cx="42.2450" cy="53.2850" r="0.3500" /> 
</g>
<g style="fill:#FFFFFF; fill-opacity:1.0000; stroke:none;">
<circle cx="49.8650" cy="53.2850" r="0.3500" /> 
</g>
<g style="fill:#FFFFFF; fill-opacity:1.0000; stroke:none;">
<circle cx="94.3150" cy="11.3750" r="0.5000" /> 
</g>
<g style="fill:#FFFFFF; fill-opacity:1.0000; stroke:none;">
<circle cx="91.7750" cy="11.3750" r="0.5000" /> 
</g>
<g style="fill:#FFFFFF; fill-opacity:1.0000; stroke:none;">
<circle cx="94.3150" cy="13.9150" r="0.5000" /> 
</g>
<g style="fill:#FFFFFF; fill-opacity:1.0000; stroke:none;">
<circle cx="91.7750" cy="13.9150" r="0.5000" /> 
</g>
<g style="fill:#FFFFFF; fill-opacity:1.0000; stroke:none;">
<circle cx="94.3150" cy="16.4550" r="0.5000" /> 
</g>
<g style="fill:#FFFFFF; fill-opacity:1.0000; stroke:none;">
<circle cx="91.7750" cy="16.4550" r="0.5000" /> 
</g>
<g style="fill:#FFFFFF; fill-opacity:1.0000; stroke:none;">
<circle cx="94.3150" cy="18.9950" r="0.5000" /> 
</g>
<g style="fill:#FFFFFF; fill-opacity:1.0000; stroke:none;">
<circle cx="91.7750" cy="18.9950" r="0.5000" /> 
</g>
<g style="fill:#FFFFFF; fill-opacity:1.0000; stroke:none;">
<circle cx="94.3150" cy="21.5350" r="0.5000" /> 
</g>
<g style="fill:#FFFFFF; fill-opacity:1.0000; stroke:none;">
<circle cx="91.7750" cy="21.5350" r="0.5000" /> 
</g>
<g style="fill:#FFFFFF; fill-opacity:1.0000; stroke:none;">
<circle cx="94.3150" cy="24.0750" r="0.5000" /> 
</g>
<g style="fill:#FFFFFF; fill-opacity:1.0000; stroke:none;">
<circle cx="91.7750" cy="24.0750" r="0.5000" /> 
</g>
<g style="fill:#FFFFFF; fill-opacity:1.0000; stroke:none;">
<circle cx="94.3150" cy="26.6150" r="0.5000" /> 
</g>
<g style="fill:#FFFFFF; fill-opacity:1.0000; stroke:none;">
<circle cx="91.7750" cy="26.6150" r="0.5000" /> 
</g>
<g style="fill:#FFFFFF; fill-opacity:1.0000; stroke:none;">
<circle cx="94.3150" cy="29.1550" r="0.5000" /> 
</g>
<g style="fill:#FFFFFF; fill-opacity:1.0000; stroke:none;">
<circle cx="91.7750" cy="29.1550" r="0.5000" /> 
</g>
<g style="fill:#FFFFFF; fill-opacity:1.0000; stroke:none;">
<circle cx="94.3150" cy="31.6950" r="0.5000" /> 
</g>
<g style="fill:#FFFFFF; fill-opacity:1.0000; stroke:none;">
<circle cx="91.7750" cy="31.6950" r="0.5000" /> 
</g>
<g style="fill:#FFFFFF; fill-opacity:1.0000; stroke:none;">
<circle cx="94.3150" cy="34.2350" r="0.5000" /> 
</g>
<g style="fill:#FFFFFF; fill-opacity:1.0000; stroke:none;">
<circle cx="91.7750" cy="34.2350" r="0.5000" /> 
</g>
<g style="fill:#FFFFFF; fill-opacity:1.0000; stroke:none;">
<circle cx="94.3150" cy="36.7750" r="0.5000" /> 
</g>
<g style="fill:#FFFFFF; fill-opacity:1.0000; stroke:none;">
<circle cx="91.7750" cy="36.7750" r="0.5000" /> 
</g>
<g style="fill:#FFFFFF; fill-opacity:1.0000; stroke:none;">
<circle cx="94.3150" cy="39.3150" r="0.5000" /> 
</g>
<g style="fill:#FFFFFF; fill-opacity:1.0000; stroke:none;">
<circle cx="91.7750" cy="39.3150" r="0.5000" /> 
</g>
<g style="fill:#FFFFFF; fill-opacity:1.0000; stroke:none;">
<circle cx="94.3150" cy="41.8550" r="0.5000" /> 
</g>
<g style="fill:#FFFFFF; fill-opacity:1.0000; stroke:none;">
<circle cx="91.7750" cy="41.8550" r="0.5000" /> 
</g>
<g style="fill:#FFFFFF; fill-opacity:1.0000; stroke:none;">
<circle cx="94.3150" cy="44.3950" r="0.5000" /> 
</g>
<g style="fill:#FFFFFF; fill-opacity:1.0000; stroke:none;">
<circle cx="91.7750" cy="44.3950" r="0.5000" /> 
</g>
<g style="fill:#FFFFFF; fill-opacity:1.0000; stroke:none;">
<circle cx="94.3150" cy="46.9350" r="0.5000" /> 
</g>
<g style="fill:#FFFFFF; fill-opacity:1.0000; stroke:none;">
<circle cx="91.7750" cy="46.9350" r="0.5000" /> 
</g>
<g style="fill:#FFFFFF; fill-opacity:1.0000; stroke:none;">
<circle cx="94.3150" cy="49.4750" r="0.5000" /> 
</g>
<g style="fill:#FFFFFF; fill-opacity:1.0000; stroke:none;">
<circle cx="91.7750" cy="49.4750" r="0.5000" /> 
</g>
<g style="fill:#FFFFFF; fill-opacity:1.0000; stroke:none;">
<circle cx="94.3150" cy="52.0150" r="0.5000" /> 
</g>
<g style="fill:#FFFFFF; fill-opacity:1.0000; stroke:none;">
<circle cx="91.7750" cy="52.0150" r="0.5000" /> 
</g>
<g style="fill:#FFFFFF; fill-opacity:1.0000; stroke:none;">
<circle cx="94.3150" cy="54.5550" r="0.5000" /> 
</g>
<g style="fill:#FFFFFF; fill-opacity:1.0000; stroke:none;">
<circle cx="91.7750" cy="54.5550" r="0.5000" /> 
</g>
<g style="fill:#FFFFFF; fill-opacity:1.0000; stroke:none;">
<circle cx="94.3150" cy="57.0950" r="0.5000" /> 
</g>
<g style="fill:#FFFFFF; fill-opacity:1.0000; stroke:none;">
<circle cx="91.7750" cy="57.0950" r="0.5000" /> 
</g>
<g style="fill:#FFFFFF; fill-opacity:1.0000; stroke:none;">
<circle cx="94.3150" cy="59.6350" r="0.5000" /> 
</g>
<g style="fill:#FFFFFF; fill-opacity:1.0000; stroke:none;">
<circle cx="91.7750" cy="59.6350" r="0.5000" /> 
</g>
<g style="fill:#FFFFFF; fill-opacity:1.0000; stroke:none;">
<circle cx="49.8650" cy="41.8550" r="0.4000" /> 
</g>
<g style="fill:#FFFFFF; fill-opacity:1.0000; stroke:none;">
<circle cx="42.2450" cy="41.8550" r="0.4000" /> 
</g>
<g style="fill:#FFFFFF; fill-opacity:1.0000; stroke:none;">
<circle cx="42.2450" cy="76.1450" r="0.4000" /> 
</g>
<g style="fill:#FFFFFF; fill-opacity:1.0000; stroke:none;">
<circle cx="49.8650" cy="76.1450" r="0.4000" /> 
</g>
<g style="fill:#FFFFFF; fill-opacity:1.0000; stroke:none;">
<circle cx="49.8650" cy="26.6650" r="0.3500" /> 
</g>
<g style="fill:#FFFFFF; fill-opacity:1.0000; stroke:none;">
<circle cx="42.2450" cy="26.6650" r="0.3500" /> 
</g>
<g style="fill:#FFFFFF; fill-opacity:1.0000; stroke:none;">
<circle cx="66.3750" cy="11.3750" r="0.5000" /> 
</g>
<g style="fill:#FFFFFF; fill-opacity:1.0000; stroke:none;">
<circle cx="63.8350" cy="11.3750" r="0.5000" /> 
</g>
<g style="fill:#FFFFFF; fill-opacity:1.0000; stroke:none;">
<circle cx="66.3750" cy="13.9150" r="0.5000" /> 
</g>
<g style="fill:#FFFFFF; fill-opacity:1.0000; stroke:none;">
<circle cx="63.8350" cy="13.9150" r="0.5000" /> 
</g>
<g style="fill:#FFFFFF; fill-opacity:1.0000; stroke:none;">
<circle cx="66.3750" cy="16.4550" r="0.5000" /> 
</g>
<g style="fill:#FFFFFF; fill-opacity:1.0000; stroke:none;">
<circle cx="63.8350" cy="16.4550" r="0.5000" /> 
</g>
<g style="fill:#FFFFFF; fill-opacity:1.0000; stroke:none;">
<circle cx="66.3750" cy="18.9950" r="0.5000" /> 
</g>
<g style="fill:#FFFFFF; fill-opacity:1.0000; stroke:none;">
<circle cx="63.8350" cy="18.9950" r="0.5000" /> 
</g>
<g style="fill:#FFFFFF; fill-opacity:1.0000; stroke:none;">
<circle cx="66.3750" cy="21.5350" r="0.5000" /> 
</g>
<g style="fill:#FFFFFF; fill-opacity:1.0000; stroke:none;">
<circle cx="63.8350" cy="21.5350" r="0.5000" /> 
</g>
<g style="fill:#FFFFFF; fill-opacity:1.0000; stroke:none;">
<circle cx="66.3750" cy="24.0750" r="0.5000" /> 
</g>
<g style="fill:#FFFFFF; fill-opacity:1.0000; stroke:none;">
<circle cx="63.8350" cy="24.0750" r="0.5000" /> 
</g>
<g style="fill:#FFFFFF; fill-opacity:1.0000; stroke:none;">
<circle cx="66.3750" cy="26.6150" r="0.5000" /> 
</g>
<g style="fill:#FFFFFF; fill-opacity:1.0000; stroke:none;">
<circle cx="63.8350" cy="26.6150" r="0.5000" /> 
</g>
<g style="fill:#FFFFFF; fill-opacity:1.0000; stroke:none;">
<circle cx="66.3750" cy="29.1550" r="0.5000" /> 
</g>
<g style="fill:#FFFFFF; fill-opacity:1.0000; stroke:none;">
<circle cx="63.8350" cy="29.1550" r="0.5000" /> 
</g>
<g style="fill:#FFFFFF; fill-opacity:1.0000; stroke:none;">
<circle cx="66.3750" cy="31.6950" r="0.5000" /> 
</g>
<g style="fill:#FFFFFF; fill-opacity:1.0000; stroke:none;">
<circle cx="63.8350" cy="31.6950" r="0.5000" /> 
</g>
<g style="fill:#FFFFFF; fill-opacity:1.0000; stroke:none;">
<circle cx="66.3750" cy="34.2350" r="0.5000" /> 
</g>
<g style="fill:#FFFFFF; fill-opacity:1.0000; stroke:none;">
<circle cx="63.8350" cy="34.2350" r="0.5000" /> 
</g>
<g style="fill:#FFFFFF; fill-opacity:1.0000; stroke:none;">
<circle cx="66.3750" cy="36.7750" r="0.5000" /> 
</g>
<g style="fill:#FFFFFF; fill-opacity:1.0000; stroke:none;">
<circle cx="63.8350" cy="36.7750" r="0.5000" /> 
</g>
<g style="fill:#FFFFFF; fill-opacity:1.0000; stroke:none;">
<circle cx="66.3750" cy="39.3150" r="0.5000" /> 
</g>
<g style="fill:#FFFFFF; fill-opacity:1.0000; stroke:none;">
<circle cx="63.8350" cy="39.3150" r="0.5000" /> 
</g>
<g style="fill:#FFFFFF; fill-opacity:1.0000; stroke:none;">
<circle cx="66.3750" cy="41.8550" r="0.5000" /> 
</g>
<g style="fill:#FFFFFF; fill-opacity:1.0000; stroke:none;">
<circle cx="63.8350" cy="41.8550" r="0.5000" /> 
</g>
<g style="fill:#FFFFFF; fill-opacity:1.0000; stroke:none;">
<circle cx="66.3750" cy="44.3950" r="0.5000" /> 
</g>
<g style="fill:#FFFFFF; fill-opacity:1.0000; stroke:none;">
<circle cx="63.8350" cy="44.3950" r="0.5000" /> 
</g>
<g style="fill:#FFFFFF; fill-opacity:1.0000; stroke:none;">
<circle cx="66.3750" cy="46.9350" r="0.5000" /> 
</g>
<g style="fill:#FFFFFF; fill-opacity:1.0000; stroke:none;">
<circle cx="63.8350" cy="46.9350" r="0.5000" /> 
</g>
<g style="fill:#FFFFFF; fill-opacity:1.0000; stroke:none;">
<circle cx="66.3750" cy="49.4750" r="0.5000" /> 
</g>
<g style="fill:#FFFFFF; fill-opacity:1.0000; stroke:none;">
<circle cx="63.8350" cy="49.4750" r="0.5000" /> 
</g>
<g style="fill:#FFFFFF; fill-opacity:1.0000; stroke:none;">
<circle cx="66.3750" cy="52.0150" r="0.5000" /> 
</g>
<g style="fill:#FFFFFF; fill-opacity:1.0000; stroke:none;">
<circle cx="63.8350" cy="52.0150" r="0.5000" /> 
</g>
<g style="fill:#FFFFFF; fill-opacity:1.0000; stroke:none;">
<circle cx="66.3750" cy="54.5550" r="0.5000" /> 
</g>
<g style="fill:#FFFFFF; fill-opacity:1.0000; stroke:none;">
<circle cx="63.8350" cy="54.5550" r="0.5000" /> 
</g>
<g style="fill:#FFFFFF; fill-opacity:1.0000; stroke:none;">
<circle cx="66.3750" cy="57.0950" r="0.5000" /> 
</g>
<g style="fill:#FFFFFF; fill-opacity:1.0000; stroke:none;">
<circle cx="63.8350" cy="57.0950" r="0.5000" /> 
</g>
<g style="fill:#FFFFFF; fill-opacity:1.0000; stroke:none;">
<circle cx="66.3750" cy="59.6350" r="0.5000" /> 
</g>
<g style="fill:#FFFFFF; fill-opacity:1.0000; stroke:none;">
<circle cx="63.8350" cy="59.6350" r="0.5000" /> 
</g>
<g style="fill:#FFFFFF; fill-opacity:1.0000; stroke:none;">
<circle cx="91.7750" cy="11.3750" r="0.4000" /> 
</g>
<g style="fill:#FFFFFF; fill-opacity:1.0000; stroke:none;">
<circle cx="91.7750" cy="13.9150" r="0.4000" /> 
</g>
<g style="fill:#FFFFFF; fill-opacity:1.0000; stroke:none;">
<circle cx="91.7750" cy="16.4550" r="0.4000" /> 
</g>
<g style="fill:#FFFFFF; fill-opacity:1.0000; stroke:none;">
<circle cx="91.7750" cy="18.9950" r="0.4000" /> 
</g>
<g style="fill:#FFFFFF; fill-opacity:1.0000; stroke:none;">
<circle cx="91.7750" cy="21.5350" r="0.4000" /> 
</g>
<g style="fill:#FFFFFF; fill-opacity:1.0000; stroke:none;">
<circle cx="91.7750" cy="24.0750" r="0.4000" /> 
</g>
<g style="fill:#FFFFFF; fill-opacity:1.0000; stroke:none;">
<circle cx="91.7750" cy="26.6150" r="0.4000" /> 
</g>
<g style="fill:#FFFFFF; fill-opacity:1.0000; stroke:none;">
<circle cx="91.7750" cy="29.1550" r="0.4000" /> 
</g>
<g style="fill:#FFFFFF; fill-opacity:1.0000; stroke:none;">
<circle cx="91.7750" cy="31.6950" r="0.4000" /> 
</g>
<g style="fill:#FFFFFF; fill-opacity:1.0000; stroke:none;">
<circle cx="91.7750" cy="34.2350" r="0.4000" /> 
</g>
<g style="fill:#FFFFFF; fill-opacity:1.0000; stroke:none;">
<circle cx="91.7750" cy="36.7750" r="0.4000" /> 
</g>
<g style="fill:#FFFFFF; fill-opacity:1.0000; stroke:none;">
<circle cx="91.7750" cy="39.3150" r="0.4000" /> 
</g>
<g style="fill:#FFFFFF; fill-opacity:1.0000; stroke:none;">
<circle cx="91.7750" cy="41.8550" r="0.4000" /> 
</g>
<g style="fill:#FFFFFF; fill-opacity:1.0000; stroke:none;">
<circle cx="91.7750" cy="44.3950" r="0.4000" /> 
</g>
<g style="fill:#FFFFFF; fill-opacity:1.0000; stroke:none;">
<circle cx="91.7750" cy="46.9350" r="0.4000" /> 
</g>
<g style="fill:#FFFFFF; fill-opacity:1.0000; stroke:none;">
<circle cx="91.7750" cy="49.4750" r="0.4000" /> 
</g>
<g style="fill:#FFFFFF; fill-opacity:1.0000; stroke:none;">
<circle cx="91.7750" cy="52.0150" r="0.4000" /> 
</g>
<g style="fill:#FFFFFF; fill-opacity:1.0000; stroke:none;">
<circle cx="91.7713" cy="54.5523" r="0.4000" /> 
</g>
<g style="fill:#FFFFFF; fill-opacity:1.0000; stroke:none;">
<circle cx="91.7713" cy="57.0923" r="0.4000" /> 
</g>
<g style="fill:#FFFFFF; fill-opacity:1.0000; stroke:none;">
<circle cx="66.3750" cy="57.0950" r="0.4000" /> 
</g>
<g style="fill:#FFFFFF; fill-opacity:1.0000; stroke:none;">
<circle cx="66.3750" cy="54.5550" r="0.4000" /> 
</g>
<g style="fill:#FFFFFF; fill-opacity:1.0000; stroke:none;">
<circle cx="66.3750" cy="52.0150" r="0.4000" /> 
</g>
<g style="fill:#FFFFFF; fill-opacity:1.0000; stroke:none;">
<circle cx="66.3750" cy="49.4750" r="0.4000" /> 
</g>
<g style="fill:#FFFFFF; fill-opacity:1.0000; stroke:none;">
<circle cx="66.3750" cy="46.9350" r="0.4000" /> 
</g>
<g style="fill:#FFFFFF; fill-opacity:1.0000; stroke:none;">
<circle cx="66.3750" cy="44.3950" r="0.4000" /> 
</g>
<g style="fill:#FFFFFF; fill-opacity:1.0000; stroke:none;">
<circle cx="66.3750" cy="41.8550" r="0.4000" /> 
</g>
<g style="fill:#FFFFFF; fill-opacity:1.0000; stroke:none;">
<circle cx="66.3750" cy="39.3150" r="0.4000" /> 
</g>
<g style="fill:#FFFFFF; fill-opacity:1.0000; stroke:none;">
<circle cx="66.3750" cy="36.7750" r="0.4000" /> 
</g>
<g style="fill:#FFFFFF; fill-opacity:1.0000; stroke:none;">
<circle cx="66.3750" cy="34.2350" r="0.4000" /> 
</g>
<g style="fill:#FFFFFF; fill-opacity:1.0000; stroke:none;">
<circle cx="66.3750" cy="31.6950" r="0.4000" /> 
</g>
<g style="fill:#FFFFFF; fill-opacity:1.0000; stroke:none;">
<circle cx="66.3750" cy="29.1550" r="0.4000" /> 
</g>
<g style="fill:#FFFFFF; fill-opacity:1.0000; stroke:none;">
<circle cx="66.3750" cy="26.6150" r="0.4000" /> 
</g>
<g style="fill:#FFFFFF; fill-opacity:1.0000; stroke:none;">
<circle cx="66.3750" cy="24.0750" r="0.4000" /> 
</g>
<g style="fill:#FFFFFF; fill-opacity:1.0000; stroke:none;">
<circle cx="66.3750" cy="21.5350" r="0.4000" /> 
</g>
<g style="fill:#FFFFFF; fill-opacity:1.0000; stroke:none;">
<circle cx="66.3750" cy="18.9950" r="0.4000" /> 
</g>
<g style="fill:#FFFFFF; fill-opacity:1.0000; stroke:none;">
<circle cx="66.3750" cy="16.4550" r="0.4000" /> 
</g>
<g style="fill:#FFFFFF; fill-opacity:1.0000; stroke:none;">
<circle cx="66.3750" cy="13.9150" r="0.4000" /> 
</g>
<g style="fill:#FFFFFF; fill-opacity:1.0000; stroke:none;">
<circle cx="66.3750" cy="11.3750" r="0.4000" /> 
</g>
<g style="fill:#FFFFFF; fill-opacity:1.0000; stroke:none;">
<circle cx="42.2450" cy="30.4750" r="0.3500" /> 
</g>
<g style="fill:#FFFFFF; fill-opacity:1.0000; stroke:none;">
<circle cx="49.8650" cy="30.4750" r="0.3500" /> 
</g>
<g style="fill:#FFFFFF; fill-opacity:1.0000; stroke:none;">
<circle cx="49.8650" cy="45.6650" r="0.3500" /> 
</g>
<g style="fill:#FFFFFF; fill-opacity:1.0000; stroke:none;">
<circle cx="42.2450" cy="45.6650" r="0.3500" /> 
</g>
<g style="fill:#FFFFFF; fill-opacity:1.0000; stroke:none;">
<circle cx="49.8650" cy="3.7550" r="0.4000" /> 
</g>
<g style="fill:#FFFFFF; fill-opacity:1.0000; stroke:none;">
<circle cx="42.2450" cy="3.7550" r="0.4000" /> 
</g>
<g style="fill:#FFFFFF; fill-opacity:1.0000; stroke:none;">
<circle cx="42.2450" cy="72.3350" r="0.3500" /> 
</g>
<g style="fill:#FFFFFF; fill-opacity:1.0000; stroke:none;">
<circle cx="49.8650" cy="72.3350" r="0.3500" /> 
</g>
<g style="fill:#FFFFFF; fill-opacity:1.0000; stroke:none;">
<circle cx="49.8650" cy="22.8050" r="0.4000" /> 
</g>
<g style="fill:#FFFFFF; fill-opacity:1.0000; stroke:none;">
<circle cx="42.2450" cy="22.8050" r="0.4000" /> 
</g>
<g style="fill:#FFFFFF; fill-opacity:1.0000; stroke:none;">
<circle cx="42.2450" cy="11.3750" r="0.3500" /> 
</g>
<g style="fill:#FFFFFF; fill-opacity:1.0000; stroke:none;">
<circle cx="49.8650" cy="11.3750" r="0.3500" /> 
</g>
<g style="fill:#FFFFFF; fill-opacity:1.0000; stroke:none;">
<circle cx="49.8650" cy="60.9050" r="0.4000" /> 
</g>
<g style="fill:#FFFFFF; fill-opacity:1.0000; stroke:none;">
<circle cx="42.2450" cy="60.9050" r="0.4000" /> 
</g>
<g style="fill:#FFFFFF; fill-opacity:1.0000; stroke:none;">
<circle cx="42.2450" cy="15.1850" r="0.3500" /> 
</g>
<g style="fill:#FFFFFF; fill-opacity:1.0000; stroke:none;">
<circle cx="49.8650" cy="15.1850" r="0.3500" /> 
</g>
<g style="fill:#FFFFFF; fill-opacity:1.0000; stroke:none;">
<circle cx="49.8650" cy="64.7150" r="0.3500" /> 
</g>
<g style="fill:#FFFFFF; fill-opacity:1.0000; stroke:none;">
<circle cx="42.2450" cy="64.7150" r="0.3500" /> 
</g>
<g style="fill:#FFFFFF; fill-opacity:1.0000; stroke:none;">
<circle cx="42.2450" cy="18.9950" r="0.4000" /> 
</g>
<g style="fill:#FFFFFF; fill-opacity:1.0000; stroke:none;">
<circle cx="49.8650" cy="18.9950" r="0.4000" /> 
</g>
<g style="fill:#FFFFFF; fill-opacity:1.0000; stroke:none;">
<circle cx="42.2450" cy="34.2350" r="0.3500" /> 
</g>
<g style="fill:#FFFFFF; fill-opacity:1.0000; stroke:none;">
<circle cx="49.8650" cy="34.2350" r="0.3500" /> 
</g>
<g style="fill:#FFFFFF; fill-opacity:1.0000; stroke:none;">
<circle cx="42.2450" cy="68.5250" r="0.3500" /> 
</g>
<g style="fill:#FFFFFF; fill-opacity:1.0000; stroke:none;">
<circle cx="49.8650" cy="68.5250" r="0.3500" /> 
</g>
<g style="fill:#FFFFFF; fill-opacity:1.0000; stroke:none;">
<circle cx="49.8650" cy="7.5650" r="0.3500" /> 
</g>
<g style="fill:#FFFFFF; fill-opacity:1.0000; stroke:none;">
<circle cx="42.2450" cy="7.5650" r="0.3500" /> 
</g>
<g style="fill:#FFFFFF; fill-opacity:1.0000; stroke:none;">
<circle cx="42.2450" cy="49.4750" r="0.3500" /> 
</g>
<g style="fill:#FFFFFF; fill-opacity:1.0000; stroke:none;">
<circle cx="49.8650" cy="49.4750" r="0.3500" /> 
</g>
<g style="fill:#FFFFFF; fill-opacity:1.0000; stroke:none;">
<circle cx="42.2450" cy="57.0950" r="0.4000" /> 
</g>
<g style="fill:#FFFFFF; fill-opacity:1.0000; stroke:none;">
<circle cx="49.8650" cy="57.0950" r="0.4000" /> 
</g>
<g style="fill:#FFFFFF; fill-opacity:1.0000; stroke:none;">
<circle cx="42.2450" cy="38.0450" r="0.4000" /> 
</g>
<g style="fill:#FFFFFF; fill-opacity:1.0000; stroke:none;">
<circle cx="49.8650" cy="38.0450" r="0.4000" /> 
</g> 
</svg>
