<?xml version="1.0" standalone="no"?>
 <!DOCTYPE svg PUBLIC "-//W3C//DTD SVG 1.1//EN" 
 "http://www.w3.org/Graphics/SVG/1.1/DTD/svg11.dtd"> 
<svg
  xmlns:svg="http://www.w3.org/2000/svg"
  xmlns="http://www.w3.org/2000/svg"
  xmlns:xlink="http://www.w3.org/1999/xlink"
  version="1.1"
  width="100.0252mm" height="80.0354mm" viewBox="0.0000 0.0000 100.0252 80.0354">
<title>SVG Image created as fdrumPCB-Edge_Cuts.svg date 2024/03/22 08:37:58 </title>
  <desc>Image generated by PCBNEW </desc>
<g style="fill:#000000; fill-opacity:1.0000;stroke:#000000; stroke-opacity:1.0000;
stroke-linecap:round; stroke-linejoin:round;"
 transform="translate(0 0) scale(1 1)">
</g>
<g style="fill:none; 
stroke:#000000; stroke-width:0.0500; stroke-opacity:1; 
stroke-linecap:round; stroke-linejoin:round;">
<path d="M0.0250 10.0250
L0.0250 70.0250
" />
<path d="M90.0250 0.0250
L10.0250 0.0250
" />
<path d="M100.0250 70.0250
L100.0250 10.0250
" />
<path d="M10.0250 80.0250
L90.0250 80.0250
" />
<path d="M0.0250 70.0250 A10.0000 10.0000 0.0 0 0 10.0250 80.0250" />
<path d="M100.0250 10.0250 A10.0000 10.0000 0.0 0 0 90.0250 0.0250" />
<path d="M90.0250 80.0250 A10.0000 10.0000 0.0 0 0 100.0250 70.0250" />
<path d="M10.0250 0.0250 A10.0000 10.0000 0.0 0 0 0.0250 10.0250" />
</g> 
</svg>
