#include <stdio.h>
#include <stdlib.h>
#include <string.h>

typedef struct{
	char Tab[20];
	int sommet;
}pile;
pile*InitialiserPile(){
	pile*P;
	P=(pile*)malloc(sizeof(pile)) ;
	P->sommet=-1;
	return P;
}
int pileVide(pile*P){
	if(P->sommet==-1){  return 1;  }
	else return 0;
}
int pileplein(pile*P){
	if(P->sommet==20-1){  return 1; 	}
	else return 0;
}
char depiler(pile*P){
	if(pileVide(P)==1){  exit(1);  }
	else{
		char x;
		strcpy(x,P->Tab[P->sommet]);
		P->sommet--;
		return x;
	}
}
void empiler(pile *P,char elt){
	if(pileplein(P)==1){  exit(1);  }
	else{
		P->sommet++;
		strcpy(P->Tab[P->sommet],elt);
	}
}
void DepileEmpile(pile*P1,pile*P2){
	char a;
	strcpy(a,depiler(P1));
	empiler(P2,a);
}
int palindrome(pile*P,int nu){
	int i;
	char b;
	int Pali=1;
	pile*P2;
	int a;
	if(pileVide(P)==1) {   exit(1); }
	else{
		a=nu/2;
		for(i=1;i<=a;i++){    DepileEmpile(P,P2);   }
	}
	if( nu%2!=0){    	strcpy(b,depiler(P));   }
	while((pileVide(P2)!=1)){ 
	  if( strcmp(P2->Tab[P2->sommet],P->Tab[P->sommet])!=0) { Pali=0;} 
	   }
	  if(nu%2!=0) {  empiler(P,b); }
	  while((pileVide(P2)!=1)){    DepileEmpile(P2,P);  }
	  return Pali;
}
pile*entree(int nu){
	int i;
	char a[1];
	pile*P;
	P=InitialiserPile();
	for(i=1;i<=nu;i++){
		printf("Entree La Letre %d : ",i);
		scanf("%s",&a[0]);
		empiler(P,a);
	}
	return P;
}
int main(int argc, char *argv[]) {
	pile*P;
	int n;
	int a;
	printf("Entree Nombres Des Lettre De Nome : ");
	scanf("%d",&n);
	P=entree(n);
	a=palindrome(P,n);
	if(a=1){  printf("Palindrome"); }
	else{
	  printf("N'est Palindrome.");	
	}
	
	return 0;
}