[gd_scene load_steps=2 format=3 uid="uid://7ko30icbiwim"]

[ext_resource type="Script" path="res://src/model/components/attraction/attractor.gd" id="1_20npg"]

[node name="Attractor" type="Area2D"]
collision_layer = 0
collision_mask = 0
monitoring = false
script = ExtResource("1_20npg")
