[gd_scene load_steps=3 format=3 uid="uid://cu7ftdcbol4e3"]

[ext_resource type="Script" path="res://src/ui/keyCounter.gd" id="1_f0qci"]
[ext_resource type="Texture2D" uid="uid://5vpkg4nm1te0" path="res://assets/items/keys/key_01a.png" id="1_n0114"]

[node name="KeyCounter" type="HBoxContainer"]
offset_right = 23.0
offset_bottom = 23.0
theme_override_constants/separation = 0
script = ExtResource("1_f0qci")

[node name="Label" type="Label" parent="."]
layout_mode = 2
text = "00"

[node name="TextureRect" type="TextureRect" parent="."]
layout_mode = 2
texture = ExtResource("1_n0114")
expand_mode = 2
