[gd_scene load_steps=4 format=3 uid="uid://0oseje8ixpk6"]

[ext_resource type="Texture2D" uid="uid://b05masd640hgn" path="res://assets/missing_texture.png" id="1_su641"]
[ext_resource type="Script" uid="uid://dqgrwu1ruuyw8" path="res://src/ui/stats/buff.gd" id="2_5xjp5"]
[ext_resource type="Texture2D" uid="uid://06rd3n1gb8dq" path="res://assets/ui/statusEffects/progress_overlay.png" id="3_xn3wu"]

[node name="StatsBuff" type="TextureRect"]
custom_minimum_size = Vector2(32, 32)
offset_right = 32.0
offset_bottom = 32.0
mouse_filter = 0
texture = ExtResource("1_su641")
expand_mode = 2
script = ExtResource("2_5xjp5")

[node name="ProgressRemainingDuration" type="TextureProgressBar" parent="."]
modulate = Color(1, 1, 1, 0.705882)
layout_mode = 1
anchors_preset = 15
anchor_right = 1.0
anchor_bottom = 1.0
grow_horizontal = 2
grow_vertical = 2
step = 0.0
fill_mode = 4
texture_progress = ExtResource("3_xn3wu")

[node name="RemainingDuration" type="PanelContainer" parent="."]
visible = false
top_level = true
layout_mode = 0
offset_right = 43.0
offset_bottom = 25.0
mouse_filter = 2

[node name="MarginContainer" type="MarginContainer" parent="RemainingDuration"]
layout_mode = 2
theme_override_constants/margin_left = 4
theme_override_constants/margin_top = 1
theme_override_constants/margin_right = 4
theme_override_constants/margin_bottom = 1

[node name="HBoxContainer" type="VBoxContainer" parent="RemainingDuration/MarginContainer"]
layout_mode = 2
theme_override_constants/separation = 0

[node name="Skill" type="Label" parent="RemainingDuration/MarginContainer/HBoxContainer"]
unique_name_in_owner = true
layout_mode = 2
text = "Skill"

[node name="Duration" type="Label" parent="RemainingDuration/MarginContainer/HBoxContainer"]
unique_name_in_owner = true
layout_mode = 2
text = "0.0 s"

[connection signal="mouse_entered" from="." to="." method="_on_mouse_entered"]
[connection signal="mouse_exited" from="." to="." method="_on_mouse_exited"]
