[gd_scene load_steps=5 format=3 uid="uid://d0xlhjj0xnw48"]

[ext_resource type="Script" path="res://src/ui/inventory/inventory.gd" id="1_5adh7"]
[ext_resource type="Script" path="res://src/resources/items/rItemQuan.gd" id="2_1q66e"]
[ext_resource type="Script" path="res://src/resources/actors/player/rInventory.gd" id="3_emy1i"]

[sub_resource type="Resource" id="Resource_ahsd6"]
script = ExtResource("3_emy1i")
currency = 0.0
keys = Array[ExtResource("2_1q66e")]([])
items = Array[ExtResource("2_1q66e")]([])

[node name="Inventory" type="PanelContainer"]
anchors_preset = 8
anchor_left = 0.5
anchor_top = 0.5
anchor_right = 0.5
anchor_bottom = 0.5
offset_left = -67.5
offset_top = -37.5
offset_right = 67.5
offset_bottom = 37.5
grow_horizontal = 2
grow_vertical = 2
script = ExtResource("1_5adh7")
_grid_cells = 24
_inventory = SubResource("Resource_ahsd6")

[node name="MarginContainer" type="MarginContainer" parent="."]
layout_mode = 2
theme_override_constants/margin_left = 16
theme_override_constants/margin_top = 8
theme_override_constants/margin_right = 8
theme_override_constants/margin_bottom = 16

[node name="HBoxContainer" type="VBoxContainer" parent="MarginContainer"]
layout_mode = 2

[node name="Label" type="Label" parent="MarginContainer/HBoxContainer"]
layout_mode = 2
text = "Inventory"

[node name="ScrollContainer" type="ScrollContainer" parent="MarginContainer/HBoxContainer"]
clip_contents = false
custom_minimum_size = Vector2(282, 184)
layout_mode = 2

[node name="ItemGrid" type="GridContainer" parent="MarginContainer/HBoxContainer/ScrollContainer"]
unique_name_in_owner = true
layout_mode = 2
theme_override_constants/h_separation = 2
theme_override_constants/v_separation = 2
columns = 6
