{
  "type": "service_account",
  "project_id": "studtourism",
  "private_key_id": "b70bd0779e4165b988eaf2e24b2c08824fdd67c5",
  "private_key": "-----BEGIN PRIVATE KEY-----\nMIIEvgIBADANBgkqhkiG9w0BAQEFAASCBKgwggSkAgEAAoIBAQDAnDZk66TSd9ip\nQg3761KcezRyFBVRMJd21UUk+MT7fOvLtCs3Dt/2OHU4ljJ3SKAH7XjczwtcgpeW\nSt2dVbmQj7xD02wA8aWpGQGWklrQT7FgqP53p/Bi6E77ld7XrslN/EqmzedPel6H\nkPQQXGKB7p1KqcljeFcoZq4KZl2ag+pwcBONythTWtnrwZn5gwyPFOqDi3d1am8s\naZH7YcQt7KJpRHxlVWgbDHK7PAOOhAOFCBJOgjYT5lU/x0UsskwI6EmKWvSBFxWv\n78eCaTS89pG2p8w4bKkpXZywf7REDJQBthUy/b+EstzqVPIjsL4aFXL0QpRGSl+m\nDa5WHVpTAgMBAAECggEASUvI6UvBG7Sutu5jmu/YrqK1+QmKeSyIHxkWqHSgpWFK\n6+hin5+h+7VNalzB1KHHAG1OlpyVor0xiWhxADwMkyYXiyoMCinrFDfnYlDMjUQe\naH225Hr8n+7ui4/jTul9QpeVIvftI9IZ4fX34rf9ZpuSsMR+1kMHy+CTL3L4AOGz\nfmsV14iP8acA4e43l3suZygMhIejFTSsgjcrLDhH7DJeJJCPKKeYT/b+pHnLVn6m\n6ufRJlN6S4XamtYCV607ZjppWxyB4rJMTDjccm7SLm/BHnJcCKIe75yfbZd9XCi5\nEESV6QQBB6lZGIFNlgGNwbxurbdjjnMOVMfJXiwv7QKBgQD1Zmbo5AL5I+nzM7Lp\n50o+sPVFMzyjE9nVIaEmOOvVbqeho7NoAj2kwgiJ/SGmFPIk+CeARcXY9Gei6Kmn\nfPqmt+Pd6OV5FZve8EMX9ugFXJ1YQxyemX+YfyyxgOqyj+0udCx2+rEX+muNsvJa\nuzTsFZp4d/56qFjUWy2Hsr+JzQKBgQDI7hGFAgtBbtuVWFojprh1e+JrWOslhrsw\nN8bpxE2+id5tmFu4f8kb7CNZaOfMHIt3CK8nqcozFAcNsLdgVi/I4SHnw2AXGCZB\nyIF9UjlcXVDg555jmTo69r2T0IE7YAWekFve9uCZ5C81yBWhPmq7WtoZNjFAQrf/\nHMPEYi3UnwKBgEUMMxiET3HacRFFEqpNsc5B7EE0UXNxOnGFrNocWf8Ly47niKtT\nNhUNo2lwF++rJRbR3Atzll+dJSvpWxMNT1lplGv0A901/02TPM2ZY19e18bl2z+k\n4Qn/fovTQjZL2OihN4GiuAGPLIQKPbbZxeJHkdcjrC7G/3eA0CbGXK5hAoGBAK3w\n2h3IvTGx5EmPKMlAJOMfkczYNwhPcHC3eG0aUSsncvRxNsWrac/QRnG6TR/3fgxX\n6jlt1OsO5WRGnRi6w7cknhNioSac81FzYBW7PojlB4ULPaR/G1e8DjWOBLH/2B2C\nXuXP1nOig/QM+ByUShVS+wdkUJKOr3Yb0qWJUJ+FAoGBAJtFE+yEvK/SqkrHke0g\nxJ7fL7EXPZjGlIvFCkiPHskpeZVMB93LeZY3I5XrJj5o2SvcT83B1kWnMafjkEdK\nyzgVYoICOHm9oaqYNa3D9RjFTCRDOBm3Fk6kxWFtEkE+VPsOx8ArdUL+j8WpAs/p\ni7tGpAS5uBxBISLoDfxBvfNt\n-----END PRIVATE KEY-----\n",
  "client_email": "firebase-adminsdk-i1xcp@studtourism.iam.gserviceaccount.com",
  "client_id": "116979864486424352944",
  "auth_uri": "https://accounts.google.com/o/oauth2/auth",
  "token_uri": "https://oauth2.googleapis.com/token",
  "auth_provider_x509_cert_url": "https://www.googleapis.com/oauth2/v1/certs",
  "client_x509_cert_url": "https://www.googleapis.com/robot/v1/metadata/x509/firebase-adminsdk-i1xcp%40studtourism.iam.gserviceaccount.com"
}
