{
    "1": [
        {
            "artist": [
                "ANNA ASTI"
            ]
        },
        {
            "track": "По барам"
        }
    ],
    "2": [
        {
            "artist": [
                "ЕГОР КРИД",
                "Михаил Шуфутинский "
            ]
        },
        {
            "track": "3-е Сентября"
        }
    ],
    "3": [
        {
            "artist": [
                "JONY"
            ]
        },
        {
            "track": "Никак"
        }
    ],
    "4": [
        {
            "artist": [
                "Моя Мишель",
                "Dose"
            ]
        },
        {
            "track": "Пташка"
        }
    ],
    "5": [
        {
            "artist": [
                "Markul",
                "Тося Чайкина"
            ]
        },
        {
            "track": "Стрелы"
        }
    ],
    "6": [
        {
            "artist": [
                "ANNA ASTI",
                "Филипп Киркоров"
            ]
        },
        {
            "track": "Хобби"
        }
    ],
    "7": [
        {
            "artist": [
                "Антон Токарев"
            ]
        },
        {
            "track": "Седьмой лепесток"
        }
    ],
    "8": [
        {
            "artist": [
                "Полина Гагарина",
                "Дима Билан"
            ]
        },
        {
            "track": "Души"
        }
    ],
    "9": [
        {
            "artist": [
                "GAYAZOV$ BROTHER$"
            ]
        },
        {
            "track": "МАЛИНОВАЯ ЛАДА"
        }
    ],
    "10": [
        {
            "artist": [
                "Kamazz"
            ]
        },
        {
            "track": "Как ты там"
        }
    ],
    "11": [
        {
            "artist": [
                "Aarne",
                "BUSHIDO ZHO",
                "ANIKV"
            ]
        },
        {
            "track": "Тесно"
        }
    ],
    "12": [
        {
            "artist": [
                "ЕГОР КРИД"
            ]
        },
        {
            "track": "We Gotta Get Love"
        }
    ],
    "13": [
        {
            "artist": [
                "Люся Чеботина"
            ]
        },
        {
            "track": "ПЛАКАЛ ГОЛЛИВУД"
        }
    ],
    "14": [
        {
            "artist": [
                "Artik & Asti"
            ]
        },
        {
            "track": "Гармония"
        }
    ],
    "15": [
        {
            "artist": [
                "Три дня дождя"
            ]
        },
        {
            "track": "Отпускай"
        }
    ],
    "16": [
        {
            "artist": [
                "Miyagi & Andy Panda",
                "Mav-d"
            ]
        },
        {
            "track": "Marmalade"
        }
    ],
    "17": [
        {
            "artist": [
                "ANNA ASTI"
            ]
        },
        {
            "track": "Повело"
        }
    ],
    "18": [
        {
            "artist": [
                "JONY"
            ]
        },
        {
            "track": "Титры"
        }
    ],
    "19": [
        {
            "artist": [
                "Ислам Итляшев"
            ]
        },
        {
            "track": "Ай-яй-яй"
        }
    ],
    "20": [
        {
            "artist": [
                "DJ SMASH",
                "Artik & Asti"
            ]
        },
        {
            "track": "CO2"
        }
    ],
    "21": [
        {
            "artist": [
                "GAYAZOV$ BROTHER$"
            ]
        },
        {
            "track": "Спасай мою пятницу"
        }
    ],
    "22": [
        {
            "artist": [
                "Imanbek",
                "BYOR"
            ]
        },
        {
            "track": "Belly Dancer"
        }
    ],
    "23": [
        {
            "artist": [
                "FINIK",
                "ALEKS ATAMAN"
            ]
        },
        {
            "track": "Девочка бандитка"
        }
    ],
    "24": [
        {
            "artist": [
                "Miyagi & Andy Panda",
                "TumaniYO"
            ]
        },
        {
            "track": "Brooklyn"
        }
    ],
    "25": [
        {
            "artist": [
                "Моя Мишель",
                "ЛСП"
            ]
        },
        {
            "track": "Курточка"
        }
    ],
    "26": [
        {
            "artist": [
                "Лолита",
                "Коста Лакоста"
            ]
        },
        {
            "track": "По-другому"
        }
    ],
    "27": [
        {
            "artist": [
                "Miyagi & Andy Panda"
            ]
        },
        {
            "track": "Minor"
        }
    ],
    "28": [
        {
            "artist": [
                "Filatov & Karas",
                "Мумий Тролль"
            ]
        },
        {
            "track": "Amore Море, Goodbye"
        }
    ],
    "29": [
        {
            "artist": [
                "Imagine Dragons"
            ]
        },
        {
            "track": "Bones"
        }
    ],
    "30": [
        {
            "artist": [
                "A.V.G",
                "Jakone"
            ]
        },
        {
            "track": "Платина"
        }
    ],
    "31": [
        {
            "artist": [
                "Arut",
                "MORGENSHTERN"
            ]
        },
        {
            "track": "BUGATTI"
        }
    ],
    "32": [
        {
            "artist": [
                "Три дня дождя"
            ]
        },
        {
            "track": "Где ты"
        }
    ],
    "33": [
        {
            "artist": [
                "Тима Акимов"
            ]
        },
        {
            "track": "Пролетело лето"
        }
    ],
    "34": [
        {
            "artist": [
                "DZHIVAN"
            ]
        },
        {
            "track": "Автор"
        }
    ],
    "35": [
        {
            "artist": [
                "Король и Шут"
            ]
        },
        {
            "track": "Кукла колдуна"
        }
    ],
    "36": [
        {
            "artist": [
                "Imagine Dragons",
                "J.I.D",
                "Arcane",
                "League of Legends"
            ]
        },
        {
            "track": "Enemy"
        }
    ],
    "37": [
        {
            "artist": [
                "Ollane",
                "Miyagi"
            ]
        },
        {
            "track": "Touch the Sky"
        }
    ],
    "38": [
        {
            "artist": [
                "Люся Чеботина"
            ]
        },
        {
            "track": "Солнце Монако"
        }
    ],
    "39": [
        {
            "artist": [
                "BUSHIDO ZHO"
            ]
        },
        {
            "track": "vodila"
        }
    ],
    "40": [
        {
            "artist": [
                "Miyagi & Эндшпиль",
                "Рем Дигга"
            ]
        },
        {
            "track": "I Got Love"
        }
    ],
    "41": [
        {
            "artist": [
                "Мари Краймбрери",
                "Alex Davia"
            ]
        },
        {
            "track": "Успокою"
        }
    ],
    "42": [
        {
            "artist": [
                "Zivert",
                "LYRIQ"
            ]
        },
        {
            "track": "Forever Young"
        }
    ],
    "43": [
        {
            "artist": [
                "Idris & Leos",
                "NILETTO"
            ]
        },
        {
            "track": "Дурная привычка"
        }
    ],
    "44": [
        {
            "artist": [
                "Green Apelsin"
            ]
        },
        {
            "track": "Проклятие русалки"
        }
    ],
    "45": [
        {
            "artist": [
                "Akmal'"
            ]
        },
        {
            "track": "Приснись"
        }
    ],
    "46": [
        {
            "artist": [
                "Порнофильмы"
            ]
        },
        {
            "track": "Я так соскучился"
        }
    ],
    "47": [
        {
            "artist": [
                "The Limba"
            ]
        },
        {
            "track": "Не больно"
        }
    ],
    "48": [
        {
            "artist": [
                "Galibri & Mavik"
            ]
        },
        {
            "track": "Карнавал"
        }
    ],
    "49": [
        {
            "artist": [
                "Три дня дождя"
            ]
        },
        {
            "track": "Перезаряжай"
        }
    ],
    "50": [
        {
            "artist": [
                "Клава Кока"
            ]
        },
        {
            "track": "Плачешь"
        }
    ],
    "51": [
        {
            "artist": [
                "HammAli & Navai"
            ]
        },
        {
            "track": "Птичка"
        }
    ],
    "52": [
        {
            "artist": [
                "просто Лера"
            ]
        },
        {
            "track": "Питер - Владивосток"
        }
    ],
    "53": [
        {
            "artist": [
                "VACÍO"
            ]
        },
        {
            "track": "Притон"
        }
    ],
    "54": [
        {
            "artist": [
                "fem.love"
            ]
        },
        {
            "track": "Фотографирую закат"
        }
    ],
    "55": [
        {
            "artist": [
                "Miyagi & Andy Panda"
            ]
        },
        {
            "track": "Там ревели горы"
        }
    ],
    "56": [
        {
            "artist": [
                "Анет Сай"
            ]
        },
        {
            "track": "Медляк"
        }
    ],
    "57": [
        {
            "artist": [
                "The Weeknd"
            ]
        },
        {
            "track": "Blinding Lights"
        }
    ],
    "58": [
        {
            "artist": [
                "10AGE"
            ]
        },
        {
            "track": "Зоопарк"
        }
    ],
    "59": [
        {
            "artist": [
                "Блажин"
            ]
        },
        {
            "track": "Не перебивай"
        }
    ],
    "60": [
        {
            "artist": [
                "Мари Краймбрери"
            ]
        },
        {
            "track": "Лавандовый раф"
        }
    ],
    "61": [
        {
            "artist": [
                "Griffinilla"
            ]
        },
        {
            "track": "Hard Drive"
        }
    ],
    "62": [
        {
            "artist": [
                "The Limba"
            ]
        },
        {
            "track": "Секрет"
        }
    ],
    "63": [
        {
            "artist": [
                "Султан Лагучев"
            ]
        },
        {
            "track": "Горький вкус"
        }
    ],
    "64": [
        {
            "artist": [
                "Мао"
            ]
        },
        {
            "track": "Забудь"
        }
    ],
    "65": [
        {
            "artist": [
                "remember."
            ]
        },
        {
            "track": "Я всё решу (Intro)"
        }
    ],
    "66": [
        {
            "artist": [
                "Galibri & Mavik"
            ]
        },
        {
            "track": "Федерико Феллини"
        }
    ],
    "67": [
        {
            "artist": [
                "shadowraze"
            ]
        },
        {
            "track": "showdown"
        }
    ],
    "68": [
        {
            "artist": [
                "Aarne",
                "Yanix",
                "SEEMEE"
            ]
        },
        {
            "track": "Фиеста"
        }
    ],
    "69": [
        {
            "artist": [
                "SALUKI"
            ]
        },
        {
            "track": "Огней"
        }
    ],
    "70": [
        {
            "artist": [
                "Король и Шут"
            ]
        },
        {
            "track": "Лесник"
        }
    ],
    "71": [
        {
            "artist": [
                "ANIKV",
                "SALUKI"
            ]
        },
        {
            "track": "Огни"
        }
    ],
    "72": [
        {
            "artist": [
                "Big Baby Tape",
                "kizaru"
            ]
        },
        {
            "track": "Million"
        }
    ],
    "73": [
        {
            "artist": [
                "ELMAN",
                "MONA"
            ]
        },
        {
            "track": "Черная любовь"
        }
    ],
    "74": [
        {
            "artist": [
                "ТАТАРИН",
                "Татем"
            ]
        },
        {
            "track": "Пацаны из падиков"
        }
    ],
    "75": [
        {
            "artist": [
                "Purple Disco Machine",
                "Sophie and the Giants"
            ]
        },
        {
            "track": "In The Dark"
        }
    ],
    "76": [
        {
            "artist": [
                "Zivert"
            ]
        },
        {
            "track": "WAKE UP!"
        }
    ],
    "77": [
        {
            "artist": [
                "Нервы"
            ]
        },
        {
            "track": "Нервы"
        }
    ],
    "78": [
        {
            "artist": [
                "алёна швец."
            ]
        },
        {
            "track": "первое свидание"
        }
    ],
    "79": [
        {
            "artist": [
                "FINIK",
                "ALEKS ATAMAN"
            ]
        },
        {
            "track": "Юра Шатунов"
        }
    ],
    "80": [
        {
            "artist": [
                "NЮ"
            ]
        },
        {
            "track": "Некуда бежать"
        }
    ],
    "81": [
        {
            "artist": [
                "ANNA ASTI"
            ]
        },
        {
            "track": "Феникс"
        }
    ],
    "82": [
        {
            "artist": [
                "ANNA ASTI"
            ]
        },
        {
            "track": "Сорри"
        }
    ],
    "83": [
        {
            "artist": [
                "MACAN"
            ]
        },
        {
            "track": "За всех"
        }
    ],
    "84": [
        {
            "artist": [
                "shadowraze"
            ]
        },
        {
            "track": "astral step"
        }
    ],
    "85": [
        {
            "artist": [
                "BRANYA",
                "MACAN"
            ]
        },
        {
            "track": "Пополам"
        }
    ],
    "86": [
        {
            "artist": [
                "ZOLOTO"
            ]
        },
        {
            "track": "Грустно на афтепати"
        }
    ],
    "87": [
        {
            "artist": [
                "Нодар Ревия"
            ]
        },
        {
            "track": "Аэропорты"
        }
    ],
    "88": [
        {
            "artist": [
                "Miyagi & Andy Panda"
            ]
        },
        {
            "track": "Патрон"
        }
    ],
    "89": [
        {
            "artist": [
                "Liili"
            ]
        },
        {
            "track": "Hot"
        }
    ],
    "90": [
        {
            "artist": [
                "R.A.SVET",
                "TMNV"
            ]
        },
        {
            "track": "Не сойти с ума"
        }
    ],
    "91": [
        {
            "artist": [
                "GAYAZOV$ BROTHER$",
                "Filatov & Karas"
            ]
        },
        {
            "track": "Пошла жара"
        }
    ],
    "92": [
        {
            "artist": [
                "Джарахов",
                "Markul"
            ]
        },
        {
            "track": "Я в моменте"
        }
    ],
    "93": [
        {
            "artist": [
                "FINIK",
                "ALEKS ATAMAN"
            ]
        },
        {
            "track": "Диалоги тет-а-тет"
        }
    ],
    "94": [
        {
            "artist": [
                "Dabro"
            ]
        },
        {
            "track": "Мне не страшно"
        }
    ],
    "95": [
        {
            "artist": [
                "Зомб"
            ]
        },
        {
            "track": "По Садовому"
        }
    ],
    "96": [
        {
            "artist": [
                "SHAMI"
            ]
        },
        {
            "track": "Она ищет любовь"
        }
    ],
    "97": [
        {
            "artist": [
                "Скриптонит",
                "Райда"
            ]
        },
        {
            "track": "Baby mama"
        }
    ],
    "98": [
        {
            "artist": [
                "Big Baby Tape",
                "kizaru"
            ]
        },
        {
            "track": "Bandana"
        }
    ],
    "99": [
        {
            "artist": [
                "Melisa",
                "TOMMO"
            ]
        },
        {
            "track": "I'm Alone"
        }
    ],
    "100": [
        {
            "artist": [
                "Boulevard Depo"
            ]
        },
        {
            "track": "AYОЙ"
        }
    ]
}