{
	"credit": "Made with Blockbench",
	"texture_size": [64, 64],
	"textures": {
		"0": "model/weapon/bow/beginner_bow",
		"particle": "model/weapon/bow/beginner_bow"
	},
	"elements": [
		{
			"from": [7.5, 5, 7.5],
			"to": [8.5, 11, 8.5],
			"faces": {
				"north": {"uv": [4.75, 0, 5.25, 3], "texture": "#0"},
				"east": {"uv": [4.75, 0, 5.25, 3], "texture": "#0"},
				"south": {"uv": [4.75, 0, 5.25, 3], "texture": "#0"},
				"west": {"uv": [4.75, 0, 5.25, 3], "texture": "#0"},
				"up": {"uv": [4.75, 0, 5.25, 3], "texture": "#0"},
				"down": {"uv": [4.75, 0, 5.25, 3], "texture": "#0"}
			}
		},
		{
			"from": [7.75, 8, 15.75],
			"to": [8.25, 20, 16.25],
			"rotation": {"angle": -22.5, "axis": "x", "origin": [8, 8, 16.25]},
			"faces": {
				"north": {"uv": [5.5, 0, 5.75, 6], "texture": "#0"},
				"east": {"uv": [5.25, 0, 5.5, 6], "texture": "#0"},
				"south": {"uv": [6, 0, 6.25, 6], "texture": "#0"},
				"west": {"uv": [5.75, 0, 6, 6], "texture": "#0"},
				"up": {"uv": [3, 3.25, 3.25, 9.25], "texture": "#0"},
				"down": {"uv": [3, 3.25, 3.25, 9.25], "texture": "#0"}
			}
		},
		{
			"from": [7.75, -4, 15.75],
			"to": [8.25, 8, 16.25],
			"rotation": {"angle": 22.5, "axis": "x", "origin": [8, 8, 16.25]},
			"faces": {
				"north": {"uv": [5.5, 0, 5.75, 6], "texture": "#0"},
				"east": {"uv": [5.25, 0, 5.5, 6], "texture": "#0"},
				"south": {"uv": [6, 0, 6.25, 6], "texture": "#0"},
				"west": {"uv": [5.75, 0, 6, 6], "texture": "#0"},
				"up": {"uv": [3, 3.25, 3.25, 9.25], "texture": "#0"},
				"down": {"uv": [3, 3.25, 3.25, 9.25], "texture": "#0"}
			}
		},
		{
			"from": [8, 6.5, -1.25],
			"to": [8, 9.5, 17.25],
			"rotation": {"angle": 45, "axis": "z", "origin": [8, 8, 9.75]},
			"faces": {
				"north": {"uv": [0, 0, 0, 0.75], "texture": "#0"},
				"east": {"uv": [9.25, 14.5, 0, 16], "texture": "#0"},
				"south": {"uv": [0, 0, 0, 0.75], "texture": "#0"},
				"west": {"uv": [0, 14.5, 9.25, 16], "texture": "#0"},
				"up": {"uv": [0, 0, 0, 3.75], "texture": "#0"},
				"down": {"uv": [0, 0, 0, 3.75], "texture": "#0"}
			}
		},
		{
			"from": [8, 6.5, -1.25],
			"to": [8, 9.5, 17.25],
			"rotation": {"angle": -45, "axis": "z", "origin": [8, 8, 9.75]},
			"faces": {
				"north": {"uv": [0, 0, 0, 0.75], "texture": "#missing"},
				"east": {"uv": [9.25, 14.5, 0, 16], "texture": "#0"},
				"south": {"uv": [0, 0, 0, 0.75], "texture": "#missing"},
				"west": {"uv": [0, 14.5, 9.25, 16], "texture": "#0"},
				"up": {"uv": [0, 0, 0, 3.75], "texture": "#missing"},
				"down": {"uv": [0, 0, 0, 3.75], "texture": "#missing"}
			}
		},
		{
			"from": [7.75, -1, 7],
			"to": [8.25, -0.5, 7.5],
			"rotation": {"angle": -22.5, "axis": "x", "origin": [8.025, -0.5, 7]},
			"faces": {
				"north": {"uv": [3, 9.5, 3.25, 9.75], "texture": "#0"},
				"east": {"uv": [0.75, 9.5, 1, 9.75], "texture": "#0"},
				"south": {"uv": [0.75, 9.5, 1, 9.75], "texture": "#0"},
				"west": {"uv": [0.75, 9.5, 1, 9.75], "texture": "#0"},
				"up": {"uv": [0.75, 9.5, 1, 9.75], "texture": "#0"},
				"down": {"uv": [0.75, 9.5, 1, 9.75], "texture": "#0"}
			}
		},
		{
			"from": [7.75, -1.5, 7.5],
			"to": [8.25, -0.5, 8],
			"rotation": {"angle": -22.5, "axis": "x", "origin": [8.025, -0.5, 7]},
			"faces": {
				"north": {"uv": [3, 9.5, 3.25, 10], "texture": "#0"},
				"east": {"uv": [1, 9.5, 1.25, 10], "texture": "#0"},
				"south": {"uv": [1, 9.5, 1.25, 10], "texture": "#0"},
				"west": {"uv": [1, 9.5, 1.25, 10], "texture": "#0"},
				"up": {"uv": [1, 9.5, 1.25, 10], "texture": "#0"},
				"down": {"uv": [1, 9.75, 1.25, 10], "texture": "#0"}
			}
		},
		{
			"from": [7.75, -2, 8],
			"to": [8.25, -0.5, 8.5],
			"rotation": {"angle": -22.5, "axis": "x", "origin": [8.025, -0.5, 7]},
			"faces": {
				"north": {"uv": [3, 9.5, 3.25, 10.25], "texture": "#0"},
				"east": {"uv": [1.25, 9.5, 1.5, 10.25], "texture": "#0"},
				"south": {"uv": [1.25, 9.5, 1.5, 10.25], "texture": "#0"},
				"west": {"uv": [1.25, 9.5, 1.5, 10.25], "texture": "#0"},
				"up": {"uv": [1.25, 9.5, 1.5, 10.25], "texture": "#0"},
				"down": {"uv": [1.25, 10, 1.5, 10.25], "texture": "#0"}
			}
		},
		{
			"from": [7.75, -2.5, 8.5],
			"to": [8.25, -0.5, 9],
			"rotation": {"angle": -22.5, "axis": "x", "origin": [8.025, -0.5, 7]},
			"faces": {
				"north": {"uv": [3, 9.5, 3.25, 10.5], "texture": "#0"},
				"east": {"uv": [1.5, 9.5, 1.75, 10.5], "texture": "#0"},
				"south": {"uv": [4.25, 9.5, 4.5, 10.5], "texture": "#0"},
				"west": {"uv": [1.5, 9.5, 1.75, 10.5], "texture": "#0"},
				"up": {"uv": [1.5, 9.5, 1.75, 9.75], "texture": "#0"},
				"down": {"uv": [1.5, 10.25, 1.75, 10.5], "texture": "#0"}
			}
		},
		{
			"from": [7.75, -3, 9],
			"to": [8.25, -1, 9.5],
			"rotation": {"angle": -22.5, "axis": "x", "origin": [8.025, -0.5, 7]},
			"faces": {
				"north": {"uv": [3, 9.75, 3.25, 10.75], "texture": "#0"},
				"east": {"uv": [1.75, 9.75, 2, 10.75], "texture": "#0"},
				"south": {"uv": [4.25, 9.75, 4.5, 10.75], "texture": "#0"},
				"west": {"uv": [1.75, 9.75, 2, 10.75], "texture": "#0"},
				"up": {"uv": [1.75, 9.75, 2, 10], "texture": "#0"},
				"down": {"uv": [1.75, 10.5, 2, 10.75], "texture": "#0"}
			}
		},
		{
			"from": [7.75, -4, 9.5],
			"to": [8.25, -1.5, 10],
			"rotation": {"angle": -22.5, "axis": "x", "origin": [8.025, -0.5, 7]},
			"faces": {
				"north": {"uv": [3, 10, 3.25, 11.5], "texture": "#0"},
				"east": {"uv": [2, 10, 2.25, 11.5], "texture": "#0"},
				"south": {"uv": [4.25, 10, 4.5, 11.5], "texture": "#0"},
				"west": {"uv": [2, 10, 2.25, 11.5], "texture": "#0"},
				"up": {"uv": [2, 10, 2.25, 10.25], "texture": "#0"},
				"down": {"uv": [2, 11.25, 2.25, 11.5], "texture": "#0"}
			}
		},
		{
			"from": [7.75, -6.5, 10],
			"to": [8.25, -2.5, 10.5],
			"rotation": {"angle": -22.5, "axis": "x", "origin": [8.025, -0.5, 7]},
			"faces": {
				"north": {"uv": [3, 10.5, 3.25, 12.5], "texture": "#0"},
				"east": {"uv": [2.25, 10.5, 2.5, 12.5], "texture": "#0"},
				"south": {"uv": [4.25, 10.5, 4.5, 12.5], "texture": "#0"},
				"west": {"uv": [2.25, 10.5, 2.5, 12.5], "texture": "#0"},
				"up": {"uv": [2.25, 10.5, 2.5, 10.75], "texture": "#0"},
				"down": {"uv": [2.25, 12.25, 2.5, 12.5], "texture": "#0"}
			}
		},
		{
			"from": [7.75, -5.5, 10.5],
			"to": [8.25, -4, 11],
			"rotation": {"angle": -22.5, "axis": "x", "origin": [8.025, -0.5, 7]},
			"faces": {
				"north": {"uv": [2.5, 11.25, 2.75, 12], "texture": "#0"},
				"east": {"uv": [2.5, 11.25, 2.75, 12], "texture": "#0"},
				"south": {"uv": [4.25, 11.25, 4.5, 12], "texture": "#0"},
				"west": {"uv": [2.5, 11.25, 2.75, 11.5], "texture": "#0"},
				"up": {"uv": [2.5, 11.25, 2.75, 12], "texture": "#0"},
				"down": {"uv": [2.5, 11.75, 2.75, 12], "texture": "#0"}
			}
		},
		{
			"from": [7.75, -6.5, 9.5],
			"to": [8.25, -6, 10],
			"rotation": {"angle": -22.5, "axis": "x", "origin": [8.025, -0.5, 7]},
			"faces": {
				"north": {"uv": [3, 12.25, 3.25, 12.5], "texture": "#0"},
				"east": {"uv": [2, 12.25, 2.25, 12.5], "texture": "#0"},
				"south": {"uv": [2, 12.25, 2.25, 12.5], "texture": "#0"},
				"west": {"uv": [2, 12.25, 2.25, 12.5], "texture": "#0"},
				"up": {"uv": [2, 12.25, 2.25, 12.5], "texture": "#0"},
				"down": {"uv": [2, 12.25, 2.25, 12.5], "texture": "#0"}
			}
		},
		{
			"from": [7.75, -6, 9],
			"to": [8.25, -5.5, 9.5],
			"rotation": {"angle": -22.5, "axis": "x", "origin": [8.025, -0.5, 7]},
			"faces": {
				"north": {"uv": [3, 12, 3.25, 12.25], "texture": "#0"},
				"east": {"uv": [1.75, 12, 2, 12.25], "texture": "#0"},
				"south": {"uv": [4.25, 12, 4.5, 12.25], "texture": "#0"},
				"west": {"uv": [1.75, 12, 2, 12.25], "texture": "#0"},
				"up": {"uv": [1.75, 12, 2, 12.25], "texture": "#0"},
				"down": {"uv": [1.75, 12, 2, 12.25], "texture": "#0"}
			}
		},
		{
			"from": [8.25, -5.2273, 7.96322],
			"to": [8.75, -4.7273, 9.36322],
			"rotation": {"angle": -45, "axis": "x", "origin": [8.025, -0.5, 7]},
			"faces": {
				"north": {"uv": [6.25, 0, 7, 0.25], "texture": "#0"},
				"east": {"uv": [6.25, 0, 7, 0.25], "texture": "#0"},
				"south": {"uv": [6.25, 0, 7, 0.25], "texture": "#0"},
				"west": {"uv": [6.25, 0, 7, 0.25], "texture": "#0"},
				"up": {"uv": [6.25, 0, 6.5, 0.75], "texture": "#0"},
				"down": {"uv": [6.25, 0, 6.5, 0.75], "texture": "#0"}
			}
		},
		{
			"from": [7.25, -5.2273, 7.96322],
			"to": [7.75, -4.7273, 9.36322],
			"rotation": {"angle": -45, "axis": "x", "origin": [8.025, -0.5, 7]},
			"faces": {
				"north": {"uv": [6.25, 0, 7, 0.25], "texture": "#0"},
				"east": {"uv": [6.25, 0, 7, 0.25], "texture": "#0"},
				"south": {"uv": [6.25, 0, 7, 0.25], "texture": "#0"},
				"west": {"uv": [6.25, 0, 7, 0.25], "texture": "#0"},
				"up": {"uv": [6.25, 0, 6.5, 0.75], "texture": "#0"},
				"down": {"uv": [6.25, 0, 6.5, 0.75], "texture": "#0"}
			}
		},
		{
			"from": [7.25, -4, 10.5],
			"to": [8.75, -3.5, 11.025],
			"rotation": {"angle": -22.5, "axis": "x", "origin": [8.025, -0.5, 7]},
			"faces": {
				"north": {"uv": [6.25, 0, 7, 0.25], "texture": "#0"},
				"east": {"uv": [6.75, 0, 7, 0.25], "texture": "#0"},
				"south": {"uv": [6.25, 0, 7, 0.25], "texture": "#0"},
				"west": {"uv": [6.25, 0, 6.5, 0.25], "texture": "#0"},
				"up": {"uv": [6.25, 0, 7, 0.25], "texture": "#0"},
				"down": {"uv": [6.25, 0, 7, 0.25], "texture": "#0"}
			}
		},
		{
			"from": [7.25, -4.5, 9.5],
			"to": [8.75, -4, 10],
			"rotation": {"angle": -22.5, "axis": "x", "origin": [8.025, -0.5, 7]},
			"faces": {
				"north": {"uv": [6.25, 0, 7, 0.25], "texture": "#0"},
				"east": {"uv": [6.75, 0, 7, 0.25], "texture": "#0"},
				"south": {"uv": [6.25, 0, 7, 0.25], "texture": "#0"},
				"west": {"uv": [6.25, 0, 6.5, 0.25], "texture": "#0"},
				"up": {"uv": [6.25, 0, 7, 0.25], "texture": "#0"},
				"down": {"uv": [6.25, 0, 7, 0.25], "texture": "#0"}
			}
		},
		{
			"from": [7.75, -0.5, 8],
			"to": [8.25, 0.5, 8.5],
			"rotation": {"angle": 0, "axis": "x", "origin": [8, 3, 6.5]},
			"faces": {
				"north": {"uv": [1.25, 9, 1.5, 9.5], "texture": "#0"},
				"east": {"uv": [1.25, 9, 1.5, 9.5], "texture": "#0"},
				"south": {"uv": [4.25, 9, 4.5, 9.5], "texture": "#0"},
				"west": {"uv": [1.25, 9, 1.5, 9.5], "texture": "#0"},
				"up": {"uv": [1.25, 9, 1.5, 9.25], "texture": "#0"},
				"down": {"uv": [1.25, 9, 1.5, 9.5], "texture": "#0"}
			}
		},
		{
			"from": [7.75, -0.5, 7.5],
			"to": [8.25, 2.5, 8],
			"rotation": {"angle": 0, "axis": "x", "origin": [8, 3, 6.5]},
			"faces": {
				"north": {"uv": [1, 8, 1.25, 9.5], "texture": "#0"},
				"east": {"uv": [1, 8, 1.25, 9.5], "texture": "#0"},
				"south": {"uv": [4.25, 8, 4.5, 9.5], "texture": "#0"},
				"west": {"uv": [1, 8, 1.25, 9.5], "texture": "#0"},
				"up": {"uv": [1, 8, 1.25, 9.5], "texture": "#0"},
				"down": {"uv": [1, 8, 1.25, 9.5], "texture": "#0"}
			}
		},
		{
			"from": [7.75, -0.5, 7],
			"to": [8.25, 3, 7.5],
			"rotation": {"angle": 0, "axis": "x", "origin": [8, 3, 6.5]},
			"faces": {
				"north": {"uv": [3, 7.75, 3.25, 9.5], "texture": "#0"},
				"east": {"uv": [0.75, 7.75, 1, 9.5], "texture": "#0"},
				"south": {"uv": [0.75, 7.75, 1, 9.5], "texture": "#0"},
				"west": {"uv": [0.75, 7.75, 1, 9.5], "texture": "#0"},
				"up": {"uv": [0.75, 7.75, 1, 9.5], "texture": "#0"},
				"down": {"uv": [0.75, 7.75, 1, 9.5], "texture": "#0"}
			}
		},
		{
			"from": [7.25, 1.5, 6.5],
			"to": [8.75, 3, 7.5],
			"rotation": {"angle": 0, "axis": "x", "origin": [8, 3, 6.5]},
			"faces": {
				"north": {"uv": [2.75, 7.75, 3.5, 8.5], "texture": "#0"},
				"east": {"uv": [0.5, 7.75, 1, 8.5], "texture": "#0"},
				"south": {"uv": [4, 7.75, 4.75, 8.5], "texture": "#0"},
				"west": {"uv": [0.5, 7.75, 1, 8.5], "texture": "#0"},
				"up": {"uv": [0.5, 7.75, 1, 8.5], "texture": "#0"},
				"down": {"uv": [0.5, 7.75, 1, 8.5], "texture": "#0"}
			}
		},
		{
			"from": [7.25, 2.5, 7.5],
			"to": [8.75, 3, 8],
			"rotation": {"angle": 0, "axis": "x", "origin": [8, 3, 6.5]},
			"faces": {
				"north": {"uv": [1, 7.75, 1.25, 8], "texture": "#0"},
				"east": {"uv": [1, 7.75, 1.25, 8], "texture": "#0"},
				"south": {"uv": [4, 7.75, 4.75, 8], "texture": "#0"},
				"west": {"uv": [1, 7.75, 1.25, 8], "texture": "#0"},
				"up": {"uv": [1, 7.75, 1.25, 8], "texture": "#0"},
				"down": {"uv": [1, 7.75, 1.25, 8], "texture": "#0"}
			}
		},
		{
			"from": [7.25, 0.5, 7],
			"to": [8.75, 1.5, 7.5],
			"rotation": {"angle": 0, "axis": "x", "origin": [8, 3, 6.5]},
			"faces": {
				"north": {"uv": [2.75, 8.5, 3.5, 9], "texture": "#0"},
				"east": {"uv": [0.75, 8.5, 1, 9], "texture": "#0"},
				"south": {"uv": [4, 8.5, 4.75, 9], "texture": "#0"},
				"west": {"uv": [0.75, 8.5, 1, 9], "texture": "#0"},
				"up": {"uv": [0.75, 8.5, 1, 9], "texture": "#0"},
				"down": {"uv": [0.75, 8.5, 1, 9], "texture": "#0"}
			}
		},
		{
			"from": [7.75, 0, 6.5],
			"to": [8.25, 3, 7],
			"rotation": {"angle": 0, "axis": "x", "origin": [8, 3, 6.5]},
			"faces": {
				"north": {"uv": [3, 7.75, 3.25, 9.25], "texture": "#0"},
				"east": {"uv": [0.5, 7.75, 0.75, 9.25], "texture": "#0"},
				"south": {"uv": [0.5, 7.75, 0.75, 9.25], "texture": "#0"},
				"west": {"uv": [0.5, 7.75, 0.75, 9.25], "texture": "#0"},
				"up": {"uv": [0.5, 7.75, 0.75, 9.25], "texture": "#0"},
				"down": {"uv": [0.5, 9, 0.75, 9.25], "texture": "#0"}
			}
		},
		{
			"from": [7.75, 1, 6],
			"to": [8.25, 3, 6.5],
			"rotation": {"angle": 0, "axis": "x", "origin": [8, 3, 6.5]},
			"faces": {
				"north": {"uv": [3, 7.75, 3.25, 8.75], "texture": "#0"},
				"east": {"uv": [0.25, 7.75, 0.5, 8.75], "texture": "#0"},
				"south": {"uv": [0.25, 7.75, 0.5, 8.75], "texture": "#0"},
				"west": {"uv": [0.25, 7.75, 0.5, 8.75], "texture": "#0"},
				"up": {"uv": [0.25, 7.75, 0.5, 8.75], "texture": "#0"},
				"down": {"uv": [0.25, 8.5, 0.5, 8.75], "texture": "#0"}
			}
		},
		{
			"from": [7, 3, 6.5],
			"to": [9, 5, 8.5],
			"rotation": {"angle": 0, "axis": "y", "origin": [8, 4, 8]},
			"faces": {
				"north": {"uv": [2.75, 6.75, 3.75, 7.75], "texture": "#0"},
				"east": {"uv": [0.5, 6.75, 1.5, 7.75], "texture": "#0"},
				"south": {"uv": [3.75, 6.75, 4.75, 7.75], "texture": "#0"},
				"west": {"uv": [0.5, 6.75, 1.5, 7.75], "texture": "#0"},
				"up": {"uv": [1.75, 6.75, 2.75, 7.75], "texture": "#0"},
				"down": {"uv": [1.75, 6.75, 2.75, 7.75], "texture": "#0"}
			}
		},
		{
			"from": [7.5, 4.5, 8.5],
			"to": [8.5, 5, 9],
			"rotation": {"angle": 0, "axis": "y", "origin": [8.25, 3.5, 7.5]},
			"faces": {
				"north": {"uv": [1.5, 6.75, 1.75, 7], "texture": "#0"},
				"east": {"uv": [1.5, 6.75, 1.75, 7], "texture": "#0"},
				"south": {"uv": [4, 6.75, 4.5, 7], "texture": "#0"},
				"west": {"uv": [1.5, 6.75, 1.75, 7], "texture": "#0"},
				"up": {"uv": [4, 6.5, 4.5, 6.75], "texture": "#0"},
				"down": {"uv": [1.5, 6.75, 1.75, 7], "texture": "#0"}
			}
		},
		{
			"from": [7.75, 2, 8],
			"to": [8.25, 2.5, 9],
			"rotation": {"angle": 0, "axis": "y", "origin": [8.25, 1, 7.5]},
			"faces": {
				"north": {"uv": [1.25, 8, 1.75, 8.25], "texture": "#0"},
				"east": {"uv": [1.25, 8, 1.75, 8.25], "texture": "#0"},
				"south": {"uv": [4.25, 8, 4.5, 8.25], "texture": "#0"},
				"west": {"uv": [1.25, 8, 1.75, 8.25], "texture": "#0"},
				"up": {"uv": [1.25, 8, 1.75, 8.25], "texture": "#0"},
				"down": {"uv": [1.25, 7.75, 1.5, 8.25], "texture": "#0"}
			}
		},
		{
			"from": [7.75, 2.5, 7.5],
			"to": [8.25, 3, 8.5],
			"rotation": {"angle": 0, "axis": "y", "origin": [8.25, 1.5, 7.5]},
			"faces": {
				"north": {"uv": [1.25, 7.75, 1.5, 8], "texture": "#0"},
				"east": {"uv": [1.25, 7.75, 1.5, 8], "texture": "#0"},
				"south": {"uv": [1.25, 7.75, 1.5, 8], "texture": "#0"},
				"west": {"uv": [1.25, 7.75, 1.5, 8], "texture": "#0"},
				"up": {"uv": [1.25, 7.75, 1.5, 8], "texture": "#0"},
				"down": {"uv": [1.25, 7.75, 1.5, 8], "texture": "#0"}
			}
		},
		{
			"from": [7.5, 5, 6.5],
			"to": [8.5, 5.5, 7.5],
			"rotation": {"angle": 0, "axis": "y", "origin": [8.25, 6, 6.5]},
			"faces": {
				"north": {"uv": [0.5, 6.5, 1, 6.75], "texture": "#0"},
				"east": {"uv": [0.5, 6.5, 1, 6.75], "texture": "#0"},
				"south": {"uv": [0.5, 6.5, 1, 6.75], "texture": "#0"},
				"west": {"uv": [0.5, 6.5, 1, 6.75], "texture": "#0"},
				"up": {"uv": [0.5, 6.5, 1, 6.75], "texture": "#0"},
				"down": {"uv": [0.5, 6.5, 1, 6.75], "texture": "#0"}
			}
		},
		{
			"from": [7.5, 5.5, 5.5],
			"to": [8.5, 6, 7.5],
			"rotation": {"angle": 0, "axis": "y", "origin": [8.25, 6.5, 6.5]},
			"faces": {
				"north": {"uv": [3, 6.25, 3.5, 6.5], "texture": "#0"},
				"east": {"uv": [0, 6.25, 1, 6.5], "texture": "#0"},
				"south": {"uv": [0, 6.25, 1, 6.5], "texture": "#0"},
				"west": {"uv": [0, 6.25, 1, 6.5], "texture": "#0"},
				"up": {"uv": [3, 5.75, 3.5, 6.75], "texture": "#0"},
				"down": {"uv": [4, 5.75, 4.5, 6.75], "texture": "#0"}
			}
		},
		{
			"from": [6.75, 3, 6],
			"to": [9.275, 3.5, 6.5],
			"rotation": {"angle": 0, "axis": "y", "origin": [8, 3, 6.5]},
			"faces": {
				"north": {"uv": [7, 0, 8.25, 0.25], "texture": "#0"},
				"east": {"uv": [8, 0, 8.25, 0.25], "texture": "#0"},
				"south": {"uv": [7, 0, 8.25, 0.25], "texture": "#0"},
				"west": {"uv": [7, 0, 7.25, 0.25], "texture": "#0"},
				"up": {"uv": [7, 0, 8.25, 0.25], "texture": "#0"},
				"down": {"uv": [7, 0, 8.25, 0.25], "texture": "#0"}
			}
		},
		{
			"from": [6.725, 5, 6],
			"to": [9.25, 5.5, 6.5],
			"rotation": {"angle": 0, "axis": "y", "origin": [8, 5, 6.5]},
			"faces": {
				"north": {"uv": [7.25, 0, 8.5, 0.25], "texture": "#0"},
				"east": {"uv": [8.25, 0, 8.5, 0.25], "texture": "#0"},
				"south": {"uv": [7.25, 0, 8.5, 0.25], "texture": "#0"},
				"west": {"uv": [7.25, 0, 7.5, 0.25], "texture": "#0"},
				"up": {"uv": [7.25, 0, 8.5, 0.25], "texture": "#0"},
				"down": {"uv": [7.25, 0, 8.5, 0.25], "texture": "#0"}
			}
		},
		{
			"from": [6.725, 2.5, 8.5],
			"to": [9.25, 3, 9],
			"rotation": {"angle": 0, "axis": "y", "origin": [8.25, 2.5, 9]},
			"faces": {
				"north": {"uv": [7.25, 0, 8.5, 0.25], "texture": "#0"},
				"east": {"uv": [7.25, 0, 7.5, 0.25], "texture": "#0"},
				"south": {"uv": [7.25, 0, 8.5, 0.25], "texture": "#0"},
				"west": {"uv": [8.25, 0, 8.5, 0.25], "texture": "#0"},
				"up": {"uv": [7.25, 0, 8.5, 0.25], "texture": "#0"},
				"down": {"uv": [7.25, 0, 8.5, 0.25], "texture": "#0"}
			}
		},
		{
			"from": [6.75, 4, 8.5],
			"to": [9.275, 4.5, 9],
			"rotation": {"angle": 0, "axis": "y", "origin": [8, 4, 9]},
			"faces": {
				"north": {"uv": [6.5, 0, 7.75, 0.25], "texture": "#0"},
				"east": {"uv": [7.5, 0, 7.75, 0.25], "texture": "#0"},
				"south": {"uv": [6.5, 0, 7.75, 0.25], "texture": "#0"},
				"west": {"uv": [6.5, 0, 6.75, 0.25], "texture": "#0"},
				"up": {"uv": [6.5, 0, 7.75, 0.25], "texture": "#0"},
				"down": {"uv": [6.5, 0, 7.75, 0.25], "texture": "#0"}
			}
		},
		{
			"from": [8.75, 2.30533, 7.32678],
			"to": [9.25, 5.83033, 7.82678],
			"rotation": {"angle": -45, "axis": "x", "origin": [9, 4.05533, 7.57678]},
			"faces": {
				"north": {"uv": [6.25, 0.5, 6.5, 2.25], "rotation": 180, "texture": "#0"},
				"east": {"uv": [6.75, 0, 8.5, 0.25], "rotation": 270, "texture": "#0"},
				"south": {"uv": [6.25, 0.5, 6.5, 2.25], "texture": "#0"},
				"west": {"uv": [6.75, 0, 8.5, 0.25], "rotation": 90, "texture": "#0"},
				"up": {"uv": [6.75, 0, 8.5, 0.25], "rotation": 180, "texture": "#0"},
				"down": {"uv": [6.75, 0, 8.5, 0.25], "texture": "#0"}
			}
		},
		{
			"from": [6.725, 2.30533, 7.32678],
			"to": [7.225, 5.83033, 7.82678],
			"rotation": {"angle": -45, "axis": "x", "origin": [6.975, 4.05533, 7.57678]},
			"faces": {
				"north": {"uv": [6.25, 0.5, 6.5, 2.25], "rotation": 180, "texture": "#0"},
				"east": {"uv": [6.75, 0, 8.5, 0.25], "rotation": 270, "texture": "#0"},
				"south": {"uv": [6.25, 0.5, 6.5, 2.25], "texture": "#0"},
				"west": {"uv": [6.75, 0, 8.5, 0.25], "rotation": 90, "texture": "#0"},
				"up": {"uv": [6.75, 0, 8.5, 0.25], "rotation": 180, "texture": "#0"},
				"down": {"uv": [6.75, 0, 8.5, 0.25], "texture": "#0"}
			}
		},
		{
			"from": [6.75, 3.50597, 6.19567],
			"to": [7.275, 4.00597, 8.74567],
			"rotation": {"angle": -22.5, "axis": "x", "origin": [7, 3.75597, 7.49567]},
			"faces": {
				"north": {"uv": [6.25, 0.25, 6.5, 0.5], "texture": "#0"},
				"east": {"uv": [7, 0, 8.25, 0.25], "texture": "#0"},
				"south": {"uv": [7, 0, 8.25, 0.25], "texture": "#0"},
				"west": {"uv": [7, 0, 8.25, 0.25], "texture": "#0"},
				"up": {"uv": [6.25, 0.75, 6.5, 2], "texture": "#0"},
				"down": {"uv": [6.25, 0.75, 6.5, 2], "texture": "#0"}
			}
		},
		{
			"from": [8.75, 3.50597, 6.19567],
			"to": [9.275, 4.00597, 8.74567],
			"rotation": {"angle": -22.5, "axis": "x", "origin": [9, 3.75597, 7.49567]},
			"faces": {
				"north": {"uv": [6.25, 0.25, 6.5, 0.5], "texture": "#0"},
				"east": {"uv": [7, 0, 8.25, 0.25], "texture": "#0"},
				"south": {"uv": [7, 0, 8.25, 0.25], "texture": "#0"},
				"west": {"uv": [7, 0, 8.25, 0.25], "texture": "#0"},
				"up": {"uv": [6.25, 0.75, 6.5, 2], "texture": "#0"},
				"down": {"uv": [6.25, 0.75, 6.5, 2], "texture": "#0"}
			}
		},
		{
			"from": [7.75, 16.5, 7],
			"to": [8.25, 17, 7.5],
			"rotation": {"angle": 22.5, "axis": "x", "origin": [8, 16.5, 7]},
			"faces": {
				"north": {"uv": [3, 2.75, 3.25, 3], "texture": "#0"},
				"east": {"uv": [0.75, 2.75, 1, 3], "texture": "#0"},
				"south": {"uv": [0.75, 2.75, 1, 3], "texture": "#0"},
				"west": {"uv": [0.75, 2.75, 1, 3], "texture": "#0"},
				"up": {"uv": [0.75, 2.75, 1, 3], "texture": "#0"},
				"down": {"uv": [0.75, 2.75, 1, 3], "texture": "#0"}
			}
		},
		{
			"from": [7.75, 16.5, 7.5],
			"to": [8.25, 17.5, 8],
			"rotation": {"angle": 22.5, "axis": "x", "origin": [8, 16.5, 7]},
			"faces": {
				"north": {"uv": [3, 2.5, 3.25, 3], "texture": "#0"},
				"east": {"uv": [1, 2.5, 1.25, 3], "texture": "#0"},
				"south": {"uv": [1, 2.5, 1.25, 3], "texture": "#0"},
				"west": {"uv": [1, 2.5, 1.25, 3], "texture": "#0"},
				"up": {"uv": [1, 2.5, 1.25, 2.75], "texture": "#0"},
				"down": {"uv": [1, 2.5, 1.25, 3], "texture": "#0"}
			}
		},
		{
			"from": [7.75, 16.5, 8],
			"to": [8.25, 18, 8.5],
			"rotation": {"angle": 22.5, "axis": "x", "origin": [8, 16.5, 7]},
			"faces": {
				"north": {"uv": [3, 2.25, 3.25, 3], "texture": "#0"},
				"east": {"uv": [1.25, 2.25, 1.5, 3], "texture": "#0"},
				"south": {"uv": [1.25, 2.25, 1.5, 3], "texture": "#0"},
				"west": {"uv": [1.25, 2.25, 1.5, 3], "texture": "#0"},
				"up": {"uv": [1.25, 2.25, 1.5, 2.5], "texture": "#0"},
				"down": {"uv": [1.25, 2.25, 1.5, 3], "texture": "#0"}
			}
		},
		{
			"from": [7.75, 16.5, 8.5],
			"to": [8.25, 18.5, 9],
			"rotation": {"angle": 22.5, "axis": "x", "origin": [8, 16.5, 7]},
			"faces": {
				"north": {"uv": [3, 2, 3.25, 3], "texture": "#0"},
				"east": {"uv": [1.5, 2, 1.75, 3], "texture": "#0"},
				"south": {"uv": [4.25, 2, 4.5, 3], "texture": "#0"},
				"west": {"uv": [1.5, 2, 1.75, 3], "texture": "#0"},
				"up": {"uv": [1.5, 2, 1.75, 2.25], "texture": "#0"},
				"down": {"uv": [1.5, 2.75, 1.75, 3], "texture": "#0"}
			}
		},
		{
			"from": [7.75, 17, 9],
			"to": [8.25, 19, 9.5],
			"rotation": {"angle": 22.5, "axis": "x", "origin": [8, 16.5, 7]},
			"faces": {
				"north": {"uv": [3, 1.75, 3.25, 2.75], "texture": "#0"},
				"east": {"uv": [1.75, 1.75, 2, 2.75], "texture": "#0"},
				"south": {"uv": [4.25, 1.75, 4.5, 2.75], "texture": "#0"},
				"west": {"uv": [1.75, 1.75, 2, 2.75], "texture": "#0"},
				"up": {"uv": [1.75, 1.75, 2, 2], "texture": "#0"},
				"down": {"uv": [1.75, 2.5, 2, 2.75], "texture": "#0"}
			}
		},
		{
			"from": [7.75, 17.5, 9.5],
			"to": [8.25, 20, 10],
			"rotation": {"angle": 22.5, "axis": "x", "origin": [8, 16.5, 7]},
			"faces": {
				"north": {"uv": [3, 1, 3.25, 2.5], "texture": "#0"},
				"east": {"uv": [2, 1, 2.25, 2.5], "texture": "#0"},
				"south": {"uv": [4.25, 1, 4.5, 2.5], "texture": "#0"},
				"west": {"uv": [2, 1, 2.25, 2.5], "texture": "#0"},
				"up": {"uv": [2, 1, 2.25, 2.5], "texture": "#0"},
				"down": {"uv": [2, 2.25, 2.25, 2.5], "texture": "#0"}
			}
		},
		{
			"from": [7.75, 18.5, 10],
			"to": [8.25, 22.5, 10.5],
			"rotation": {"angle": 22.5, "axis": "x", "origin": [8, 16.5, 7]},
			"faces": {
				"north": {"uv": [3, 0, 3.25, 2], "texture": "#0"},
				"east": {"uv": [2.25, 0, 2.5, 2], "texture": "#0"},
				"south": {"uv": [4.25, 0, 4.5, 2], "texture": "#0"},
				"west": {"uv": [2.25, 0, 2.5, 2], "texture": "#0"},
				"up": {"uv": [2.25, 0, 2.5, 0.25], "texture": "#0"},
				"down": {"uv": [2.25, 1.75, 2.5, 2], "texture": "#0"}
			}
		},
		{
			"from": [7.75, 20, 10.5],
			"to": [8.25, 21.5, 11],
			"rotation": {"angle": 22.5, "axis": "x", "origin": [8, 16.5, 7]},
			"faces": {
				"north": {"uv": [2.5, 0.5, 2.75, 1.25], "texture": "#0"},
				"east": {"uv": [2.5, 0.5, 2.75, 1.25], "texture": "#0"},
				"south": {"uv": [4.25, 0.5, 4.5, 1.25], "texture": "#0"},
				"west": {"uv": [2.5, 0.5, 2.75, 1.25], "texture": "#0"},
				"up": {"uv": [2.5, 0.5, 2.75, 0.75], "texture": "#0"},
				"down": {"uv": [2.5, 0.5, 2.75, 1.25], "texture": "#0"}
			}
		},
		{
			"from": [7.75, 22, 9.5],
			"to": [8.25, 22.5, 10],
			"rotation": {"angle": 22.5, "axis": "x", "origin": [8, 16.5, 7]},
			"faces": {
				"north": {"uv": [3, 0, 3.25, 0.25], "texture": "#0"},
				"east": {"uv": [2, 0, 2.25, 0.25], "texture": "#0"},
				"south": {"uv": [2, 0, 2.25, 0.25], "texture": "#0"},
				"west": {"uv": [2, 0, 2.25, 0.25], "texture": "#0"},
				"up": {"uv": [2, 0, 2.25, 0.25], "texture": "#0"},
				"down": {"uv": [2, 0, 2.25, 0.25], "texture": "#0"}
			}
		},
		{
			"from": [7.75, 21.5, 9],
			"to": [8.25, 22, 9.5],
			"rotation": {"angle": 22.5, "axis": "x", "origin": [8, 16.5, 7]},
			"faces": {
				"north": {"uv": [3, 0.25, 3.25, 0.5], "texture": "#0"},
				"east": {"uv": [1.75, 0.25, 2, 0.5], "texture": "#0"},
				"south": {"uv": [4.25, 0, 4.5, 0.25], "texture": "#0"},
				"west": {"uv": [1.75, 0.25, 2, 0.5], "texture": "#0"},
				"up": {"uv": [1.75, 0.25, 2, 0.5], "texture": "#0"},
				"down": {"uv": [1.75, 0.25, 2, 0.5], "texture": "#0"}
			}
		},
		{
			"from": [7.25, 19.5, 10.5],
			"to": [8.75, 20, 11.025],
			"rotation": {"angle": 22.5, "axis": "x", "origin": [8, 16.5, 7]},
			"faces": {
				"north": {"uv": [6.25, 0, 7, 0.25], "texture": "#0"},
				"east": {"uv": [6.75, 0, 7, 0.25], "texture": "#0"},
				"south": {"uv": [6.25, 0, 7, 0.25], "texture": "#0"},
				"west": {"uv": [6.25, 0, 6.5, 0.25], "texture": "#0"},
				"up": {"uv": [6.25, 0, 7, 0.25], "texture": "#0"},
				"down": {"uv": [6.25, 0, 7, 0.25], "texture": "#0"}
			}
		},
		{
			"from": [7.25, 20, 9.5],
			"to": [8.75, 20.5, 10],
			"rotation": {"angle": 22.5, "axis": "x", "origin": [8, 16.5, 7]},
			"faces": {
				"north": {"uv": [6.25, 0, 7, 0.25], "texture": "#0"},
				"east": {"uv": [6.25, 0, 6.5, 0.25], "texture": "#0"},
				"south": {"uv": [6.25, 0, 7, 0.25], "texture": "#0"},
				"west": {"uv": [6.75, 0, 7, 0.25], "texture": "#0"},
				"up": {"uv": [6.25, 0, 7, 0.25], "texture": "#0"},
				"down": {"uv": [6.25, 0, 7, 0.25], "texture": "#0"}
			}
		},
		{
			"from": [8.25, 20.7273, 7.96322],
			"to": [8.75, 21.2273, 9.36322],
			"rotation": {"angle": 45, "axis": "x", "origin": [8, 16.5, 7]},
			"faces": {
				"north": {"uv": [6.25, 0, 6.5, 0.75], "texture": "#0"},
				"east": {"uv": [6.25, 0, 7, 0.25], "texture": "#0"},
				"south": {"uv": [6.25, 0, 6.5, 0.75], "texture": "#0"},
				"west": {"uv": [6.25, 0, 6.5, 0.75], "texture": "#0"},
				"up": {"uv": [6.25, 0, 6.5, 0.75], "texture": "#0"},
				"down": {"uv": [6.25, 0, 6.5, 0.75], "texture": "#0"}
			}
		},
		{
			"from": [7.25, 20.7273, 7.96322],
			"to": [7.75, 21.2273, 9.36322],
			"rotation": {"angle": 45, "axis": "x", "origin": [8, 16.5, 7]},
			"faces": {
				"north": {"uv": [6.25, 0, 6.5, 0.75], "texture": "#0"},
				"east": {"uv": [6.25, 0, 6.5, 0.75], "texture": "#0"},
				"south": {"uv": [6.25, 0, 6.5, 0.75], "texture": "#0"},
				"west": {"uv": [6.25, 0, 7, 0.25], "texture": "#0"},
				"up": {"uv": [6.25, 0, 6.5, 0.75], "texture": "#0"},
				"down": {"uv": [6.25, 0, 6.5, 0.75], "texture": "#0"}
			}
		},
		{
			"from": [7.75, 15.5, 8],
			"to": [8.25, 16.5, 8.5],
			"rotation": {"angle": 0, "axis": "x", "origin": [8, 13, 6.5]},
			"faces": {
				"north": {"uv": [1.25, 3, 1.5, 3.5], "texture": "#0"},
				"east": {"uv": [1.25, 3, 1.5, 3.5], "texture": "#0"},
				"south": {"uv": [4.25, 3, 4.5, 3.5], "texture": "#0"},
				"west": {"uv": [1.25, 3, 1.5, 3.5], "texture": "#0"},
				"up": {"uv": [1.25, 3, 1.5, 3.5], "texture": "#0"},
				"down": {"uv": [1.25, 3.25, 1.5, 3.5], "texture": "#0"}
			}
		},
		{
			"from": [7.75, 13.5, 7.5],
			"to": [8.25, 16.5, 8],
			"rotation": {"angle": 0, "axis": "x", "origin": [8, 13, 6.5]},
			"faces": {
				"north": {"uv": [0.5, 4, 0.75, 4.5], "texture": "#0"},
				"east": {"uv": [1, 3, 1.25, 4.25], "texture": "#0"},
				"south": {"uv": [4.25, 3, 4.5, 4.75], "texture": "#0"},
				"west": {"uv": [1, 3, 1.25, 4.5], "texture": "#0"},
				"up": {"uv": [0.5, 4, 0.75, 4.5], "texture": "#0"},
				"down": {"uv": [0.5, 4, 0.75, 4.5], "texture": "#0"}
			}
		},
		{
			"from": [7.75, 13, 7],
			"to": [8.25, 16.5, 7.5],
			"rotation": {"angle": 0, "axis": "x", "origin": [8, 13, 6.5]},
			"faces": {
				"north": {"uv": [3, 3, 3.25, 4.75], "texture": "#0"},
				"east": {"uv": [0.75, 3, 1, 4.75], "texture": "#0"},
				"south": {"uv": [0.5, 4, 0.75, 4.5], "texture": "#0"},
				"west": {"uv": [0.75, 2.75, 1, 4.75], "texture": "#0"},
				"up": {"uv": [0.5, 4, 0.75, 4.5], "texture": "#0"},
				"down": {"uv": [0.5, 4, 0.75, 4.5], "texture": "#0"}
			}
		},
		{
			"from": [7.25, 13, 6.5],
			"to": [8.75, 14.5, 7.5],
			"rotation": {"angle": 0, "axis": "x", "origin": [8, 13, 6.5]},
			"faces": {
				"north": {"uv": [2.75, 4, 3.5, 4.75], "texture": "#0"},
				"east": {"uv": [0.5, 4, 1, 4.75], "texture": "#0"},
				"south": {"uv": [4, 4, 4.75, 4.75], "texture": "#0"},
				"west": {"uv": [0.5, 4, 1, 4.75], "texture": "#0"},
				"up": {"uv": [0.5, 4, 1, 4.75], "texture": "#0"},
				"down": {"uv": [0.5, 4, 1, 4.75], "texture": "#0"}
			}
		},
		{
			"from": [7.25, 13, 7.5],
			"to": [8.75, 13.5, 8],
			"rotation": {"angle": 0, "axis": "x", "origin": [8, 13, 6.5]},
			"faces": {
				"north": {"uv": [2.75, 4.5, 3.5, 4.75], "texture": "#0"},
				"east": {"uv": [1, 4.5, 1.25, 4.75], "texture": "#0"},
				"south": {"uv": [4, 4.5, 4.75, 4.75], "texture": "#0"},
				"west": {"uv": [1, 4.5, 1.25, 4.75], "texture": "#0"},
				"up": {"uv": [1, 4.5, 1.25, 4.75], "texture": "#0"},
				"down": {"uv": [1, 4.5, 1.25, 4.75], "texture": "#0"}
			}
		},
		{
			"from": [7.25, 14.5, 7],
			"to": [8.75, 15.5, 7.5],
			"rotation": {"angle": 0, "axis": "x", "origin": [8, 13, 6.5]},
			"faces": {
				"north": {"uv": [2.75, 3.5, 3.5, 4], "texture": "#0"},
				"east": {"uv": [0.5, 4, 0.75, 4.5], "texture": "#0"},
				"south": {"uv": [4, 3.5, 4.75, 4], "texture": "#0"},
				"west": {"uv": [0.75, 3.5, 1, 4], "texture": "#0"},
				"up": {"uv": [0.5, 4, 0.75, 4.5], "texture": "#0"},
				"down": {"uv": [0.5, 4, 0.75, 4.5], "texture": "#0"}
			}
		},
		{
			"from": [7.75, 13, 6.5],
			"to": [8.25, 16, 7],
			"rotation": {"angle": 0, "axis": "x", "origin": [8, 13, 6.5]},
			"faces": {
				"north": {"uv": [3, 3.25, 3.25, 4.75], "texture": "#0"},
				"east": {"uv": [0.5, 3.25, 0.75, 4.75], "texture": "#0"},
				"south": {"uv": [0.5, 4, 0.75, 4.5], "texture": "#0"},
				"west": {"uv": [0.5, 3.25, 0.75, 4.75], "texture": "#0"},
				"up": {"uv": [0.25, 3.75, 0.5, 4], "texture": "#0"},
				"down": {"uv": [0.5, 4, 0.75, 4.5], "texture": "#0"}
			}
		},
		{
			"from": [7.75, 13, 6],
			"to": [8.25, 15, 6.5],
			"rotation": {"angle": 0, "axis": "x", "origin": [8, 13, 6.5]},
			"faces": {
				"north": {"uv": [3, 3.75, 3.25, 4.75], "texture": "#0"},
				"east": {"uv": [0.25, 3.75, 0.5, 4.75], "texture": "#0"},
				"south": {"uv": [0.25, 3.75, 0.5, 4.75], "texture": "#0"},
				"west": {"uv": [0.25, 3.75, 0.5, 4.75], "texture": "#0"},
				"up": {"uv": [0.25, 3.75, 0.5, 4], "texture": "#0"},
				"down": {"uv": [0.25, 3.75, 0.5, 4.75], "texture": "#0"}
			}
		},
		{
			"from": [7, 11, 6.5],
			"to": [9, 13, 8.5],
			"rotation": {"angle": 0, "axis": "y", "origin": [8, 12, 8]},
			"faces": {
				"north": {"uv": [2.75, 4.75, 3.75, 5.75], "texture": "#0"},
				"east": {"uv": [0.5, 4.75, 1, 5.25], "texture": "#0"},
				"south": {"uv": [3.75, 4.75, 4.75, 5.75], "texture": "#0"},
				"west": {"uv": [0.5, 4.75, 1.5, 5.75], "texture": "#0"},
				"up": {"uv": [1.75, 4.75, 2.75, 5.75], "texture": "#0"},
				"down": {"uv": [1.75, 4.75, 2.75, 5.75], "texture": "#0"}
			}
		},
		{
			"from": [6.75, 12.5, 6],
			"to": [9.275, 13, 6.5],
			"rotation": {"angle": 0, "axis": "y", "origin": [8, 12.5, 6.5]},
			"faces": {
				"north": {"uv": [7, 0, 8.25, 0.25], "texture": "#0"},
				"east": {"uv": [8, 0, 8.25, 0.25], "texture": "#0"},
				"south": {"uv": [7, 0, 8.25, 0.25], "texture": "#0"},
				"west": {"uv": [7, 0, 7.25, 0.25], "texture": "#0"},
				"up": {"uv": [7, 0, 8.25, 0.25], "texture": "#0"},
				"down": {"uv": [7, 0, 8.25, 0.25], "texture": "#0"}
			}
		},
		{
			"from": [6.725, 10.5, 6],
			"to": [9.25, 11, 6.5],
			"rotation": {"angle": 0, "axis": "y", "origin": [8, 10.5, 6.5]},
			"faces": {
				"north": {"uv": [7.25, 0, 8.5, 0.25], "texture": "#0"},
				"east": {"uv": [8.25, 0, 8.5, 0.25], "texture": "#0"},
				"south": {"uv": [7.25, 0, 8.5, 0.25], "texture": "#0"},
				"west": {"uv": [7.25, 0, 7.5, 0.25], "texture": "#0"},
				"up": {"uv": [7.25, 0, 8.5, 0.25], "texture": "#0"},
				"down": {"uv": [7.25, 0, 8.5, 0.25], "texture": "#0"}
			}
		},
		{
			"from": [6.725, 13, 8.5],
			"to": [9.25, 13.5, 9],
			"rotation": {"angle": 0, "axis": "y", "origin": [8.25, 13, 9]},
			"faces": {
				"north": {"uv": [7.25, 0, 8.5, 0.25], "texture": "#0"},
				"east": {"uv": [7.25, 0, 7.5, 0.25], "texture": "#0"},
				"south": {"uv": [7.25, 0, 8.5, 0.25], "texture": "#0"},
				"west": {"uv": [8.25, 0, 8.5, 0.25], "texture": "#0"},
				"up": {"uv": [7.25, 0, 8.5, 0.25], "texture": "#0"},
				"down": {"uv": [7.25, 0, 8.5, 0.25], "texture": "#0"}
			}
		},
		{
			"from": [6.75, 11.5, 8.5],
			"to": [9.275, 12, 9],
			"rotation": {"angle": 0, "axis": "y", "origin": [8, 11.5, 9]},
			"faces": {
				"north": {"uv": [6.5, 0, 7.75, 0.25], "texture": "#0"},
				"east": {"uv": [7.5, 0, 7.75, 0.25], "texture": "#0"},
				"south": {"uv": [6.5, 0, 7.75, 0.25], "texture": "#0"},
				"west": {"uv": [6.5, 0, 6.75, 0.25], "texture": "#0"},
				"up": {"uv": [6.5, 0, 7.75, 0.25], "texture": "#0"},
				"down": {"uv": [6.5, 0, 7.75, 0.25], "texture": "#0"}
			}
		},
		{
			"from": [6.75, 11.98097, 6.19567],
			"to": [7.25, 12.48097, 8.74567],
			"rotation": {"angle": 22.5, "axis": "x", "origin": [7, 12.23097, 7.49567]},
			"faces": {
				"north": {"uv": [6.5, 0, 7.75, 0.25], "texture": "#0"},
				"east": {"uv": [6.5, 0, 7.75, 0.25], "texture": "#0"},
				"south": {"uv": [6.5, 0, 7.75, 0.25], "texture": "#0"},
				"west": {"uv": [6.5, 0, 7.75, 0.25], "texture": "#0"},
				"up": {"uv": [6.25, 0.25, 6.5, 1.5], "texture": "#0"},
				"down": {"uv": [6.25, 0.25, 6.5, 1.5], "texture": "#0"}
			}
		},
		{
			"from": [8.75, 11.70533, 5.80178],
			"to": [9.25, 12.20533, 9.32678],
			"rotation": {"angle": -45, "axis": "x", "origin": [9, 11.95533, 7.57678]},
			"faces": {
				"north": {"uv": [6.75, 0, 8.5, 0.25], "texture": "#0"},
				"east": {"uv": [6.75, 0, 8.5, 0.25], "texture": "#0"},
				"south": {"uv": [6.75, 0, 8.5, 0.25], "texture": "#0"},
				"west": {"uv": [6.75, 0, 8.5, 0.25], "texture": "#0"},
				"up": {"uv": [6.25, 0.5, 6.5, 2.25], "texture": "#0"},
				"down": {"uv": [6.25, 0.5, 6.5, 2.25], "texture": "#0"}
			}
		},
		{
			"from": [6.725, 11.70533, 5.80178],
			"to": [7.25, 12.20533, 9.32678],
			"rotation": {"angle": -45, "axis": "x", "origin": [7, 11.95533, 7.57678]},
			"faces": {
				"north": {"uv": [6.75, 0, 8.5, 0.25], "texture": "#0"},
				"east": {"uv": [6.75, 0, 8.5, 0.25], "texture": "#0"},
				"south": {"uv": [6.75, 0, 8.5, 0.25], "texture": "#0"},
				"west": {"uv": [6.75, 0, 8.5, 0.25], "texture": "#0"},
				"up": {"uv": [6.25, 0.5, 6.5, 2.25], "texture": "#0"},
				"down": {"uv": [6.25, 0.5, 6.5, 2.25], "texture": "#0"}
			}
		},
		{
			"from": [8.75, 11.98097, 6.19567],
			"to": [9.275, 12.48097, 8.74567],
			"rotation": {"angle": 22.5, "axis": "x", "origin": [9, 12.23097, 7.49567]},
			"faces": {
				"north": {"uv": [6.25, 0.25, 6.5, 0.5], "texture": "#0"},
				"east": {"uv": [7, 0, 8.25, 0.25], "texture": "#0"},
				"south": {"uv": [7, 0, 8.25, 0.25], "texture": "#0"},
				"west": {"uv": [7, 0, 8.25, 0.25], "texture": "#0"},
				"up": {"uv": [6.25, 0.75, 6.5, 2], "texture": "#0"},
				"down": {"uv": [6.25, 0.75, 6.5, 2], "texture": "#0"}
			}
		},
		{
			"from": [7.5, 11, 8.5],
			"to": [8.5, 11.5, 9],
			"rotation": {"angle": 0, "axis": "y", "origin": [8.25, 10, 7.5]},
			"faces": {
				"north": {"uv": [1.5, 5.5, 1.75, 5.75], "texture": "#0"},
				"east": {"uv": [1.5, 5.5, 1.75, 5.75], "texture": "#0"},
				"south": {"uv": [4, 5.5, 4.5, 5.75], "texture": "#0"},
				"west": {"uv": [1.5, 5.5, 1.75, 5.75], "texture": "#0"},
				"up": {"uv": [1.5, 5.5, 1.75, 5.75], "texture": "#0"},
				"down": {"uv": [4, 5.75, 4.5, 6], "texture": "#0"}
			}
		},
		{
			"from": [7.75, 13.5, 8],
			"to": [8.25, 14, 9],
			"rotation": {"angle": 0, "axis": "y", "origin": [8.25, 12.5, 7.5]},
			"faces": {
				"north": {"uv": [1.25, 4.25, 1.75, 4.5], "texture": "#0"},
				"east": {"uv": [1.25, 4.25, 1.75, 4.5], "texture": "#0"},
				"south": {"uv": [4.25, 4.25, 4.5, 4.5], "texture": "#0"},
				"west": {"uv": [1.25, 4.25, 1.75, 4.5], "texture": "#0"},
				"up": {"uv": [1.25, 4.25, 1.75, 4.5], "texture": "#0"},
				"down": {"uv": [1.25, 4.25, 1.75, 4.5], "texture": "#0"}
			}
		},
		{
			"from": [7.75, 13, 7.5],
			"to": [8.25, 13.5, 8.5],
			"rotation": {"angle": 0, "axis": "y", "origin": [8.25, 12, 7.5]},
			"faces": {
				"north": {"uv": [1.25, 4.5, 1.5, 4.75], "texture": "#0"},
				"east": {"uv": [1.25, 4.5, 1.5, 4.75], "texture": "#0"},
				"south": {"uv": [1.25, 4.5, 1.5, 4.75], "texture": "#0"},
				"west": {"uv": [1.25, 4.5, 1.5, 4.75], "texture": "#0"},
				"up": {"uv": [1.25, 4.5, 1.5, 4.75], "texture": "#0"},
				"down": {"uv": [1.25, 4.5, 1.5, 4.75], "texture": "#0"}
			}
		},
		{
			"from": [7.5, 10.5, 6.5],
			"to": [8.5, 11, 7.5],
			"rotation": {"angle": 0, "axis": "y", "origin": [8.25, 11.5, 6.5]},
			"faces": {
				"north": {"uv": [0.5, 5.75, 1, 6], "texture": "#0"},
				"east": {"uv": [0.5, 5.75, 1, 6], "texture": "#0"},
				"south": {"uv": [0.5, 5.75, 1, 6], "texture": "#0"},
				"west": {"uv": [0.5, 5.75, 1, 6], "texture": "#0"},
				"up": {"uv": [0.5, 5.75, 1, 6], "texture": "#0"},
				"down": {"uv": [0.5, 5.75, 1, 6], "texture": "#0"}
			}
		},
		{
			"from": [7.5, 10, 5.5],
			"to": [8.5, 10.5, 7.5],
			"rotation": {"angle": 0, "axis": "y", "origin": [8.25, 11, 6.5]},
			"faces": {
				"north": {"uv": [3, 6, 3.5, 6.25], "texture": "#0"},
				"east": {"uv": [0, 6, 1, 6.25], "texture": "#0"},
				"south": {"uv": [0, 6, 1, 6.25], "texture": "#0"},
				"west": {"uv": [0, 6, 1, 6.25], "texture": "#0"},
				"up": {"uv": [3, 5.75, 3.5, 6.75], "texture": "#0"},
				"down": {"uv": [4, 5.75, 4.5, 6.75], "texture": "#0"}
			}
		}
	],
	"display": {
		"thirdperson_righthand": {
			"rotation": [1.25, 0.5, 8.5],
			"translation": [-0.5, -2, 0]
		},
		"thirdperson_lefthand": {
			"rotation": [1.25, 0.5, 8.5],
			"translation": [-0.5, -2, 0]
		},
		"firstperson_righthand": {
			"rotation": [20, 7, 4],
			"translation": [-0.75, 3.5, 0]
		},
		"firstperson_lefthand": {
			"rotation": [20, 7, 4],
			"translation": [-0.75, 3.5, 1.25]
		},
		"ground": {
			"rotation": [9, -7, -65],
			"translation": [0, 3.5, 0]
		},
		"gui": {
			"rotation": [30, 145, -60],
			"translation": [-0.5, -0.5, 0],
			"scale": [0.7, 0.7, 0.7]
		},
		"fixed": {
			"rotation": [0, -90, 0],
			"translation": [2, 1, -2.5],
			"scale": [1.875, 1.875, 1.875]
		}
	},
	"groups": [
		{
			"name": "group",
			"origin": [8, 8, 8],
			"children": [0,
				{
					"name": "group",
					"origin": [8, 0, 10.75],
					"children": [1, 2]
				},
				{
					"name": "group",
					"origin": [8, 0, 4.5],
					"children": [3, 4]
				},
				{
					"name": "group",
					"origin": [8.25, 11, 11],
					"children": [5, 6, 7, 8, 9, 10, 11, 12, 13, 14, 15, 16, 17, 18]
				},
				{
					"name": "group",
					"origin": [8.25, 3.5, 7.5],
					"children": [19, 20, 21, 22, 23, 24, 25, 26]
				},
				{
					"name": "group",
					"origin": [8.25, 3, 6.5],
					"children": [27, 28, 29, 30, 31, 32, 33, 34, 35, 36, 37, 38, 39, 40]
				},
				{
					"name": "group",
					"origin": [8.25, 11, 11],
					"children": [41, 42, 43, 44, 45, 46, 47, 48, 49, 50, 51, 52, 53, 54]
				},
				{
					"name": "group",
					"origin": [8.25, 3.5, 7.5],
					"children": [55, 56, 57, 58, 59, 60, 61, 62]
				},
				{
					"name": "group",
					"origin": [8.25, 3, 6.5],
					"children": [63, 64, 65, 66, 67, 68, 69, 70, 71, 72, 73, 74, 75, 76]
				}
			]
		}
	]
}