{
	"credit": "Made with Blockbench",
	"texture_size": [64, 64],
	"textures": {
		"0": "custom/arc/ArcRoyal/royal_bow",
		"particle": "custom/arc/ArcRoyal/royal_bow"
	},
	"elements": [
		{
			"from": [7.5, -6.25, 10.975],
			"to": [8.5, -5.25, 11.525],
			"rotation": {"angle": 0, "axis": "y", "origin": [8, -19, 11.5]},
			"faces": {
				"north": {"uv": [8.5, 0.25, 9, 0.5], "texture": "#0"},
				"east": {"uv": [8.75, 0, 9, 0.5], "texture": "#0"},
				"south": {"uv": [8.5, 0, 9, 0.5], "texture": "#0"},
				"west": {"uv": [8.5, 0, 8.75, 0.5], "texture": "#0"},
				"up": {"uv": [9, 0.75, 9.5, 1], "texture": "#0"},
				"down": {"uv": [9, 0.75, 9.5, 1], "texture": "#0"}
			}
		},
		{
			"from": [7.5, 21.25, 10.975],
			"to": [8.5, 22.25, 11.525],
			"rotation": {"angle": 0, "axis": "y", "origin": [8, 8.5, 11.5]},
			"faces": {
				"north": {"uv": [8.5, 0.25, 9, 0.5], "texture": "#0"},
				"east": {"uv": [8.75, 0, 9, 0.5], "texture": "#0"},
				"south": {"uv": [8.5, 0, 9, 0.5], "texture": "#0"},
				"west": {"uv": [8.5, 0, 8.75, 0.5], "texture": "#0"},
				"up": {"uv": [9, 0.75, 9.5, 1], "texture": "#0"},
				"down": {"uv": [9, 0.75, 9.5, 1], "texture": "#0"}
			}
		},
		{
			"from": [7.75, -5.75, 11],
			"to": [8.25, 8, 11.5],
			"rotation": {"angle": 0, "axis": "x", "origin": [8, 8, 11.5]},
			"faces": {
				"north": {"uv": [8.75, 6.875, 9, 13.75], "texture": "#0"},
				"east": {"uv": [8.5, 6.875, 8.75, 13.75], "texture": "#0"},
				"south": {"uv": [9.25, 6.875, 9.5, 13.75], "texture": "#0"},
				"west": {"uv": [9, 6.875, 9.25, 13.75], "texture": "#0"},
				"up": {"uv": [7.25, 6.25, 7.5, 13], "texture": "#0"},
				"down": {"uv": [7.25, 6.25, 7.5, 13], "texture": "#0"}
			}
		},
		{
			"from": [7.75, 8, 11],
			"to": [8.25, 21.75, 11.5],
			"rotation": {"angle": 0, "axis": "x", "origin": [8, 8, 11.5]},
			"faces": {
				"north": {"uv": [8.75, 0, 9, 6.875], "texture": "#0"},
				"east": {"uv": [8.5, 0, 8.75, 6.875], "texture": "#0"},
				"south": {"uv": [9.25, 0, 9.5, 6.875], "texture": "#0"},
				"west": {"uv": [9, 0, 9.25, 6.875], "texture": "#0"},
				"up": {"uv": [7, 0, 7.25, 6.875], "texture": "#0"},
				"down": {"uv": [7, 0, 7.25, 6.75], "texture": "#0"}
			}
		},
		{
			"from": [7.75, -0.25, 3.5],
			"to": [8.25, 3.25, 6],
			"rotation": {"angle": 0, "axis": "y", "origin": [15.5, 3.25, 14.5]},
			"faces": {
				"north": {"uv": [7.25, 8.5, 7.5, 10.25], "texture": "#0"},
				"east": {"uv": [1.25, 8.5, 2.5, 10.25], "texture": "#0"},
				"south": {"uv": [8, 8.5, 8.25, 10.25], "texture": "#0"},
				"west": {"uv": [1.25, 8.5, 2.5, 10.25], "texture": "#0"},
				"up": {"uv": [1.25, 8.5, 1.5, 8.75], "texture": "#0"},
				"down": {"uv": [1.25, 8.5, 2.5, 10.25], "texture": "#0"}
			}
		},
		{
			"from": [7.75, -0.25, 6],
			"to": [8.25, 0.25, 6.5],
			"rotation": {"angle": 0, "axis": "y", "origin": [15.5, 3.75, 16.5]},
			"faces": {
				"north": {"uv": [2.5, 10, 2.75, 10.25], "texture": "#0"},
				"east": {"uv": [2.5, 10, 2.75, 10.25], "texture": "#0"},
				"south": {"uv": [2.5, 10, 2.75, 10.25], "texture": "#0"},
				"west": {"uv": [2.5, 10, 2.75, 10.25], "texture": "#0"},
				"up": {"uv": [2.5, 10, 2.75, 10.25], "texture": "#0"},
				"down": {"uv": [2.5, 10, 2.75, 10.25], "texture": "#0"}
			}
		},
		{
			"from": [7.75, -0.25, 3],
			"to": [8.25, 0.25, 3.5],
			"rotation": {"angle": 0, "axis": "y", "origin": [15.5, 3.75, 13.5]},
			"faces": {
				"north": {"uv": [1, 10, 1.25, 10.25], "texture": "#0"},
				"east": {"uv": [1, 10, 1.25, 10.25], "texture": "#0"},
				"south": {"uv": [1, 10, 1.25, 10.25], "texture": "#0"},
				"west": {"uv": [1, 10, 1.25, 10.25], "texture": "#0"},
				"up": {"uv": [1, 10, 1.25, 10.25], "texture": "#0"},
				"down": {"uv": [1, 10, 1.25, 10.25], "texture": "#0"}
			}
		},
		{
			"from": [7.25, 1.25, 4],
			"to": [8.75, 3.25, 4.5],
			"rotation": {"angle": 0, "axis": "y", "origin": [15.5, 5.25, 13.5]},
			"faces": {
				"north": {"uv": [1.5, 8.5, 1.75, 9.5], "texture": "#0"},
				"east": {"uv": [1.5, 8.5, 1.75, 9.5], "texture": "#0"},
				"south": {"uv": [1.5, 8.5, 1.75, 9.5], "texture": "#0"},
				"west": {"uv": [1.5, 8.5, 1.75, 9.5], "texture": "#0"},
				"up": {"uv": [1.5, 8.5, 1.75, 9.5], "texture": "#0"},
				"down": {"uv": [1.5, 9.25, 1.75, 9.5], "texture": "#0"}
			}
		},
		{
			"from": [7.25, 1.25, 5],
			"to": [8.75, 3.25, 5.5],
			"rotation": {"angle": 0, "axis": "y", "origin": [15.5, 5.25, 14.5]},
			"faces": {
				"north": {"uv": [2, 8.5, 2.25, 9.5], "texture": "#0"},
				"east": {"uv": [2, 8.5, 2.25, 9.5], "texture": "#0"},
				"south": {"uv": [2, 8.5, 2.25, 9.5], "texture": "#0"},
				"west": {"uv": [2, 8.5, 2.25, 9.5], "texture": "#0"},
				"up": {"uv": [2, 8.5, 2.25, 9.5], "texture": "#0"},
				"down": {"uv": [2, 9.25, 2.25, 9.5], "texture": "#0"}
			}
		},
		{
			"from": [7.25, 0.75, 4.5],
			"to": [8.75, 1.75, 5],
			"rotation": {"angle": 0, "axis": "y", "origin": [15.5, 4.75, 14]},
			"faces": {
				"north": {"uv": [1.75, 9.25, 2, 9.75], "texture": "#0"},
				"east": {"uv": [1.75, 9.25, 2, 9.75], "texture": "#0"},
				"south": {"uv": [1.75, 9.25, 2, 9.75], "texture": "#0"},
				"west": {"uv": [1.75, 9.25, 2, 9.75], "texture": "#0"},
				"up": {"uv": [1.75, 9.25, 2, 9.75], "texture": "#0"},
				"down": {"uv": [1.75, 9.5, 2, 9.75], "texture": "#0"}
			}
		},
		{
			"from": [7.5, 1.75, 4.5],
			"to": [8.5, 3.25, 5],
			"rotation": {"angle": 0, "axis": "y", "origin": [15.5, 6.25, 14]},
			"faces": {
				"north": {"uv": [1.75, 8.5, 2, 9.25], "texture": "#0"},
				"east": {"uv": [1.75, 8.5, 2, 9.25], "texture": "#0"},
				"south": {"uv": [1.75, 8.5, 2, 9.25], "texture": "#0"},
				"west": {"uv": [1.75, 8.5, 2, 9.25], "texture": "#0"},
				"up": {"uv": [1.75, 8.5, 2, 9.25], "texture": "#0"},
				"down": {"uv": [1.75, 8.5, 2, 9.25], "texture": "#0"}
			}
		},
		{
			"from": [7.25, 3.25, 4],
			"to": [8.75, 3.75, 5.5],
			"rotation": {"angle": 0, "axis": "y", "origin": [15.5, 7.75, 13.5]},
			"faces": {
				"north": {"uv": [1.5, 8.25, 2.25, 8.5], "texture": "#0"},
				"east": {"uv": [1.5, 8.25, 2.25, 8.5], "texture": "#0"},
				"south": {"uv": [1.5, 8.25, 2.25, 8.5], "texture": "#0"},
				"west": {"uv": [1.5, 8.25, 2.25, 8.5], "texture": "#0"},
				"up": {"uv": [1.5, 7.5, 2.25, 8.25], "texture": "#0"},
				"down": {"uv": [1.5, 8.25, 2.25, 8.5], "texture": "#0"}
			}
		},
		{
			"from": [7.75, 2.25, 2.5],
			"to": [8.25, 3.75, 3],
			"rotation": {"angle": 0, "axis": "y", "origin": [15.5, 5.75, 13.5]},
			"faces": {
				"north": {"uv": [7.25, 8.25, 7.5, 9], "texture": "#0"},
				"east": {"uv": [0.75, 8.25, 1, 9], "texture": "#0"},
				"south": {"uv": [0.75, 8.25, 1, 9], "texture": "#0"},
				"west": {"uv": [0.75, 8.25, 1, 9], "texture": "#0"},
				"up": {"uv": [0.75, 8.25, 1, 8.5], "texture": "#0"},
				"down": {"uv": [0.75, 8.75, 1, 9], "texture": "#0"}
			}
		},
		{
			"from": [7.75, 1.75, 3],
			"to": [8.25, 3.25, 3.5],
			"rotation": {"angle": 0, "axis": "y", "origin": [15.5, 5.25, 14]},
			"faces": {
				"north": {"uv": [7.25, 8.5, 7.5, 9.25], "texture": "#0"},
				"east": {"uv": [1, 8.5, 1.25, 9.25], "texture": "#0"},
				"south": {"uv": [1, 8.5, 1.25, 9.25], "texture": "#0"},
				"west": {"uv": [1, 8.5, 1.25, 9.25], "texture": "#0"},
				"up": {"uv": [1, 8.5, 1.25, 8.75], "texture": "#0"},
				"down": {"uv": [1, 9, 1.25, 9.25], "texture": "#0"}
			}
		},
		{
			"from": [7.75, 2.75, 2],
			"to": [8.25, 4.25, 2.5],
			"rotation": {"angle": 0, "axis": "y", "origin": [15.5, 6.25, 13]},
			"faces": {
				"north": {"uv": [7.25, 8, 7.5, 8.75], "texture": "#0"},
				"east": {"uv": [0.5, 8, 0.75, 8.75], "texture": "#0"},
				"south": {"uv": [0.5, 8, 0.75, 8.75], "texture": "#0"},
				"west": {"uv": [0.5, 8, 0.75, 8.75], "texture": "#0"},
				"up": {"uv": [0.5, 8, 0.75, 8.25], "texture": "#0"},
				"down": {"uv": [0.5, 8.5, 0.75, 8.75], "texture": "#0"}
			}
		},
		{
			"from": [7.75, 1.75, 6],
			"to": [8.25, 3.25, 6.5],
			"rotation": {"angle": 0, "axis": "y", "origin": [15.5, 5.25, 17]},
			"faces": {
				"north": {"uv": [2.5, 8.5, 2.75, 9.25], "texture": "#0"},
				"east": {"uv": [2.5, 8.5, 2.75, 9.25], "texture": "#0"},
				"south": {"uv": [8, 8.5, 8.25, 9.25], "texture": "#0"},
				"west": {"uv": [2.5, 8.5, 2.75, 9.25], "texture": "#0"},
				"up": {"uv": [2.5, 8.5, 2.75, 8.75], "texture": "#0"},
				"down": {"uv": [2.5, 9, 2.75, 9.25], "texture": "#0"}
			}
		},
		{
			"from": [7.75, 2.25, 6.5],
			"to": [8.25, 3.75, 7],
			"rotation": {"angle": 0, "axis": "y", "origin": [15.5, 5.75, 17.5]},
			"faces": {
				"north": {"uv": [2.75, 8.25, 3, 9], "texture": "#0"},
				"east": {"uv": [2.75, 8.25, 3, 9], "texture": "#0"},
				"south": {"uv": [8, 8.25, 8.25, 9], "texture": "#0"},
				"west": {"uv": [2.75, 8.25, 3, 9], "texture": "#0"},
				"up": {"uv": [2.75, 8.25, 3, 8.5], "texture": "#0"},
				"down": {"uv": [2.75, 8.75, 3, 9], "texture": "#0"}
			}
		},
		{
			"from": [7.75, 2.75, 7],
			"to": [8.25, 4.25, 7.5],
			"rotation": {"angle": 0, "axis": "y", "origin": [15.5, 6.25, 18]},
			"faces": {
				"north": {"uv": [3, 8, 3.25, 8.75], "texture": "#0"},
				"east": {"uv": [3, 8, 3.25, 8.75], "texture": "#0"},
				"south": {"uv": [8, 8, 8.25, 8.75], "texture": "#0"},
				"west": {"uv": [3, 8, 3.25, 8.75], "texture": "#0"},
				"up": {"uv": [3, 8, 3.25, 8.25], "texture": "#0"},
				"down": {"uv": [3, 8.5, 3.25, 8.75], "texture": "#0"}
			}
		},
		{
			"from": [7.75, 3.25, 7.5],
			"to": [8.25, 4.75, 8],
			"rotation": {"angle": 0, "axis": "y", "origin": [15.5, 6.75, 18.5]},
			"faces": {
				"north": {"uv": [7.25, 7.75, 7.5, 8.5], "texture": "#0"},
				"east": {"uv": [3.25, 7.75, 3.5, 8.5], "texture": "#0"},
				"south": {"uv": [8, 7.75, 8.25, 8.5], "texture": "#0"},
				"west": {"uv": [3.25, 7.75, 3.5, 8.5], "texture": "#0"},
				"up": {"uv": [3.25, 7.75, 3.5, 8.5], "texture": "#0"},
				"down": {"uv": [3.25, 8.25, 3.5, 8.5], "texture": "#0"}
			}
		},
		{
			"from": [7.75, 3.75, 8],
			"to": [8.25, 4.75, 8.5],
			"rotation": {"angle": 0, "axis": "y", "origin": [15.5, 6.75, 19]},
			"faces": {
				"north": {"uv": [3.5, 7.75, 3.75, 8.25], "texture": "#0"},
				"east": {"uv": [3.5, 7.75, 3.75, 8.25], "texture": "#0"},
				"south": {"uv": [8, 7.75, 8.25, 8.25], "texture": "#0"},
				"west": {"uv": [3.5, 7.75, 3.75, 8.25], "texture": "#0"},
				"up": {"uv": [3.5, 7.75, 3.75, 8.25], "texture": "#0"},
				"down": {"uv": [3.5, 8, 3.75, 8.25], "texture": "#0"}
			}
		},
		{
			"from": [7.5, 4.5, 6.25],
			"to": [8.5, 5, 9.25],
			"rotation": {"angle": 0, "axis": "y", "origin": [15.5, 9, 15.5]},
			"faces": {
				"north": {"uv": [2.75, 7.5, 3, 7.75], "texture": "#0"},
				"east": {"uv": [2.75, 7.5, 4.25, 7.75], "texture": "#0"},
				"south": {"uv": [4, 7.5, 4.25, 7.75], "texture": "#0"},
				"west": {"uv": [2.75, 7.5, 4.25, 7.75], "texture": "#0"},
				"up": {"uv": [4.5, 6.25, 5, 7.75], "texture": "#0"},
				"down": {"uv": [4.5, 6.5, 5, 8], "texture": "#0"}
			}
		},
		{
			"from": [7.75, 4.25, 8.5],
			"to": [8.25, 4.75, 9],
			"rotation": {"angle": 0, "axis": "y", "origin": [15.5, 6.75, 19.5]},
			"faces": {
				"north": {"uv": [3.75, 7.75, 4, 8], "texture": "#0"},
				"east": {"uv": [3.75, 7.75, 4, 8], "texture": "#0"},
				"south": {"uv": [8, 7.75, 8.25, 8], "texture": "#0"},
				"west": {"uv": [3.75, 7.75, 4, 8], "texture": "#0"},
				"up": {"uv": [3.75, 7.75, 4, 8], "texture": "#0"},
				"down": {"uv": [3.75, 7.75, 4, 8], "texture": "#0"}
			}
		},
		{
			"from": [7.5, 5, 6.75],
			"to": [8.5, 5.5, 9.75],
			"rotation": {"angle": 0, "axis": "y", "origin": [15.5, 9.5, 15.5]},
			"faces": {
				"north": {"uv": [3, 7.25, 3.25, 7.5], "texture": "#0"},
				"east": {"uv": [3, 7.25, 4.5, 7.5], "texture": "#0"},
				"south": {"uv": [4.25, 7.25, 4.5, 7.5], "texture": "#0"},
				"west": {"uv": [3, 7.25, 4.5, 7.5], "texture": "#0"},
				"up": {"uv": [4.5, 6.25, 5, 7.75], "texture": "#0"},
				"down": {"uv": [4.5, 6.5, 5, 8], "texture": "#0"}
			}
		},
		{
			"from": [7.25, 5, 7.25],
			"to": [8.75, 5.525, 8.75],
			"rotation": {"angle": 0, "axis": "y", "origin": [15.5, 9.5, 15.5]},
			"faces": {
				"north": {"uv": [3.25, 7, 3.5, 7.25], "texture": "#0"},
				"east": {"uv": [4, 7, 3.25, 7.25], "texture": "#0"},
				"south": {"uv": [3.75, 7, 4, 7.25], "texture": "#0"},
				"west": {"uv": [3.25, 7, 4, 7.25], "texture": "#0"},
				"up": {"uv": [5, 6.5, 5.75, 7.25], "texture": "#0"},
				"down": {"uv": [5, 7.25, 5.75, 6.5], "texture": "#0"}
			}
		},
		{
			"from": [7.5, 5.5, 7.5],
			"to": [8.5, 10.5, 8.5],
			"rotation": {"angle": 0, "axis": "y", "origin": [15.5, 14, 15.5]},
			"faces": {
				"north": {"uv": [4.5, 5.75, 5, 8.25], "texture": "#0"},
				"east": {"uv": [4.5, 5.75, 5, 8.25], "texture": "#0"},
				"south": {"uv": [4.5, 5.75, 5, 8.25], "texture": "#0"},
				"west": {"uv": [4.5, 5.75, 5, 8.25], "texture": "#0"},
				"up": {"uv": [4.5, 5.75, 5, 8.25], "texture": "#0"},
				"down": {"uv": [4.5, 5.75, 5, 8.25], "texture": "#0"}
			}
		},
		{
			"from": [7.25, 10.45, 7.25],
			"to": [8.75, 11, 8.75],
			"rotation": {"angle": 0, "axis": "y", "origin": [15.5, 15, 15.5]},
			"faces": {
				"north": {"uv": [3.25, 6.75, 3.5, 7], "texture": "#0"},
				"east": {"uv": [4, 6.75, 3.25, 7], "texture": "#0"},
				"south": {"uv": [3.75, 6.75, 4, 7], "texture": "#0"},
				"west": {"uv": [3.25, 6.75, 4, 7], "texture": "#0"},
				"up": {"uv": [5, 6.5, 5.75, 7.25], "texture": "#0"},
				"down": {"uv": [5, 7.25, 5.75, 6.5], "texture": "#0"}
			}
		},
		{
			"from": [7.5, 10.5, 6.75],
			"to": [8.5, 11, 9.75],
			"rotation": {"angle": 0, "axis": "y", "origin": [15.5, 15, 15.5]},
			"faces": {
				"north": {"uv": [3, 6.5, 3.25, 6.75], "texture": "#0"},
				"east": {"uv": [3, 6.5, 4.5, 6.75], "texture": "#0"},
				"south": {"uv": [4.25, 6.5, 4.5, 6.75], "texture": "#0"},
				"west": {"uv": [3, 6.5, 4.5, 6.75], "texture": "#0"},
				"up": {"uv": [4.25, 6, 4.75, 7.5], "texture": "#0"},
				"down": {"uv": [4.5, 6, 5, 7.5], "texture": "#0"}
			}
		},
		{
			"from": [7.5, 11, 6.25],
			"to": [8.5, 11.5, 9.25],
			"rotation": {"angle": 0, "axis": "y", "origin": [15.5, 15.5, 15.5]},
			"faces": {
				"north": {"uv": [2.75, 6.25, 3, 6.5], "texture": "#0"},
				"east": {"uv": [2.75, 6.25, 4.25, 6.5], "texture": "#0"},
				"south": {"uv": [4, 6.25, 4.25, 6.5], "texture": "#0"},
				"west": {"uv": [2.75, 6.25, 4.25, 6.5], "texture": "#0"},
				"up": {"uv": [4.5, 5.75, 5, 7.25], "texture": "#0"},
				"down": {"uv": [4.5, 6.25, 5, 7.75], "texture": "#0"}
			}
		},
		{
			"from": [7.75, 11.25, 8.5],
			"to": [8.25, 11.75, 9],
			"rotation": {"angle": 0, "axis": "y", "origin": [15.5, 13.75, 19.5]},
			"faces": {
				"north": {"uv": [3.75, 6, 4, 6.25], "texture": "#0"},
				"east": {"uv": [3.75, 6, 4, 6.25], "texture": "#0"},
				"south": {"uv": [8, 6, 8.25, 6.25], "texture": "#0"},
				"west": {"uv": [3.75, 6, 4, 6.25], "texture": "#0"},
				"up": {"uv": [3.75, 6, 4, 6.25], "texture": "#0"},
				"down": {"uv": [3.75, 6, 4, 6.25], "texture": "#0"}
			}
		},
		{
			"from": [7.75, 11.25, 7.5],
			"to": [8.25, 12.75, 8],
			"rotation": {"angle": 0, "axis": "y", "origin": [15.5, 14.75, 18.5]},
			"faces": {
				"north": {"uv": [7.25, 5.5, 7.5, 6.25], "texture": "#0"},
				"east": {"uv": [3.25, 5.5, 3.5, 6.25], "texture": "#0"},
				"south": {"uv": [8, 5.5, 8.25, 6.25], "texture": "#0"},
				"west": {"uv": [3.25, 5.5, 3.5, 6.25], "texture": "#0"},
				"up": {"uv": [3.25, 5.5, 3.5, 6], "texture": "#0"},
				"down": {"uv": [3.25, 5.5, 3.5, 6.25], "texture": "#0"}
			}
		},
		{
			"from": [7.75, 11.25, 8],
			"to": [8.25, 12.25, 8.5],
			"rotation": {"angle": 0, "axis": "y", "origin": [15.5, 14.25, 19]},
			"faces": {
				"north": {"uv": [3.5, 5.75, 3.75, 6.25], "texture": "#0"},
				"east": {"uv": [3.5, 5.75, 3.75, 6.25], "texture": "#0"},
				"south": {"uv": [8, 5.75, 8.25, 6.25], "texture": "#0"},
				"west": {"uv": [3.5, 5.75, 3.75, 6.25], "texture": "#0"},
				"up": {"uv": [3.5, 5.75, 3.75, 6], "texture": "#0"},
				"down": {"uv": [3.5, 5.75, 3.75, 6.25], "texture": "#0"}
			}
		},
		{
			"from": [7.75, 12.25, 6.5],
			"to": [8.25, 13.75, 7],
			"rotation": {"angle": 0, "axis": "y", "origin": [15.5, 15.75, 17.5]},
			"faces": {
				"north": {"uv": [7.25, 5, 7.5, 5.75], "texture": "#0"},
				"east": {"uv": [2.75, 5, 3, 5.75], "texture": "#0"},
				"south": {"uv": [8, 5, 8.25, 5.75], "texture": "#0"},
				"west": {"uv": [2.75, 5, 3, 5.75], "texture": "#0"},
				"up": {"uv": [2.75, 5, 3, 5.25], "texture": "#0"},
				"down": {"uv": [2.75, 5.5, 3, 5.75], "texture": "#0"}
			}
		},
		{
			"from": [7.75, 11.75, 7],
			"to": [8.25, 13.25, 7.5],
			"rotation": {"angle": 0, "axis": "y", "origin": [15.5, 15.25, 18]},
			"faces": {
				"north": {"uv": [7.25, 5.25, 7.5, 6], "texture": "#0"},
				"east": {"uv": [3, 5.25, 3.25, 6], "texture": "#0"},
				"south": {"uv": [8, 5.25, 8.25, 6], "texture": "#0"},
				"west": {"uv": [3, 5.25, 3.25, 6], "texture": "#0"},
				"up": {"uv": [3, 5.25, 3.25, 5.5], "texture": "#0"},
				"down": {"uv": [3, 5.75, 3.25, 6], "texture": "#0"}
			}
		},
		{
			"from": [7.75, 12.75, 6],
			"to": [8.25, 14.25, 6.5],
			"rotation": {"angle": 0, "axis": "y", "origin": [15.5, 16.25, 17]},
			"faces": {
				"north": {"uv": [2.5, 4.75, 2.75, 5.5], "texture": "#0"},
				"east": {"uv": [2.5, 4.75, 2.75, 5.5], "texture": "#0"},
				"south": {"uv": [8, 4.75, 8.25, 5.5], "texture": "#0"},
				"west": {"uv": [2.5, 4.75, 2.75, 5.5], "texture": "#0"},
				"up": {"uv": [2.5, 4.75, 2.75, 5], "texture": "#0"},
				"down": {"uv": [2.5, 5.25, 2.75, 5.5], "texture": "#0"}
			}
		},
		{
			"from": [7.75, 12.75, 3.5],
			"to": [8.25, 16.25, 6],
			"rotation": {"angle": 0, "axis": "y", "origin": [15.5, 17.25, 14.5]},
			"faces": {
				"north": {"uv": [7.25, 3.75, 7.5, 5.5], "texture": "#0"},
				"east": {"uv": [1.25, 3.75, 2.5, 5.5], "texture": "#0"},
				"south": {"uv": [8, 3.75, 8.25, 5.5], "texture": "#0"},
				"west": {"uv": [1.25, 3.75, 2.5, 5.5], "texture": "#0"},
				"up": {"uv": [1.25, 3.75, 2.5, 5.5], "texture": "#0"},
				"down": {"uv": [1.25, 5.25, 1.5, 5.5], "texture": "#0"}
			}
		},
		{
			"from": [7.25, 12.75, 5],
			"to": [8.75, 14.75, 5.5],
			"rotation": {"angle": 0, "axis": "y", "origin": [15.5, 16.75, 14.5]},
			"faces": {
				"north": {"uv": [7, 4.5, 7.75, 5.5], "texture": "#0"},
				"east": {"uv": [2, 4.5, 2.25, 5.5], "texture": "#0"},
				"south": {"uv": [2, 4.5, 2.25, 5.5], "texture": "#0"},
				"west": {"uv": [2, 4.5, 2.25, 5.5], "texture": "#0"},
				"up": {"uv": [2, 4.5, 2.25, 4.75], "texture": "#0"},
				"down": {"uv": [2, 4.5, 2.25, 5.5], "texture": "#0"}
			}
		},
		{
			"from": [7.5, 12.75, 4.5],
			"to": [8.5, 14.25, 5],
			"rotation": {"angle": 0, "axis": "y", "origin": [15.5, 17.25, 14]},
			"faces": {
				"north": {"uv": [1.75, 4.75, 2, 5.5], "texture": "#0"},
				"east": {"uv": [1.75, 4.75, 2, 5.5], "texture": "#0"},
				"south": {"uv": [1.75, 4.75, 2, 5.5], "texture": "#0"},
				"west": {"uv": [1.75, 4.75, 2, 5.5], "texture": "#0"},
				"up": {"uv": [1.75, 4.75, 2, 5.5], "texture": "#0"},
				"down": {"uv": [1.75, 4.75, 2, 5.5], "texture": "#0"}
			}
		},
		{
			"from": [7.25, 12.25, 4],
			"to": [8.75, 12.75, 5.5],
			"rotation": {"angle": 0, "axis": "y", "origin": [15.5, 16.75, 13.5]},
			"faces": {
				"north": {"uv": [7, 5.5, 7.75, 5.75], "texture": "#0"},
				"east": {"uv": [1.5, 5.5, 2.25, 5.75], "texture": "#0"},
				"south": {"uv": [1.5, 5.5, 2.25, 5.75], "texture": "#0"},
				"west": {"uv": [1.5, 5.5, 2.25, 5.75], "texture": "#0"},
				"up": {"uv": [1.5, 5.5, 2.25, 5.75], "texture": "#0"},
				"down": {"uv": [1.5, 5.75, 2.25, 6.5], "texture": "#0"}
			}
		},
		{
			"from": [7.25, 12.75, 4],
			"to": [8.75, 14.75, 4.5],
			"rotation": {"angle": 0, "axis": "y", "origin": [15.5, 16.75, 13.5]},
			"faces": {
				"north": {"uv": [7, 4.5, 7.75, 5.5], "texture": "#0"},
				"east": {"uv": [1.5, 4.5, 1.75, 5.5], "texture": "#0"},
				"south": {"uv": [1.5, 4.5, 1.75, 5.5], "texture": "#0"},
				"west": {"uv": [1.5, 4.5, 1.75, 5.5], "texture": "#0"},
				"up": {"uv": [1.5, 4.5, 1.75, 4.75], "texture": "#0"},
				"down": {"uv": [1.5, 4.5, 1.75, 5.5], "texture": "#0"}
			}
		},
		{
			"from": [7.25, 14.25, 4.5],
			"to": [8.75, 15.25, 5],
			"rotation": {"angle": 0, "axis": "y", "origin": [15.5, 18.25, 14]},
			"faces": {
				"north": {"uv": [7, 4.25, 7.75, 4.75], "texture": "#0"},
				"east": {"uv": [1.75, 4.25, 2, 4.75], "texture": "#0"},
				"south": {"uv": [1.75, 4.25, 2, 4.75], "texture": "#0"},
				"west": {"uv": [1.75, 4.25, 2, 4.75], "texture": "#0"},
				"up": {"uv": [1.75, 4.25, 2, 4.5], "texture": "#0"},
				"down": {"uv": [1.75, 4.25, 2, 4.75], "texture": "#0"}
			}
		},
		{
			"from": [7.75, 12.75, 3],
			"to": [8.25, 14.25, 3.5],
			"rotation": {"angle": 0, "axis": "y", "origin": [15.5, 16.25, 14]},
			"faces": {
				"north": {"uv": [7.25, 4.75, 7.5, 5.5], "texture": "#0"},
				"east": {"uv": [1, 4.75, 1.25, 5.5], "texture": "#0"},
				"south": {"uv": [1, 4.75, 1.25, 5.5], "texture": "#0"},
				"west": {"uv": [1, 4.75, 1.25, 5.5], "texture": "#0"},
				"up": {"uv": [1, 4.75, 1.25, 5], "texture": "#0"},
				"down": {"uv": [1, 5.25, 1.25, 5.5], "texture": "#0"}
			}
		},
		{
			"from": [7.75, 12.25, 2.5],
			"to": [8.25, 13.75, 3],
			"rotation": {"angle": 0, "axis": "y", "origin": [15.5, 15.75, 13.5]},
			"faces": {
				"north": {"uv": [7.25, 5, 7.5, 5.75], "texture": "#0"},
				"east": {"uv": [0.75, 5, 1, 5.75], "texture": "#0"},
				"south": {"uv": [0.75, 5, 1, 5.75], "texture": "#0"},
				"west": {"uv": [0.75, 5.5, 1, 5.75], "texture": "#0"},
				"up": {"uv": [0.75, 5, 1, 5.25], "texture": "#0"},
				"down": {"uv": [0.75, 5.5, 1, 5.75], "texture": "#0"}
			}
		},
		{
			"from": [7.75, 11.75, 2],
			"to": [8.25, 13.25, 2.5],
			"rotation": {"angle": 0, "axis": "y", "origin": [15.5, 15.25, 13]},
			"faces": {
				"north": {"uv": [7.25, 5.25, 7.5, 6], "texture": "#0"},
				"east": {"uv": [0.5, 5.25, 0.75, 6], "texture": "#0"},
				"south": {"uv": [0.5, 5.25, 0.75, 6], "texture": "#0"},
				"west": {"uv": [0.5, 5.25, 0.75, 6], "texture": "#0"},
				"up": {"uv": [0.5, 5.25, 0.75, 5.5], "texture": "#0"},
				"down": {"uv": [0.5, 5.75, 0.75, 6], "texture": "#0"}
			}
		},
		{
			"from": [7.75, 15.75, 3],
			"to": [8.25, 16.25, 3.5],
			"rotation": {"angle": 0, "axis": "y", "origin": [15.5, 19.75, 13.5]},
			"faces": {
				"north": {"uv": [1, 3.75, 1.25, 4], "texture": "#0"},
				"east": {"uv": [1, 3.75, 1.25, 4], "texture": "#0"},
				"south": {"uv": [1, 3.75, 1.25, 4], "texture": "#0"},
				"west": {"uv": [1, 3.75, 1.25, 4], "texture": "#0"},
				"up": {"uv": [1, 3.75, 1.25, 4], "texture": "#0"},
				"down": {"uv": [1, 3.75, 1.25, 4], "texture": "#0"}
			}
		},
		{
			"from": [7.75, 15.75, 6],
			"to": [8.25, 16.25, 6.5],
			"rotation": {"angle": 0, "axis": "y", "origin": [15.5, 19.75, 16.5]},
			"faces": {
				"north": {"uv": [2.5, 3.75, 2.75, 4], "texture": "#0"},
				"east": {"uv": [2.5, 3.75, 2.75, 4], "texture": "#0"},
				"south": {"uv": [8, 3.75, 8.25, 4], "texture": "#0"},
				"west": {"uv": [2.5, 3.75, 2.75, 4], "texture": "#0"},
				"up": {"uv": [2.5, 3.75, 2.75, 4], "texture": "#0"},
				"down": {"uv": [2.5, 3.75, 2.75, 4], "texture": "#0"}
			}
		},
		{
			"from": [8, 12.25, 1],
			"to": [8, 16.25, 15],
			"rotation": {"angle": 0, "axis": "y", "origin": [15.5, 16.75, 14]},
			"faces": {
				"north": {"uv": [0, 0, 7, 5.75], "texture": "#0"},
				"east": {"uv": [7, 3.75, 0, 5.75], "texture": "#0"},
				"south": {"uv": [0, 0, 7, 5.75], "texture": "#0"},
				"west": {"uv": [0, 3.75, 7, 5.75], "texture": "#0"},
				"up": {"uv": [0, 0, 7, 5.75], "texture": "#0"},
				"down": {"uv": [0, 0, 7, 5.75], "texture": "#0"}
			}
		},
		{
			"from": [8, -0.25, 1],
			"to": [8, 3.75, 15],
			"rotation": {"angle": 0, "axis": "y", "origin": [15.5, -3.25, 14]},
			"faces": {
				"north": {"uv": [0, 0, 7, 5.75], "texture": "#0"},
				"east": {"uv": [7, 8.25, 0, 10.25], "texture": "#0"},
				"south": {"uv": [0, 0, 7, 5.75], "texture": "#0"},
				"west": {"uv": [0, 8.25, 7, 10.25], "texture": "#0"},
				"up": {"uv": [0, 0, 7, 5.75], "texture": "#0"},
				"down": {"uv": [0, 0, 7, 5.75], "texture": "#0"}
			}
		},
		{
			"from": [8, 1.75, 3],
			"to": [8, 14.25, 6.5],
			"rotation": {"angle": 45, "axis": "z", "origin": [8, 8, 4.75]},
			"faces": {
				"north": {"uv": [14.25, 9.75, 16, 16], "rotation": 270, "texture": "#0"},
				"east": {"uv": [14.25, 9.75, 16, 16], "rotation": 180, "texture": "#0"},
				"south": {"uv": [14.25, 9.75, 16, 16], "rotation": 90, "texture": "#0"},
				"west": {"uv": [14.25, 9.75, 16, 16], "texture": "#0"},
				"up": {"uv": [14.25, 9.75, 16, 16], "rotation": 90, "texture": "#0"},
				"down": {"uv": [14.25, 9.75, 16, 16], "rotation": 270, "texture": "#0"}
			}
		},
		{
			"from": [2.25, 6.75, 3],
			"to": [14.75, 6.75, 6.5],
			"rotation": {"angle": 45, "axis": "z", "origin": [6.75, 6.75, 7.5]},
			"faces": {
				"north": {"uv": [14.25, 9.75, 16, 16], "rotation": 90, "texture": "#0"},
				"east": {"uv": [14.25, 9.75, 16, 16], "rotation": 90, "texture": "#0"},
				"south": {"uv": [14.25, 9.75, 16, 16], "rotation": 90, "texture": "#0"},
				"west": {"uv": [14.25, 9.75, 16, 16], "rotation": 90, "texture": "#0"},
				"up": {"uv": [14.25, 9.75, 16, 16], "rotation": 90, "texture": "#0"},
				"down": {"uv": [16, 9.75, 14.25, 16], "rotation": 90, "texture": "#0"}
			}
		},
		{
			"from": [7.75, 4.75, 4.5],
			"to": [8.25, 7.25, 5],
			"rotation": {"angle": 0, "axis": "z", "origin": [8, 8, 4.75]},
			"faces": {
				"north": {"uv": [13.75, 2.5, 14, 3.75], "texture": "#0"},
				"east": {"uv": [13.75, 2.5, 14, 3.75], "texture": "#0"},
				"south": {"uv": [13.75, 2.5, 14, 3.75], "texture": "#0"},
				"west": {"uv": [13.75, 2.5, 14, 3.75], "texture": "#0"},
				"up": {"uv": [13.75, 2.5, 14, 2.75], "texture": "#0"},
				"down": {"uv": [13.75, 3.5, 14, 3.75], "texture": "#0"}
			}
		},
		{
			"from": [7.25, 6.25, 4.25],
			"to": [8.75, 6.75, 5.25],
			"rotation": {"angle": 0, "axis": "y", "origin": [15.25, 10.75, 12.25]},
			"faces": {
				"north": {"uv": [13.5, 2.75, 14.25, 3], "texture": "#0"},
				"east": {"uv": [15.5, 2.75, 16, 3], "texture": "#0"},
				"south": {"uv": [13.5, 2.75, 14.25, 3], "texture": "#0"},
				"west": {"uv": [15.5, 2.75, 16, 3], "texture": "#0"},
				"up": {"uv": [13.5, 0, 14.25, 0.5], "texture": "#0"},
				"down": {"uv": [13.5, 0, 14.25, 0.5], "texture": "#0"}
			}
		},
		{
			"from": [8.75, 6.75, 4.25],
			"to": [9.25, 7.25, 5.25],
			"rotation": {"angle": 0, "axis": "y", "origin": [15.75, 11.25, 12.25]},
			"faces": {
				"north": {"uv": [15.5, 2.5, 16, 2.75], "texture": "#0"},
				"east": {"uv": [15.5, 2.5, 16, 2.75], "texture": "#0"},
				"south": {"uv": [15.5, 2.5, 16, 2.75], "texture": "#0"},
				"west": {"uv": [15.5, 2.5, 16, 2.75], "texture": "#0"},
				"up": {"uv": [13.25, 0, 13.5, 0.5], "texture": "#0"},
				"down": {"uv": [13.25, 0, 13.5, 0.5], "texture": "#0"}
			}
		},
		{
			"from": [8.75, 7.75, 4.5],
			"to": [11.25, 8.25, 5],
			"rotation": {"angle": 0, "axis": "z", "origin": [10, 8, 4.75]},
			"faces": {
				"north": {"uv": [12.25, 2, 13.5, 2.25], "texture": "#0"},
				"east": {"uv": [12.25, 2, 12.5, 2.25], "texture": "#0"},
				"south": {"uv": [13.5, 2, 12.25, 2.25], "texture": "#0"},
				"west": {"uv": [13.25, 2, 13.5, 2.25], "texture": "#0"},
				"up": {"uv": [14.25, 2, 15.5, 2.25], "texture": "#0"},
				"down": {"uv": [14.25, 2, 15.5, 2.25], "texture": "#0"}
			}
		},
		{
			"from": [9.25, 7.25, 4.25],
			"to": [9.75, 8.75, 5.25],
			"rotation": {"angle": 0, "axis": "x", "origin": [9.5, 8, 4.75]},
			"faces": {
				"north": {"uv": [13, 1.75, 13.25, 2.5], "rotation": 180, "texture": "#0"},
				"east": {"uv": [15.5, 1.75, 16, 2.5], "rotation": 180, "texture": "#0"},
				"south": {"uv": [13, 1.75, 13.25, 2.5], "rotation": 180, "texture": "#0"},
				"west": {"uv": [15.5, 1.75, 16, 2.5], "rotation": 180, "texture": "#0"},
				"up": {"uv": [13, 0, 13.25, 0.5], "rotation": 180, "texture": "#0"},
				"down": {"uv": [13, 0, 13.25, 0.5], "rotation": 180, "texture": "#0"}
			}
		},
		{
			"from": [6.25, 7.25, 4.25],
			"to": [6.75, 8.75, 5.25],
			"rotation": {"angle": 0, "axis": "x", "origin": [6.5, 8, 4.75]},
			"faces": {
				"north": {"uv": [14.5, 1.75, 14.75, 2.5], "rotation": 180, "texture": "#0"},
				"east": {"uv": [15.5, 1.75, 16, 2.5], "rotation": 180, "texture": "#0"},
				"south": {"uv": [14.5, 1.75, 14.75, 2.5], "rotation": 180, "texture": "#0"},
				"west": {"uv": [15.5, 1.75, 16, 2.5], "rotation": 180, "texture": "#0"},
				"up": {"uv": [14.5, 0, 14.75, 0.5], "rotation": 180, "texture": "#0"},
				"down": {"uv": [14.5, 0, 14.75, 0.5], "rotation": 180, "texture": "#0"}
			}
		},
		{
			"from": [4.75, 7.75, 4.5],
			"to": [7.25, 8.25, 5],
			"rotation": {"angle": 0, "axis": "z", "origin": [6, 8, 4.75]},
			"faces": {
				"north": {"uv": [14.25, 2, 15.5, 2.25], "texture": "#0"},
				"east": {"uv": [14.25, 2, 14.5, 2.25], "rotation": 180, "texture": "#0"},
				"south": {"uv": [14.25, 2, 15.5, 2.25], "rotation": 180, "texture": "#0"},
				"west": {"uv": [15.25, 2, 15.5, 2.25], "rotation": 180, "texture": "#0"},
				"up": {"uv": [14.25, 2, 15.5, 2.25], "rotation": 180, "texture": "#0"},
				"down": {"uv": [14.25, 2, 15.5, 2.25], "rotation": 180, "texture": "#0"}
			}
		},
		{
			"from": [6.75, 6.75, 4.25],
			"to": [7.25, 7.25, 5.25],
			"rotation": {"angle": 0, "axis": "y", "origin": [8.75, 7.25, 4.75]},
			"faces": {
				"north": {"uv": [13.75, 1.25, 14, 1.5], "rotation": 90, "texture": "#0"},
				"east": {"uv": [13.75, 1.25, 14, 1.5], "rotation": 90, "texture": "#0"},
				"south": {"uv": [13.75, 1.25, 14, 1.5], "rotation": 90, "texture": "#0"},
				"west": {"uv": [15.5, 2.5, 16, 2.75], "rotation": 90, "texture": "#0"},
				"up": {"uv": [14.25, 0, 14.5, 0.5], "rotation": 90, "texture": "#0"},
				"down": {"uv": [14.25, 0, 14.5, 0.5], "rotation": 90, "texture": "#0"}
			}
		},
		{
			"from": [6.75, 8.75, 4.25],
			"to": [7.25, 9.25, 5.25],
			"rotation": {"angle": 0, "axis": "y", "origin": [14.75, 13.25, 12.25]},
			"faces": {
				"north": {"uv": [15.5, 1.5, 16, 1.75], "texture": "#0"},
				"east": {"uv": [15.5, 1.5, 16, 1.75], "texture": "#0"},
				"south": {"uv": [15.5, 1.5, 16, 1.75], "texture": "#0"},
				"west": {"uv": [15.5, 1.5, 16, 1.75], "texture": "#0"},
				"up": {"uv": [14.25, 0, 14.5, 0.5], "texture": "#0"},
				"down": {"uv": [14.25, 0, 14.5, 0.5], "texture": "#0"}
			}
		},
		{
			"from": [7.25, 9.25, 4.25],
			"to": [8.75, 9.75, 5.25],
			"rotation": {"angle": 0, "axis": "y", "origin": [15.25, 13.75, 12.25]},
			"faces": {
				"north": {"uv": [13.5, 1.25, 14.25, 1.5], "texture": "#0"},
				"east": {"uv": [15.5, 1.25, 16, 1.5], "texture": "#0"},
				"south": {"uv": [13.5, 1.25, 14.25, 1.5], "texture": "#0"},
				"west": {"uv": [15.5, 1.25, 16, 1.5], "texture": "#0"},
				"up": {"uv": [13.5, 0, 14.25, 0.5], "texture": "#0"},
				"down": {"uv": [13.5, 0, 14.25, 0.5], "texture": "#0"}
			}
		},
		{
			"from": [7.75, 8.75, 4.5],
			"to": [8.25, 11.25, 5],
			"rotation": {"angle": 0, "axis": "z", "origin": [8, 8, 4.75]},
			"faces": {
				"north": {"uv": [13.75, 0.5, 14, 1.75], "texture": "#0"},
				"east": {"uv": [13.75, 0.5, 14, 1.75], "texture": "#0"},
				"south": {"uv": [13.75, 0.5, 14, 1.75], "texture": "#0"},
				"west": {"uv": [13.75, 0.5, 14, 1.75], "texture": "#0"},
				"up": {"uv": [13.75, 0.5, 14, 0.75], "texture": "#0"},
				"down": {"uv": [13.75, 1.5, 14, 1.75], "texture": "#0"}
			}
		},
		{
			"from": [8.75, 8.75, 4.25],
			"to": [9.25, 9.25, 5.25],
			"rotation": {"angle": 0, "axis": "y", "origin": [7.25, 8.25, 4.75]},
			"faces": {
				"north": {"uv": [15.5, 1.5, 16, 1.75], "rotation": 90, "texture": "#0"},
				"east": {"uv": [15.5, 1.5, 16, 1.75], "rotation": 90, "texture": "#0"},
				"south": {"uv": [15.5, 1.5, 16, 1.75], "rotation": 90, "texture": "#0"},
				"west": {"uv": [15.5, 1.5, 16, 1.75], "rotation": 90, "texture": "#0"},
				"up": {"uv": [13.25, 0, 13.5, 0.5], "rotation": 90, "texture": "#0"},
				"down": {"uv": [13.25, 0, 13.5, 0.5], "rotation": 90, "texture": "#0"}
			}
		},
		{
			"from": [7.75, 19.75, 6],
			"to": [8.25, 20.25, 8],
			"rotation": {"angle": 0, "axis": "x", "origin": [8, 21, 9]},
			"faces": {
				"north": {"uv": [7.25, 1.75, 7.5, 2], "texture": "#0"},
				"east": {"uv": [3.5, 1.75, 2.5, 2], "texture": "#0"},
				"south": {"uv": [8, 1.75, 8.25, 2], "texture": "#0"},
				"west": {"uv": [2.5, 1.75, 3.5, 2], "texture": "#0"},
				"up": {"uv": [2.5, 1.75, 2.75, 2], "texture": "#0"},
				"down": {"uv": [3.25, 1.75, 3.5, 2], "texture": "#0"}
			}
		},
		{
			"from": [7.75, 20.25, 7],
			"to": [8.25, 20.75, 8.5],
			"rotation": {"angle": 0, "axis": "x", "origin": [8, 21, 9]},
			"faces": {
				"north": {"uv": [7.25, 1.5, 7.5, 1.75], "texture": "#0"},
				"east": {"uv": [3.75, 1.5, 3, 1.75], "texture": "#0"},
				"south": {"uv": [8, 1.5, 8.25, 1.75], "texture": "#0"},
				"west": {"uv": [3, 1.5, 3.75, 1.75], "texture": "#0"},
				"up": {"uv": [3, 1.5, 3.25, 1.75], "texture": "#0"},
				"down": {"uv": [3.5, 1.5, 3.75, 1.75], "texture": "#0"}
			}
		},
		{
			"from": [7.75, 20.75, 8],
			"to": [8.25, 21.25, 9],
			"rotation": {"angle": 0, "axis": "x", "origin": [8, 21, 9]},
			"faces": {
				"north": {"uv": [7.25, 1.25, 7.5, 1.5], "texture": "#0"},
				"east": {"uv": [3.5, 1.25, 4, 1.5], "texture": "#0"},
				"south": {"uv": [8, 1.25, 8.25, 1.5], "texture": "#0"},
				"west": {"uv": [3.5, 1.25, 4, 1.5], "texture": "#0"},
				"up": {"uv": [3.5, 1.25, 4, 1.5], "texture": "#0"},
				"down": {"uv": [3.75, 1.25, 4, 1.5], "texture": "#0"}
			}
		},
		{
			"from": [7.75, 21.25, 9.5],
			"to": [8.25, 21.75, 10],
			"rotation": {"angle": 0, "axis": "x", "origin": [8, 21, 9]},
			"faces": {
				"north": {"uv": [7.25, 1, 7.5, 1.25], "texture": "#0"},
				"east": {"uv": [4.25, 1, 4.5, 1.25], "texture": "#0"},
				"south": {"uv": [8, 1, 8.25, 1.25], "texture": "#0"},
				"west": {"uv": [4.25, 1, 4.5, 1.25], "texture": "#0"},
				"up": {"uv": [4.25, 1, 4.5, 1.25], "texture": "#0"},
				"down": {"uv": [4.25, 1, 4.5, 1.25], "texture": "#0"}
			}
		},
		{
			"from": [7.75, 21.75, 10.5],
			"to": [8.25, 22.25, 11.5],
			"rotation": {"angle": 0, "axis": "x", "origin": [8, 21, 9]},
			"faces": {
				"north": {"uv": [7.25, 0.75, 7.5, 1], "texture": "#0"},
				"east": {"uv": [5.25, 0.75, 4.75, 1], "texture": "#0"},
				"south": {"uv": [8, 0.75, 8.25, 1], "texture": "#0"},
				"west": {"uv": [4.75, 0.75, 5.25, 1], "texture": "#0"},
				"up": {"uv": [4.75, 0.75, 5, 1], "texture": "#0"},
				"down": {"uv": [4.75, 0.75, 5, 1], "texture": "#0"}
			}
		},
		{
			"from": [7.75, 22.25, 11],
			"to": [8.25, 22.75, 12.5],
			"rotation": {"angle": 0, "axis": "x", "origin": [8, 21, 9]},
			"faces": {
				"north": {"uv": [7.25, 0.5, 7.5, 0.75], "texture": "#0"},
				"east": {"uv": [5, 0.5, 5.75, 0.75], "texture": "#0"},
				"south": {"uv": [8, 0.5, 8.25, 0.75], "texture": "#0"},
				"west": {"uv": [5, 0.5, 5.75, 0.75], "texture": "#0"},
				"up": {"uv": [5, 0.5, 5.75, 0.75], "texture": "#0"},
				"down": {"uv": [5, 0.5, 5.75, 0.75], "texture": "#0"}
			}
		},
		{
			"from": [8, 19.75, 1],
			"to": [8, 23.75, 15],
			"rotation": {"angle": 0, "axis": "x", "origin": [8, 21, 9]},
			"faces": {
				"north": {"uv": [0, 0, 7, 5.75], "texture": "#0"},
				"east": {"uv": [7, 0, 0, 2], "texture": "#0"},
				"south": {"uv": [0, 0, 7, 5.75], "texture": "#0"},
				"west": {"uv": [0, 0, 7, 2], "texture": "#0"},
				"up": {"uv": [0, 0, 7, 5.75], "texture": "#0"},
				"down": {"uv": [0, 0, 7, 5.75], "texture": "#0"}
			}
		},
		{
			"from": [7.75, 19.25, 5.5],
			"to": [8.25, 19.75, 7.5],
			"rotation": {"angle": 0, "axis": "x", "origin": [8, 16.25, 3.54167]},
			"faces": {
				"north": {"uv": [7.25, 2, 7.5, 2.25], "texture": "#0"},
				"east": {"uv": [3.25, 2, 2.25, 2.25], "texture": "#0"},
				"south": {"uv": [8, 2, 8.25, 2.25], "texture": "#0"},
				"west": {"uv": [2.25, 2, 3.25, 2.25], "texture": "#0"},
				"up": {"uv": [2.25, 2, 2.5, 2.25], "texture": "#0"},
				"down": {"uv": [3, 2, 3.25, 2.25], "texture": "#0"}
			}
		},
		{
			"from": [7.75, 18.75, 5],
			"to": [8.25, 19.25, 7],
			"rotation": {"angle": 0, "axis": "x", "origin": [8, 16.25, 3.54167]},
			"faces": {
				"north": {"uv": [7.25, 2.25, 7.5, 2.5], "texture": "#0"},
				"east": {"uv": [3, 2.25, 2, 2.5], "texture": "#0"},
				"south": {"uv": [8, 2.25, 8.25, 2.5], "texture": "#0"},
				"west": {"uv": [2, 2.25, 3, 2.5], "texture": "#0"},
				"up": {"uv": [2, 2.25, 2.25, 2.5], "texture": "#0"},
				"down": {"uv": [2, 2.25, 3, 2.5], "texture": "#0"}
			}
		},
		{
			"from": [7.75, 18.25, 4.5],
			"to": [8.25, 18.75, 7],
			"rotation": {"angle": 0, "axis": "x", "origin": [8, 16.25, 3.54167]},
			"faces": {
				"north": {"uv": [7.25, 2.5, 7.5, 2.75], "texture": "#0"},
				"east": {"uv": [3, 2.5, 1.75, 2.75], "texture": "#0"},
				"south": {"uv": [8, 2.5, 8.25, 2.75], "texture": "#0"},
				"west": {"uv": [1.75, 2.5, 3, 2.75], "texture": "#0"},
				"up": {"uv": [1.75, 2.5, 2, 2.75], "texture": "#0"},
				"down": {"uv": [2.75, 2.5, 3, 2.75], "texture": "#0"}
			}
		},
		{
			"from": [7.75, 17.25, 4],
			"to": [8.25, 18.25, 6.5],
			"rotation": {"angle": 0, "axis": "x", "origin": [8, 16.25, 3.54167]},
			"faces": {
				"north": {"uv": [7.25, 2.75, 7.5, 3.25], "texture": "#0"},
				"east": {"uv": [2.75, 2.75, 1.5, 3.25], "texture": "#0"},
				"south": {"uv": [8, 2.75, 8.25, 3.25], "texture": "#0"},
				"west": {"uv": [1.5, 2.75, 2.75, 3.25], "texture": "#0"},
				"up": {"uv": [1.5, 2.75, 1.75, 3], "texture": "#0"},
				"down": {"uv": [2.5, 3, 2.75, 3.25], "texture": "#0"}
			}
		},
		{
			"from": [7.75, 16.25, 3.5],
			"to": [8.25, 17.25, 6],
			"rotation": {"angle": 0, "axis": "x", "origin": [8, 16.25, 3.54167]},
			"faces": {
				"north": {"uv": [7.25, 3.25, 7.5, 3.75], "texture": "#0"},
				"east": {"uv": [2.5, 3.25, 1.25, 3.75], "texture": "#0"},
				"south": {"uv": [8, 3.25, 8.25, 3.75], "texture": "#0"},
				"west": {"uv": [1.25, 3.25, 2.5, 3.75], "texture": "#0"},
				"up": {"uv": [1.25, 3.25, 1.5, 3.5], "texture": "#0"},
				"down": {"uv": [1.25, 3.25, 2.5, 3.75], "texture": "#0"}
			}
		},
		{
			"from": [8, 16.25, 1],
			"to": [8, 19.75, 15],
			"rotation": {"angle": 0, "axis": "x", "origin": [8, 16.25, 3.54167]},
			"faces": {
				"north": {"uv": [0, 0, 7, 5.75], "texture": "#0"},
				"east": {"uv": [7, 2, 0, 3.75], "texture": "#0"},
				"south": {"uv": [0, 0, 7, 5.75], "texture": "#0"},
				"west": {"uv": [0, 2, 7, 3.75], "texture": "#0"},
				"up": {"uv": [0, 0, 7, 5.75], "texture": "#0"},
				"down": {"uv": [0, 0, 7, 5.75], "texture": "#0"}
			}
		},
		{
			"from": [7.75, -1.25, 3.5],
			"to": [8.25, -0.25, 6],
			"rotation": {"angle": 0, "axis": "x", "origin": [8, -0.25, 3.54167]},
			"faces": {
				"north": {"uv": [7.25, 10.25, 7.5, 10.75], "texture": "#0"},
				"east": {"uv": [2.5, 10.25, 1.25, 10.75], "texture": "#0"},
				"south": {"uv": [8, 10.25, 8.25, 10.75], "texture": "#0"},
				"west": {"uv": [1.25, 10.25, 2.5, 10.75], "texture": "#0"},
				"up": {"uv": [1.25, 10.25, 2.5, 10.75], "texture": "#0"},
				"down": {"uv": [1.25, 10.5, 1.5, 10.75], "texture": "#0"}
			}
		},
		{
			"from": [7.75, -2.25, 4],
			"to": [8.25, -1.25, 6.5],
			"rotation": {"angle": 0, "axis": "x", "origin": [8, -0.25, 3.54167]},
			"faces": {
				"north": {"uv": [7.25, 10.75, 7.5, 11.25], "texture": "#0"},
				"east": {"uv": [2.75, 10.75, 1.5, 11.25], "texture": "#0"},
				"south": {"uv": [8, 10.75, 8.25, 11.25], "texture": "#0"},
				"west": {"uv": [1.5, 10.75, 2.75, 11.25], "texture": "#0"},
				"up": {"uv": [2.5, 10.75, 2.75, 11], "texture": "#0"},
				"down": {"uv": [1.5, 11, 1.75, 11.25], "texture": "#0"}
			}
		},
		{
			"from": [7.75, -2.75, 4.5],
			"to": [8.25, -2.25, 7],
			"rotation": {"angle": 0, "axis": "x", "origin": [8, -0.25, 3.54167]},
			"faces": {
				"north": {"uv": [7.25, 11.25, 7.5, 11.5], "texture": "#0"},
				"east": {"uv": [3, 11.25, 1.75, 11.5], "texture": "#0"},
				"south": {"uv": [8, 11.25, 8.25, 11.5], "texture": "#0"},
				"west": {"uv": [1.75, 11.25, 3, 11.5], "texture": "#0"},
				"up": {"uv": [2.75, 11.25, 3, 11.5], "texture": "#0"},
				"down": {"uv": [1.75, 11.25, 2, 11.5], "texture": "#0"}
			}
		},
		{
			"from": [7.75, -3.75, 5.5],
			"to": [8.25, -3.25, 7.5],
			"rotation": {"angle": 0, "axis": "x", "origin": [8, -0.25, 3.54167]},
			"faces": {
				"north": {"uv": [7.25, 11.75, 7.5, 12], "texture": "#0"},
				"east": {"uv": [3.25, 11.75, 2.25, 12], "texture": "#0"},
				"south": {"uv": [8, 11.75, 8.25, 12], "texture": "#0"},
				"west": {"uv": [2.25, 11.75, 3.25, 12], "texture": "#0"},
				"up": {"uv": [3, 11.75, 3.25, 12], "texture": "#0"},
				"down": {"uv": [2.25, 11.75, 2.5, 12], "texture": "#0"}
			}
		},
		{
			"from": [7.75, -3.25, 5],
			"to": [8.25, -2.75, 7],
			"rotation": {"angle": 0, "axis": "x", "origin": [8, -0.25, 3.54167]},
			"faces": {
				"north": {"uv": [7.25, 11.5, 7.5, 11.75], "texture": "#0"},
				"east": {"uv": [3, 11.5, 2, 11.75], "texture": "#0"},
				"south": {"uv": [8, 11.5, 8.25, 11.75], "texture": "#0"},
				"west": {"uv": [2, 11.5, 3, 11.75], "texture": "#0"},
				"up": {"uv": [2, 11.5, 3, 11.75], "texture": "#0"},
				"down": {"uv": [2, 11.5, 2.25, 11.75], "texture": "#0"}
			}
		},
		{
			"from": [8, -3.75, 1],
			"to": [8, -0.25, 15],
			"rotation": {"angle": 0, "axis": "x", "origin": [8, -0.25, 3.54167]},
			"faces": {
				"north": {"uv": [0, 0, 7, 5.75], "texture": "#0"},
				"east": {"uv": [7, 10.25, 0, 12], "texture": "#0"},
				"south": {"uv": [0, 0, 7, 5.75], "texture": "#0"},
				"west": {"uv": [0, 10.25, 7, 12], "texture": "#0"},
				"up": {"uv": [0, 0, 7, 5.75], "texture": "#0"},
				"down": {"uv": [0, 0, 7, 5.75], "texture": "#0"}
			}
		},
		{
			"from": [8, -7.75, 1],
			"to": [8, -3.75, 15],
			"rotation": {"angle": 0, "axis": "x", "origin": [8, -3.75, 6]},
			"faces": {
				"north": {"uv": [0, 0, 7, 5.75], "texture": "#0"},
				"east": {"uv": [7, 12, 0, 14], "texture": "#0"},
				"south": {"uv": [0, 0, 7, 5.75], "texture": "#0"},
				"west": {"uv": [0, 12, 7, 14], "texture": "#0"},
				"up": {"uv": [0, 0, 7, 5.75], "texture": "#0"},
				"down": {"uv": [0, 0, 7, 5.75], "texture": "#0"}
			}
		},
		{
			"from": [7.75, -6.75, 11],
			"to": [8.25, -6.25, 12.5],
			"rotation": {"angle": 0, "axis": "x", "origin": [8, -3.75, 6]},
			"faces": {
				"north": {"uv": [7.25, 13.25, 7.5, 13.5], "texture": "#0"},
				"east": {"uv": [5, 13.25, 5.75, 13.5], "texture": "#0"},
				"south": {"uv": [8, 13.25, 8.25, 13.5], "texture": "#0"},
				"west": {"uv": [5, 13.25, 5.75, 13.5], "texture": "#0"},
				"up": {"uv": [5, 13.25, 5.75, 13.5], "texture": "#0"},
				"down": {"uv": [5, 13.25, 5.75, 13.5], "texture": "#0"}
			}
		},
		{
			"from": [7.75, -6.25, 10.5],
			"to": [8.25, -5.75, 11.5],
			"rotation": {"angle": 0, "axis": "x", "origin": [8, -3.75, 6]},
			"faces": {
				"north": {"uv": [7.25, 13, 7.5, 13.25], "texture": "#0"},
				"east": {"uv": [5.25, 13, 4.75, 13.25], "texture": "#0"},
				"south": {"uv": [8, 13, 8.25, 13.25], "texture": "#0"},
				"west": {"uv": [4.75, 13, 5.25, 13.25], "texture": "#0"},
				"up": {"uv": [4.75, 13, 5, 13.25], "texture": "#0"},
				"down": {"uv": [4.75, 13, 5, 13.25], "texture": "#0"}
			}
		},
		{
			"from": [7.75, -5.75, 9.5],
			"to": [8.25, -5.25, 10],
			"rotation": {"angle": 0, "axis": "x", "origin": [8, -3.75, 6]},
			"faces": {
				"north": {"uv": [7.25, 12.75, 7.5, 13], "texture": "#0"},
				"east": {"uv": [4.25, 12.75, 4.5, 13], "texture": "#0"},
				"south": {"uv": [8, 12.75, 8.25, 13], "texture": "#0"},
				"west": {"uv": [4.25, 12.75, 4.5, 13], "texture": "#0"},
				"up": {"uv": [4.25, 12.75, 4.5, 13], "texture": "#0"},
				"down": {"uv": [4.25, 12.75, 4.5, 13], "texture": "#0"}
			}
		},
		{
			"from": [7.75, -5.25, 8],
			"to": [8.25, -4.75, 9],
			"rotation": {"angle": 0, "axis": "x", "origin": [8, -3.75, 6]},
			"faces": {
				"north": {"uv": [7.25, 12.5, 7.5, 12.75], "texture": "#0"},
				"east": {"uv": [3.5, 12.5, 4, 12.75], "texture": "#0"},
				"south": {"uv": [8, 12.5, 8.25, 12.75], "texture": "#0"},
				"west": {"uv": [3.5, 12.5, 4, 12.75], "texture": "#0"},
				"up": {"uv": [3.75, 12.5, 4, 12.75], "texture": "#0"},
				"down": {"uv": [3.5, 12.5, 3.75, 12.75], "texture": "#0"}
			}
		},
		{
			"from": [7.75, -4.75, 7],
			"to": [8.25, -4.25, 8.5],
			"rotation": {"angle": 0, "axis": "x", "origin": [8, -3.75, 6]},
			"faces": {
				"north": {"uv": [7.25, 12.25, 7.5, 12.5], "texture": "#0"},
				"east": {"uv": [3.75, 12.25, 3, 12.5], "texture": "#0"},
				"south": {"uv": [8, 12.25, 8.25, 12.5], "texture": "#0"},
				"west": {"uv": [3, 12.25, 3.75, 12.5], "texture": "#0"},
				"up": {"uv": [3.5, 12.25, 3.75, 12.5], "texture": "#0"},
				"down": {"uv": [3, 12.25, 3.25, 12.5], "texture": "#0"}
			}
		},
		{
			"from": [7.75, -4.25, 6],
			"to": [8.25, -3.75, 8],
			"rotation": {"angle": 0, "axis": "x", "origin": [8, -3.75, 6]},
			"faces": {
				"north": {"uv": [7.25, 12, 7.5, 12.25], "texture": "#0"},
				"east": {"uv": [3.5, 12, 2.5, 12.25], "texture": "#0"},
				"south": {"uv": [8, 12, 8.25, 12.25], "texture": "#0"},
				"west": {"uv": [2.5, 12, 3.5, 12.25], "texture": "#0"},
				"up": {"uv": [3.25, 12, 3.5, 12.25], "texture": "#0"},
				"down": {"uv": [2.5, 12, 3, 12.25], "texture": "#0"}
			}
		}
	],
	"display": {
		"thirdperson_righthand": {
			"rotation": [1.25, 0.5, 8.5],
			"translation": [-0.5, -2, 0]
		},
		"thirdperson_lefthand": {
			"rotation": [1.25, 0.5, 8.5],
			"translation": [-0.5, -2, 0]
		},
		"firstperson_righthand": {
			"rotation": [11, 0, 0],
			"translation": [0, 5, 0]
		},
		"firstperson_lefthand": {
			"rotation": [11, 0, 0],
			"translation": [0, 5, 0]
		},
		"ground": {
			"rotation": [9, -7, -65],
			"translation": [0, 3.5, 0]
		},
		"gui": {
			"rotation": [30, 145, -60],
			"translation": [-1, -0.5, 0],
			"scale": [0.625, 0.625, 0.625]
		},
		"fixed": {
			"rotation": [0, -90, 0],
			"translation": [0, 0, -2.5],
			"scale": [1.875, 1.875, 1.875]
		}
	},
	"groups": [
		{
			"name": "corde",
			"origin": [15.25, 28, 19],
			"children": [0, 1, 2, 3]
		},
		{
			"name": "manche",
			"origin": [15.5, 19.75, 16.5],
			"children": [4, 5, 6, 7, 8, 9, 10, 11, 12, 13, 14, 15, 16, 17, 18, 19, 20, 21, 22, 23, 24, 25, 26, 27, 28, 29, 30, 31, 32, 33, 34, 35, 36, 37, 38, 39, 40, 41, 42, 43, 44, 45, 46,
				{
					"name": "group",
					"origin": [7.25, 8.25, 4.75],
					"children": [
						{
							"name": "group",
							"origin": [8, 8, 4.75],
							"children": [47, 48]
						}, 49, 50, 51, 52, 53, 54, 55, 56, 57, 58, 59, 60]
				}
			]
		},
		{
			"name": "top 2",
			"origin": [15.5, 26.25, 20.5],
			"children": [61, 62, 63, 64, 65, 66, 67]
		},
		{
			"name": "top 1",
			"origin": [15.5, 17.25, 14.5],
			"children": [68, 69, 70, 71, 72, 73]
		},
		{
			"name": "bottom 1",
			"origin": [15.5, 0.75, 15],
			"children": [74, 75, 76, 77, 78, 79]
		},
		{
			"name": "bottom 2",
			"origin": [15.5, -0.25, 16],
			"children": [80, 81, 82, 83, 84, 85, 86]
		}
	]
}