{
	"credit": "Made with Blockbench",
	"texture_size": [32, 32],
	"textures": {
		"0": "custom/casque/casquerouge/casquerouge",
		"particle": "custom/casque/casquerouge/casquerouge"
	},
	"elements": [
		{
			"from": [6, 17, 3],
			"to": [10, 18, 12],
			"faces": {
				"north": {"uv": [15, 0.5, 13, 1], "texture": "#0"},
				"east": {"uv": [14.5, 0.5, 15, 1], "texture": "#0"},
				"south": {"uv": [13, 0.5, 15, 1], "texture": "#0"},
				"west": {"uv": [13, 0.5, 13.5, 3], "texture": "#0"},
				"up": {"uv": [13, 0.5, 15, 3.5], "texture": "#0"},
				"down": {"uv": [0, 0, 0, 0], "texture": "#0"}
			}
		},
		{
			"from": [6, 14, 14],
			"to": [10, 15, 16],
			"faces": {
				"north": {"uv": [0, 0, 0, 0], "texture": "#0"},
				"east": {"uv": [6, 12, 6.5, 13], "texture": "#0"},
				"south": {"uv": [4.5, 12.5, 6.5, 13], "texture": "#0"},
				"west": {"uv": [4.5, 12, 5, 13], "texture": "#0"},
				"up": {"uv": [4.5, 12.5, 6.5, 13], "texture": "#0"},
				"down": {"uv": [4.5, 12.5, 6.5, 13], "texture": "#0"}
			}
		},
		{
			"from": [6, 10, 15],
			"to": [10, 14, 16],
			"faces": {
				"north": {"uv": [0, 0, 0, 0], "texture": "#0"},
				"east": {"uv": [0, 2, 1, 6], "texture": "#0"},
				"south": {"uv": [0, 0, 0, 0], "texture": "#0"},
				"west": {"uv": [15, 2, 16, 6], "texture": "#0"},
				"up": {"uv": [0, 0, 0, 0], "texture": "#0"},
				"down": {"uv": [10, 16, 6, 15], "texture": "#0"}
			}
		},
		{
			"from": [6, 5, 16],
			"to": [10, 14, 16.5],
			"faces": {
				"north": {"uv": [15, 3.5, 13, 7.5], "texture": "#0"},
				"east": {"uv": [14.5, 3.5, 15, 7.5], "texture": "#0"},
				"south": {"uv": [13, 3.5, 15, 7.5], "texture": "#0"},
				"west": {"uv": [13, 3.5, 13.5, 7.5], "texture": "#0"},
				"up": {"uv": [13, 0.5, 15, 1], "texture": "#0"},
				"down": {"uv": [13, 7, 15, 7.5], "texture": "#0"}
			}
		},
		{
			"from": [6.5, 6, 15],
			"to": [9.5, 9, 16],
			"faces": {
				"north": {"uv": [8.5, 4.5, 9, 6], "texture": "#0"},
				"east": {"uv": [8.5, 4.5, 9, 6], "texture": "#0"},
				"south": {"uv": [0, 0, 0, 0], "texture": "#0"},
				"west": {"uv": [8.5, 4.5, 9, 6], "texture": "#0"},
				"up": {"uv": [8.5, 4.5, 9, 5], "texture": "#0"},
				"down": {"uv": [8.5, 4.5, 9, 5], "texture": "#0"}
			}
		},
		{
			"from": [7, 4, 16.5],
			"to": [9, 14, 17],
			"faces": {
				"north": {"uv": [14.5, 3.5, 13.5, 8], "texture": "#0"},
				"east": {"uv": [14, 3.5, 14.5, 8], "texture": "#0"},
				"south": {"uv": [13.5, 3.5, 14.5, 8], "texture": "#0"},
				"west": {"uv": [13.5, 3.5, 14, 8], "texture": "#0"},
				"up": {"uv": [13.5, 0.5, 14.5, 1], "texture": "#0"},
				"down": {"uv": [13.5, 7.5, 14.5, 8], "texture": "#0"}
			}
		},
		{
			"from": [3, 10, 15],
			"to": [13, 11, 16],
			"faces": {
				"north": {"uv": [0, 0, 0, 0], "texture": "#0"},
				"east": {"uv": [2.5, 14, 3.5, 14.5], "texture": "#0"},
				"south": {"uv": [3, 14, 8, 14.5], "texture": "#0"},
				"west": {"uv": [2.5, 14, 3.5, 14.5], "texture": "#0"},
				"up": {"uv": [0, 0, 0, 0], "texture": "#0"},
				"down": {"uv": [3, 14, 8, 14.5], "texture": "#0"}
			}
		},
		{
			"from": [2, 10, 15],
			"to": [4, 11, 15.5],
			"faces": {
				"north": {"uv": [0, 0, 0, 0], "texture": "#0"},
				"east": {"uv": [2.5, 14, 3, 14.5], "texture": "#0"},
				"south": {"uv": [2.5, 14, 3.5, 14.5], "texture": "#0"},
				"west": {"uv": [2.5, 14, 3, 14.5], "texture": "#0"},
				"up": {"uv": [2.5, 14, 3.5, 14.5], "texture": "#0"},
				"down": {"uv": [2.5, 14, 3.5, 14.5], "texture": "#0"}
			}
		},
		{
			"from": [12, 10, 15],
			"to": [14, 11, 15.5],
			"faces": {
				"north": {"uv": [0, 0, 0, 0], "texture": "#0"},
				"east": {"uv": [8, 14, 8.5, 14.5], "texture": "#0"},
				"south": {"uv": [7.5, 14, 8.5, 14.5], "texture": "#0"},
				"west": {"uv": [7.5, 14, 8, 14.5], "texture": "#0"},
				"up": {"uv": [7.5, 14, 8.5, 14.5], "texture": "#0"},
				"down": {"uv": [7.5, 14, 8.5, 14.5], "texture": "#0"}
			}
		},
		{
			"from": [3, -3, 16],
			"to": [6, 1, 17],
			"faces": {
				"north": {"uv": [13.5, 10.5, 12, 12.5], "texture": "#0"},
				"east": {"uv": [13, 10.5, 13.5, 12.5], "texture": "#0"},
				"south": {"uv": [12, 10.5, 13.5, 12.5], "texture": "#0"},
				"west": {"uv": [12, 10.5, 12.5, 12.5], "texture": "#0"},
				"up": {"uv": [12, 10.5, 13.5, 11], "texture": "#0"},
				"down": {"uv": [12, 12, 13.5, 12.5], "texture": "#0"}
			}
		},
		{
			"from": [10, -3, 16],
			"to": [13, 1, 17],
			"faces": {
				"north": {"uv": [14, 14, 12.5, 16], "texture": "#0"},
				"east": {"uv": [13.5, 14, 14, 16], "texture": "#0"},
				"south": {"uv": [12.5, 14, 14, 16], "texture": "#0"},
				"west": {"uv": [12.5, 14, 13, 16], "texture": "#0"},
				"up": {"uv": [12.5, 14, 14, 14.5], "texture": "#0"},
				"down": {"uv": [12.5, 15.5, 14, 16], "texture": "#0"}
			}
		},
		{
			"from": [3, -2, 15],
			"to": [5, 2, 16],
			"faces": {
				"north": {"uv": [12, 10, 13, 12], "texture": "#0"},
				"east": {"uv": [12, 10, 12.5, 12], "texture": "#0"},
				"south": {"uv": [12, 10, 13, 12], "texture": "#0"},
				"west": {"uv": [0, 0, 0, 0], "texture": "#0"},
				"up": {"uv": [12, 10, 13, 10.5], "texture": "#0"},
				"down": {"uv": [12, 11, 13, 11.5], "texture": "#0"}
			}
		},
		{
			"from": [1, 14, 1],
			"to": [15, 15, 14],
			"faces": {
				"north": {"uv": [0, 0, 0, 0], "texture": "#0"},
				"east": {"uv": [1, 1, 7.5, 1.5], "texture": "#0"},
				"south": {"uv": [2, 11.5, 9, 12], "texture": "#0"},
				"west": {"uv": [1, 1, 7.5, 1.5], "texture": "#0"},
				"up": {"uv": [1, 1, 7.5, 1.5], "texture": "#0"},
				"down": {"uv": [1, 1, 7.5, 1.5], "texture": "#0"}
			}
		},
		{
			"from": [2, 10, 14],
			"to": [14, 14, 15],
			"faces": {
				"north": {"uv": [8.5, 12.5, 2.5, 14.5], "texture": "#0"},
				"east": {"uv": [8, 12.5, 8.5, 14.5], "texture": "#0"},
				"south": {"uv": [2.5, 12.5, 8.5, 14.5], "texture": "#0"},
				"west": {"uv": [2.5, 12.5, 3, 14.5], "texture": "#0"},
				"up": {"uv": [0, 0, 0, 0], "texture": "#0"},
				"down": {"uv": [2.5, 12.5, 8.5, 13], "texture": "#0"}
			}
		},
		{
			"from": [1, 0.5, 1],
			"to": [2, 14, 13],
			"faces": {
				"north": {"uv": [6.5, 4.5, 7, 6.5], "texture": "#0"},
				"east": {"uv": [6.5, 4.5, 7.5, 6.5], "texture": "#0"},
				"south": {"uv": [6.5, 4.5, 7, 6.5], "texture": "#0"},
				"west": {"uv": [6.5, 4.5, 7.5, 6.5], "texture": "#0"},
				"up": {"uv": [0, 0, 0, 0], "texture": "#0"},
				"down": {"uv": [6.5, 4.5, 7.5, 6.5], "texture": "#0"}
			}
		},
		{
			"from": [7, 12.5, 15],
			"to": [8, 13.5, 16],
			"faces": {
				"north": {"uv": [0, 0, 0, 0], "texture": "#0"},
				"east": {"uv": [0, 2.5, 1, 3.5], "texture": "#0"},
				"south": {"uv": [0, 0, 0, 0], "texture": "#0"},
				"west": {"uv": [15, 2.5, 16, 3.5], "texture": "#0"},
				"up": {"uv": [7, 15, 8, 16], "texture": "#0"},
				"down": {"uv": [9, 16, 8, 15], "texture": "#0"}
			}
		},
		{
			"from": [3, 9, 14.5],
			"to": [13, 10, 15.5],
			"faces": {
				"north": {"uv": [3, 14.5, 8, 15], "texture": "#0"},
				"east": {"uv": [9.5, 13.5, 10.5, 14.5], "texture": "#0"},
				"south": {"uv": [3, 14.5, 8, 15], "texture": "#0"},
				"west": {"uv": [9.5, 13.5, 10.5, 14.5], "texture": "#0"},
				"up": {"uv": [3, 14.5, 4.5, 15], "texture": "#0"},
				"down": {"uv": [3, 14.5, 4.5, 15], "texture": "#0"}
			}
		},
		{
			"from": [3, 11, 15],
			"to": [13, 14, 16],
			"faces": {
				"north": {"uv": [0, 0, 0, 0], "texture": "#0"},
				"east": {"uv": [2.5, 12.5, 3, 14], "texture": "#0"},
				"south": {"uv": [3, 12.5, 8, 14], "texture": "#0"},
				"west": {"uv": [2.5, 12.5, 3, 14], "texture": "#0"},
				"up": {"uv": [3, 12.5, 8, 13], "texture": "#0"},
				"down": {"uv": [0, 0, 0, 0], "texture": "#0"}
			}
		},
		{
			"from": [1, 15, 2],
			"to": [15, 16, 12.5],
			"faces": {
				"north": {"uv": [1, 1, 7.5, 1.5], "texture": "#0"},
				"east": {"uv": [1, 1, 7.5, 1.5], "texture": "#0"},
				"south": {"uv": [1, 1, 7.5, 1.5], "texture": "#0"},
				"west": {"uv": [1, 1, 7.5, 1.5], "texture": "#0"},
				"up": {"uv": [1, 1, 7.5, 1.5], "texture": "#0"},
				"down": {"uv": [0, 0, 0, 0], "texture": "#0"}
			}
		},
		{
			"from": [2, 16, 3],
			"to": [14, 17, 10],
			"faces": {
				"north": {"uv": [1, 1, 7.5, 1.5], "texture": "#0"},
				"east": {"uv": [1, 1, 7.5, 1.5], "texture": "#0"},
				"south": {"uv": [1, 1, 7.5, 1.5], "texture": "#0"},
				"west": {"uv": [1, 1, 7.5, 1.5], "texture": "#0"},
				"up": {"uv": [2, 0.5, 6.5, 1.5], "texture": "#0"},
				"down": {"uv": [0, 0, 0, 0], "texture": "#0"}
			}
		},
		{
			"from": [3.5, 16, 2],
			"to": [12.5, 17, 12],
			"faces": {
				"north": {"uv": [2, 0.5, 6.5, 1], "texture": "#0"},
				"east": {"uv": [2, 0.5, 6.5, 1], "texture": "#0"},
				"south": {"uv": [2, 0.5, 6.5, 1], "texture": "#0"},
				"west": {"uv": [2, 0.5, 6.5, 1], "texture": "#0"},
				"up": {"uv": [2, 0.5, 6.5, 1], "texture": "#0"},
				"down": {"uv": [0, 0, 0, 0], "texture": "#0"}
			}
		},
		{
			"from": [2, 15, 0],
			"to": [14, 16, 14],
			"faces": {
				"north": {"uv": [1, 1, 7.5, 1.5], "texture": "#0"},
				"east": {"uv": [1, 1, 7.5, 1.5], "texture": "#0"},
				"south": {"uv": [1, 1, 7.5, 1.5], "texture": "#0"},
				"west": {"uv": [1, 1, 7.5, 1.5], "texture": "#0"},
				"up": {"uv": [1, 1, 7.5, 1.5], "texture": "#0"},
				"down": {"uv": [1, 1, 7.5, 1.5], "texture": "#0"}
			}
		},
		{
			"from": [15, 15, 3],
			"to": [16, 16, 10],
			"faces": {
				"north": {"uv": [2, 0.5, 3, 1.5], "texture": "#0"},
				"east": {"uv": [2, 0.5, 6.5, 1.5], "texture": "#0"},
				"south": {"uv": [2, 0.5, 3, 1.5], "texture": "#0"},
				"west": {"uv": [0, 0, 0, 0], "texture": "#0"},
				"up": {"uv": [2, 0.5, 3, 1.5], "texture": "#0"},
				"down": {"uv": [0, 0, 0, 0], "texture": "#0"}
			}
		},
		{
			"from": [5, 9, 15.5],
			"to": [11, 10, 16],
			"faces": {
				"north": {"uv": [0, 0, 0, 0], "texture": "#0"},
				"east": {"uv": [9.5, 13.5, 10.5, 14.5], "texture": "#0"},
				"south": {"uv": [4, 14.5, 7, 15], "texture": "#0"},
				"west": {"uv": [9.5, 13.5, 10.5, 14.5], "texture": "#0"},
				"up": {"uv": [0, 0, 0, 0], "texture": "#0"},
				"down": {"uv": [6.5, 14.5, 8, 15], "texture": "#0"}
			}
		},
		{
			"from": [2, -2, 15],
			"to": [3, 3, 16],
			"faces": {
				"north": {"uv": [11.5, 9.5, 12, 12], "texture": "#0"},
				"east": {"uv": [11.5, 9.5, 12, 12], "texture": "#0"},
				"south": {"uv": [11.5, 9.5, 12, 12], "texture": "#0"},
				"west": {"uv": [11.5, 9.5, 12, 12], "texture": "#0"},
				"up": {"uv": [11.5, 9.5, 12, 10], "texture": "#0"},
				"down": {"uv": [11.5, 11.5, 12, 12], "texture": "#0"}
			}
		},
		{
			"from": [1, -2, 14],
			"to": [2, 3, 15],
			"faces": {
				"north": {"uv": [14, 13, 14.5, 15.5], "texture": "#0"},
				"east": {"uv": [14, 13, 14.5, 15.5], "texture": "#0"},
				"south": {"uv": [14, 13, 14.5, 15.5], "texture": "#0"},
				"west": {"uv": [14, 13, 14.5, 15.5], "texture": "#0"},
				"up": {"uv": [14, 13, 14.5, 13.5], "texture": "#0"},
				"down": {"uv": [14, 15, 14.5, 15.5], "texture": "#0"}
			}
		},
		{
			"from": [2, 6, 1],
			"to": [14, 14, 2],
			"faces": {
				"north": {"uv": [2, 5.5, 6, 9], "texture": "#0"},
				"east": {"uv": [0, 0, 0, 0], "texture": "#0"},
				"south": {"uv": [2, 5.5, 6, 9], "texture": "#0"},
				"west": {"uv": [0, 0, 0, 0], "texture": "#0"},
				"up": {"uv": [0, 0, 0, 0], "texture": "#0"},
				"down": {"uv": [1.5, 6.5, 6.5, 8], "texture": "#0"}
			}
		},
		{
			"from": [2, 5, 1],
			"to": [5, 6, 2],
			"faces": {
				"north": {"uv": [2, 6.5, 5, 7.5], "texture": "#0"},
				"east": {"uv": [3, 7, 4, 8], "texture": "#0"},
				"south": {"uv": [2, 6.5, 5, 7.5], "texture": "#0"},
				"west": {"uv": [0, 0, 0, 0], "texture": "#0"},
				"up": {"uv": [0, 0, 0, 0], "texture": "#0"},
				"down": {"uv": [1.5, 6.5, 4.5, 7.5], "texture": "#0"}
			}
		},
		{
			"from": [2, 4, 1],
			"to": [3, 5, 2],
			"faces": {
				"north": {"uv": [5, 6.5, 6, 7.5], "texture": "#0"},
				"east": {"uv": [2, 7, 3, 8], "texture": "#0"},
				"south": {"uv": [5, 6.5, 6, 7.5], "texture": "#0"},
				"west": {"uv": [0, 0, 0, 0], "texture": "#0"},
				"up": {"uv": [0, 0, 0, 0], "texture": "#0"},
				"down": {"uv": [4, 8.5, 5, 9.5], "texture": "#0"}
			}
		},
		{
			"from": [1, -1, 11],
			"to": [2, 0, 14],
			"faces": {
				"north": {"uv": [4.5, 8, 5.5, 8.5], "texture": "#0"},
				"east": {"uv": [3, 8, 6, 8.5], "texture": "#0"},
				"south": {"uv": [0, 0, 0, 0], "texture": "#0"},
				"west": {"uv": [3, 8, 6, 8.5], "texture": "#0"},
				"up": {"uv": [4, 6, 5, 9], "texture": "#0"},
				"down": {"uv": [4, 6, 5, 9], "texture": "#0"}
			}
		},
		{
			"from": [0, 0, 1],
			"to": [1, 1, 13],
			"faces": {
				"north": {"uv": [2, 8.5, 3, 9.5], "texture": "#0"},
				"east": {"uv": [2, 8.5, 9.5, 9.5], "texture": "#0"},
				"south": {"uv": [2, 8.5, 3, 9.5], "texture": "#0"},
				"west": {"uv": [2, 8.5, 9.5, 9.5], "texture": "#0"},
				"up": {"uv": [0, 0, 0, 0], "texture": "#0"},
				"down": {"uv": [2, 8.5, 3, 9.5], "texture": "#0"}
			}
		},
		{
			"from": [0, -1, 2],
			"to": [1, 0, 11],
			"faces": {
				"north": {"uv": [1, 6.5, 2, 7], "texture": "#0"},
				"east": {"uv": [0.5, 7.5, 7, 8], "texture": "#0"},
				"south": {"uv": [1, 6.5, 2, 7], "texture": "#0"},
				"west": {"uv": [0.5, 7.5, 7, 8], "texture": "#0"},
				"up": {"uv": [0, 0, 0, 0], "texture": "#0"},
				"down": {"uv": [2.5, 5.5, 3.5, 9], "texture": "#0"}
			}
		},
		{
			"from": [14, -1, 11],
			"to": [15, 0, 14],
			"faces": {
				"north": {"uv": [2.5, 7, 3.5, 7.5], "texture": "#0"},
				"east": {"uv": [2.5, 7, 5.5, 7.5], "texture": "#0"},
				"south": {"uv": [0, 0, 0, 0], "texture": "#0"},
				"west": {"uv": [2.5, 7, 5.5, 7.5], "texture": "#0"},
				"up": {"uv": [4.5, 5.5, 5.5, 8.5], "texture": "#0"},
				"down": {"uv": [4.5, 5.5, 5.5, 8.5], "texture": "#0"}
			}
		},
		{
			"from": [1, 0, 13],
			"to": [2, 5, 14],
			"faces": {
				"north": {"uv": [11, 8, 11.5, 9.5], "texture": "#0"},
				"east": {"uv": [11, 8, 11.5, 9.5], "texture": "#0"},
				"south": {"uv": [11, 8, 11.5, 9.5], "texture": "#0"},
				"west": {"uv": [11, 8, 11.5, 9.5], "texture": "#0"},
				"up": {"uv": [11, 8, 11.5, 9], "texture": "#0"},
				"down": {"uv": [0, 0, 0, 0], "texture": "#0"}
			}
		},
		{
			"from": [1, 7, 0],
			"to": [15, 15, 1],
			"faces": {
				"north": {"uv": [0.5, 1.5, 1, 8], "texture": "#0"},
				"east": {"uv": [0.5, 1.5, 1, 8], "texture": "#0"},
				"south": {"uv": [0.5, 1.5, 1, 8], "texture": "#0"},
				"west": {"uv": [0.5, 1.5, 1, 8], "texture": "#0"},
				"up": {"uv": [0.5, 6.5, 7, 7.5], "texture": "#0"},
				"down": {"uv": [0.5, 6.5, 7, 7.5], "texture": "#0"}
			}
		},
		{
			"from": [2, 6, 0],
			"to": [5, 7, 1],
			"faces": {
				"north": {"uv": [2.5, 6.5, 5.5, 7.5], "texture": "#0"},
				"east": {"uv": [3, 7, 4, 8], "texture": "#0"},
				"south": {"uv": [0, 0, 0, 0], "texture": "#0"},
				"west": {"uv": [0, 0, 0, 0], "texture": "#0"},
				"up": {"uv": [0, 0, 0, 0], "texture": "#0"},
				"down": {"uv": [1.5, 7, 4.5, 8], "texture": "#0"}
			}
		},
		{
			"from": [13, 5, 0],
			"to": [14, 6, 1],
			"faces": {
				"north": {"uv": [4.5, 6.5, 5.5, 7.5], "texture": "#0"},
				"east": {"uv": [0, 0, 0, 0], "texture": "#0"},
				"south": {"uv": [0, 0, 0, 0], "texture": "#0"},
				"west": {"uv": [3, 6, 4, 7], "texture": "#0"},
				"up": {"uv": [0, 0, 0, 0], "texture": "#0"},
				"down": {"uv": [2.5, 7, 3.5, 8], "texture": "#0"}
			}
		},
		{
			"from": [1, 4, 0],
			"to": [2, 7, 1],
			"faces": {
				"north": {"uv": [3.5, 6, 4.5, 9], "texture": "#0"},
				"east": {"uv": [4.5, 5, 5.5, 8], "texture": "#0"},
				"south": {"uv": [0, 0, 0, 0], "texture": "#0"},
				"west": {"uv": [4.5, 5, 5.5, 8], "texture": "#0"},
				"up": {"uv": [0, 0, 0, 0], "texture": "#0"},
				"down": {"uv": [3, 6, 4, 7], "texture": "#0"}
			}
		},
		{
			"from": [2, 8, -1],
			"to": [14, 14, 0],
			"faces": {
				"north": {"uv": [0, 2.5, 0.5, 5.5], "texture": "#0"},
				"east": {"uv": [0, 2.5, 0.5, 5.5], "texture": "#0"},
				"south": {"uv": [0, 0, 0, 0], "texture": "#0"},
				"west": {"uv": [0, 2.5, 0.5, 5.5], "texture": "#0"},
				"up": {"uv": [0.5, 6.5, 7, 7], "texture": "#0"},
				"down": {"uv": [0.5, 6.5, 7, 7], "texture": "#0"}
			}
		},
		{
			"from": [3, 14, -1],
			"to": [13, 15, 0],
			"faces": {
				"north": {"uv": [0, 2, 0.5, 3.5], "texture": "#0"},
				"east": {"uv": [0, 2, 0.5, 3], "texture": "#0"},
				"south": {"uv": [0, 0, 0, 0], "texture": "#0"},
				"west": {"uv": [0, 2, 0.5, 3], "texture": "#0"},
				"up": {"uv": [0, 2, 0.5, 2.5], "texture": "#0"},
				"down": {"uv": [0, 0, 0, 0], "texture": "#0"}
			}
		},
		{
			"from": [2, 6, -1],
			"to": [3, 8, 0],
			"faces": {
				"north": {"uv": [3, 6, 4, 8], "texture": "#0"},
				"east": {"uv": [2, 5.5, 2.5, 7.5], "texture": "#0"},
				"south": {"uv": [3, 6, 4, 8], "texture": "#0"},
				"west": {"uv": [2, 5.5, 2.5, 7.5], "texture": "#0"},
				"up": {"uv": [0, 0, 0, 0], "texture": "#0"},
				"down": {"uv": [3, 7, 4, 7.5], "texture": "#0"}
			}
		},
		{
			"from": [12, 7, -1],
			"to": [13, 8, 0],
			"faces": {
				"north": {"uv": [3, 7, 4, 8], "texture": "#0"},
				"east": {"uv": [0, 0, 0, 0], "texture": "#0"},
				"south": {"uv": [0, 0, 0, 0], "texture": "#0"},
				"west": {"uv": [2.5, 6.5, 3, 7.5], "texture": "#0"},
				"up": {"uv": [0, 0, 0, 0], "texture": "#0"},
				"down": {"uv": [3.5, 7.5, 4.5, 8], "texture": "#0"}
			}
		},
		{
			"from": [4, 10, -2],
			"to": [5, 13, -1],
			"faces": {
				"north": {"uv": [1.5, 5.5, 6.5, 8.5], "texture": "#0"},
				"east": {"uv": [0, 0, 0, 0], "texture": "#0"},
				"south": {"uv": [0, 0, 0, 0], "texture": "#0"},
				"west": {"uv": [0.5, 3, 1, 6], "texture": "#0"},
				"up": {"uv": [0, 6, 6, 6.5], "texture": "#0"},
				"down": {"uv": [0, 6, 6, 6.5], "texture": "#0"}
			}
		},
		{
			"from": [5, 9, -2],
			"to": [11, 14, -1],
			"faces": {
				"north": {"uv": [0, 2, 0.5, 4.5], "texture": "#0"},
				"east": {"uv": [0, 2, 0.5, 4.5], "texture": "#0"},
				"south": {"uv": [0, 0, 0, 0], "texture": "#0"},
				"west": {"uv": [0, 2, 0.5, 4.5], "texture": "#0"},
				"up": {"uv": [0, 6, 6, 6.5], "texture": "#0"},
				"down": {"uv": [0, 6, 6, 6.5], "texture": "#0"}
			}
		},
		{
			"from": [1, 10, 13],
			"to": [2, 14, 14],
			"faces": {
				"north": {"uv": [0, 0, 0, 0], "texture": "#0"},
				"east": {"uv": [8.5, 11.5, 9, 13.5], "texture": "#0"},
				"south": {"uv": [8.5, 11.5, 9, 13.5], "texture": "#0"},
				"west": {"uv": [8.5, 11.5, 9, 13.5], "texture": "#0"},
				"up": {"uv": [0, 0, 0, 0], "texture": "#0"},
				"down": {"uv": [8.5, 13, 9, 14], "texture": "#0"}
			}
		},
		{
			"from": [6, 15, 13],
			"to": [10, 16, 15],
			"faces": {
				"north": {"uv": [4.5, 12.5, 6.5, 13], "texture": "#0"},
				"east": {"uv": [6, 12, 6.5, 13], "texture": "#0"},
				"south": {"uv": [4.5, 12.5, 6.5, 13], "texture": "#0"},
				"west": {"uv": [4.5, 12, 5, 13], "texture": "#0"},
				"up": {"uv": [4.5, 12.5, 6.5, 13], "texture": "#0"},
				"down": {"uv": [4.5, 12.5, 6.5, 13], "texture": "#0"}
			}
		},
		{
			"from": [6, 16, 12],
			"to": [10, 17, 14],
			"faces": {
				"north": {"uv": [0, 0, 0, 0], "texture": "#0"},
				"east": {"uv": [6, 12, 6.5, 13], "texture": "#0"},
				"south": {"uv": [4.5, 12.5, 6.5, 13], "texture": "#0"},
				"west": {"uv": [4.5, 12, 5, 13], "texture": "#0"},
				"up": {"uv": [4.5, 12.5, 6.5, 13], "texture": "#0"},
				"down": {"uv": [0, 0, 0, 0], "texture": "#0"}
			}
		},
		{
			"from": [11, -2, 15],
			"to": [13, 2, 16],
			"faces": {
				"north": {"uv": [12, 10, 13, 12], "texture": "#0"},
				"east": {"uv": [0, 0, 0, 0], "texture": "#0"},
				"south": {"uv": [12, 10, 13, 12], "texture": "#0"},
				"west": {"uv": [12, 10, 12.5, 12], "texture": "#0"},
				"up": {"uv": [12, 10, 13, 10.5], "texture": "#0"},
				"down": {"uv": [12, 11, 13, 11.5], "texture": "#0"}
			}
		},
		{
			"from": [0, 15, 3],
			"to": [1, 16, 10],
			"faces": {
				"north": {"uv": [2, 0.5, 3, 1.5], "texture": "#0"},
				"east": {"uv": [0, 0, 0, 0], "texture": "#0"},
				"south": {"uv": [2, 0.5, 3, 1.5], "texture": "#0"},
				"west": {"uv": [2, 0.5, 6.5, 1.5], "texture": "#0"},
				"up": {"uv": [2, 0.5, 3, 1.5], "texture": "#0"},
				"down": {"uv": [0, 0, 0, 0], "texture": "#0"}
			}
		},
		{
			"from": [14, 0.5, 1],
			"to": [15, 14, 13],
			"faces": {
				"north": {"uv": [6.5, 4.5, 7, 6.5], "texture": "#0"},
				"east": {"uv": [6.5, 4.5, 7.5, 6.5], "texture": "#0"},
				"south": {"uv": [6.5, 4.5, 7, 6.5], "texture": "#0"},
				"west": {"uv": [6.5, 4.5, 7.5, 6.5], "texture": "#0"},
				"up": {"uv": [0, 0, 0, 0], "texture": "#0"},
				"down": {"uv": [6.5, 4.5, 7.5, 6.5], "texture": "#0"}
			}
		},
		{
			"from": [2, 14, 14],
			"to": [14, 15, 15],
			"faces": {
				"north": {"uv": [0, 0, 0, 0], "texture": "#0"},
				"east": {"uv": [1, 1, 7.5, 1.5], "texture": "#0"},
				"south": {"uv": [2.5, 11.5, 8.5, 12], "texture": "#0"},
				"west": {"uv": [1, 1, 7.5, 1.5], "texture": "#0"},
				"up": {"uv": [1, 1, 7.5, 1.5], "texture": "#0"},
				"down": {"uv": [0, 0, 0, 0], "texture": "#0"}
			}
		},
		{
			"from": [14, 0, 13],
			"to": [15, 5, 14],
			"faces": {
				"north": {"uv": [11, 8, 11.5, 9.5], "texture": "#0"},
				"east": {"uv": [11, 8, 11.5, 9.5], "texture": "#0"},
				"south": {"uv": [11, 8, 11.5, 9.5], "texture": "#0"},
				"west": {"uv": [11, 8, 11.5, 9.5], "texture": "#0"},
				"up": {"uv": [11, 8, 11.5, 9], "texture": "#0"},
				"down": {"uv": [0, 0, 0, 0], "texture": "#0"}
			}
		},
		{
			"from": [14, -2, 14],
			"to": [15, 3, 15],
			"faces": {
				"north": {"uv": [14, 13, 14.5, 15.5], "texture": "#0"},
				"east": {"uv": [14, 13, 14.5, 15.5], "texture": "#0"},
				"south": {"uv": [14, 13, 14.5, 15.5], "texture": "#0"},
				"west": {"uv": [14, 13, 14.5, 15.5], "texture": "#0"},
				"up": {"uv": [14, 13, 14.5, 13.5], "texture": "#0"},
				"down": {"uv": [14, 15, 14.5, 15.5], "texture": "#0"}
			}
		},
		{
			"from": [13, -2, 15],
			"to": [14, 3, 16],
			"faces": {
				"north": {"uv": [11.5, 9.5, 12, 12], "texture": "#0"},
				"east": {"uv": [11.5, 9.5, 12, 12], "texture": "#0"},
				"south": {"uv": [11.5, 9.5, 12, 12], "texture": "#0"},
				"west": {"uv": [11.5, 9.5, 12, 12], "texture": "#0"},
				"up": {"uv": [11.5, 9.5, 12, 10], "texture": "#0"},
				"down": {"uv": [11.5, 11.5, 12, 12], "texture": "#0"}
			}
		},
		{
			"from": [11, 5, 1],
			"to": [14, 6, 2],
			"faces": {
				"north": {"uv": [2, 6.5, 5, 7.5], "texture": "#0"},
				"east": {"uv": [0, 0, 0, 0], "texture": "#0"},
				"south": {"uv": [2, 6.5, 5, 7.5], "texture": "#0"},
				"west": {"uv": [3, 7, 4, 8], "texture": "#0"},
				"up": {"uv": [0, 0, 0, 0], "texture": "#0"},
				"down": {"uv": [1.5, 6.5, 4.5, 7.5], "texture": "#0"}
			}
		},
		{
			"from": [11, 6, 0],
			"to": [14, 7, 1],
			"faces": {
				"north": {"uv": [2.5, 6.5, 5.5, 7.5], "texture": "#0"},
				"east": {"uv": [0, 0, 0, 0], "texture": "#0"},
				"south": {"uv": [0, 0, 0, 0], "texture": "#0"},
				"west": {"uv": [3, 7, 4, 8], "texture": "#0"},
				"up": {"uv": [0, 0, 0, 0], "texture": "#0"},
				"down": {"uv": [1.5, 7, 4.5, 8], "texture": "#0"}
			}
		},
		{
			"from": [13, 4, 1],
			"to": [14, 5, 2],
			"faces": {
				"north": {"uv": [5, 6.5, 6, 7.5], "texture": "#0"},
				"east": {"uv": [0, 0, 0, 0], "texture": "#0"},
				"south": {"uv": [5, 6.5, 6, 7.5], "texture": "#0"},
				"west": {"uv": [2, 7, 3, 8], "texture": "#0"},
				"up": {"uv": [0, 0, 0, 0], "texture": "#0"},
				"down": {"uv": [4, 8.5, 5, 9.5], "texture": "#0"}
			}
		},
		{
			"from": [13, 6, -1],
			"to": [14, 8, 0],
			"faces": {
				"north": {"uv": [3, 6, 4, 8], "texture": "#0"},
				"east": {"uv": [2, 5.5, 2.5, 7.5], "texture": "#0"},
				"south": {"uv": [3, 6, 4, 8], "texture": "#0"},
				"west": {"uv": [2, 5.5, 2.5, 7.5], "texture": "#0"},
				"up": {"uv": [0, 0, 0, 0], "texture": "#0"},
				"down": {"uv": [3, 7, 4, 7.5], "texture": "#0"}
			}
		},
		{
			"from": [3, 7, -1],
			"to": [4, 8, 0],
			"faces": {
				"north": {"uv": [3, 7, 4, 8], "texture": "#0"},
				"east": {"uv": [2.5, 6.5, 3, 7.5], "texture": "#0"},
				"south": {"uv": [0, 0, 0, 0], "texture": "#0"},
				"west": {"uv": [0, 0, 0, 0], "texture": "#0"},
				"up": {"uv": [0, 0, 0, 0], "texture": "#0"},
				"down": {"uv": [3.5, 7.5, 4.5, 8], "texture": "#0"}
			}
		},
		{
			"from": [14, 4, 0],
			"to": [15, 7, 1],
			"faces": {
				"north": {"uv": [3.5, 6, 4.5, 9], "texture": "#0"},
				"east": {"uv": [4.5, 5, 5.5, 8], "texture": "#0"},
				"south": {"uv": [0, 0, 0, 0], "texture": "#0"},
				"west": {"uv": [4.5, 5, 5.5, 8], "texture": "#0"},
				"up": {"uv": [0, 0, 0, 0], "texture": "#0"},
				"down": {"uv": [3, 6, 4, 7], "texture": "#0"}
			}
		},
		{
			"from": [15, 1, 1],
			"to": [16, 15, 13],
			"faces": {
				"north": {"uv": [1.5, 1.5, 2, 8.5], "texture": "#0"},
				"east": {"uv": [7.5, 1.5, 1.5, 8.5], "texture": "#0"},
				"south": {"uv": [7, 1.5, 7.5, 8.5], "texture": "#0"},
				"west": {"uv": [1.5, 1.5, 7.5, 8.5], "texture": "#0"},
				"up": {"uv": [1.5, 1, 7.5, 1.5], "texture": "#0"},
				"down": {"uv": [0, 0, 0, 0], "texture": "#0"}
			}
		},
		{
			"from": [15, 0, 1],
			"to": [16, 1, 13],
			"faces": {
				"north": {"uv": [2, 8.5, 3, 9.5], "texture": "#0"},
				"east": {"uv": [2, 8.5, 9.5, 9.5], "texture": "#0"},
				"south": {"uv": [2, 8.5, 3, 9.5], "texture": "#0"},
				"west": {"uv": [2, 8.5, 9.5, 9.5], "texture": "#0"},
				"up": {"uv": [0, 0, 0, 0], "texture": "#0"},
				"down": {"uv": [2, 8.5, 3, 9.5], "texture": "#0"}
			}
		},
		{
			"from": [15, -1, 2],
			"to": [16, 0, 11],
			"faces": {
				"north": {"uv": [1, 6.5, 2, 7], "texture": "#0"},
				"east": {"uv": [0.5, 7.5, 7, 8], "texture": "#0"},
				"south": {"uv": [1, 6.5, 2, 7], "texture": "#0"},
				"west": {"uv": [0.5, 7.5, 7, 8], "texture": "#0"},
				"up": {"uv": [0, 0, 0, 0], "texture": "#0"},
				"down": {"uv": [2.5, 5.5, 3.5, 9], "texture": "#0"}
			}
		},
		{
			"from": [11, 10, -2],
			"to": [12, 13, -1],
			"faces": {
				"north": {"uv": [1.5, 5.5, 6.5, 8.5], "texture": "#0"},
				"east": {"uv": [0.5, 3, 1, 6], "texture": "#0"},
				"south": {"uv": [0, 0, 0, 0], "texture": "#0"},
				"west": {"uv": [0, 0, 0, 0], "texture": "#0"},
				"up": {"uv": [0, 6, 6, 6.5], "texture": "#0"},
				"down": {"uv": [0, 6, 6, 6.5], "texture": "#0"}
			}
		},
		{
			"from": [14, 10, 13],
			"to": [15, 14, 14],
			"faces": {
				"north": {"uv": [0, 0, 0, 0], "texture": "#0"},
				"east": {"uv": [8.5, 11.5, 9, 13.5], "texture": "#0"},
				"south": {"uv": [8.5, 11.5, 9, 13.5], "texture": "#0"},
				"west": {"uv": [8.5, 11.5, 9, 13.5], "texture": "#0"},
				"up": {"uv": [0, 0, 0, 0], "texture": "#0"},
				"down": {"uv": [8.5, 13, 9, 14], "texture": "#0"}
			}
		},
		{
			"from": [0, 1, 1],
			"to": [1, 15, 13],
			"faces": {
				"north": {"uv": [1.5, 1.5, 2, 8.5], "texture": "#0"},
				"east": {"uv": [7.5, 1.5, 1.5, 8.5], "texture": "#0"},
				"south": {"uv": [7, 1.5, 7.5, 8.5], "texture": "#0"},
				"west": {"uv": [1.5, 1.5, 7.5, 8.5], "texture": "#0"},
				"up": {"uv": [1.5, 1, 7.5, 1.5], "texture": "#0"},
				"down": {"uv": [0, 0, 0, 0], "texture": "#0"}
			}
		},
		{
			"from": [-1, 2, 2],
			"to": [0, 14, 12],
			"faces": {
				"north": {"uv": [2, 2, 2.5, 8], "texture": "#0"},
				"east": {"uv": [0, 0, 0, 0], "texture": "#0"},
				"south": {"uv": [7, 2, 7.5, 8], "texture": "#0"},
				"west": {"uv": [2, 2, 7, 8], "texture": "#0"},
				"up": {"uv": [2, 2, 7, 2.5], "rotation": 90, "texture": "#0"},
				"down": {"uv": [2, 7.5, 7.5, 8], "texture": "#0"}
			}
		},
		{
			"from": [-2, 8, 3],
			"to": [-1, 14, 6],
			"faces": {
				"north": {"uv": [1, 3, 2, 9], "texture": "#0"},
				"east": {"uv": [0, 0, 0, 0], "texture": "#0"},
				"south": {"uv": [1, 3, 2, 9], "texture": "#0"},
				"west": {"uv": [1, 3, 2, 9], "texture": "#0"},
				"up": {"uv": [1, 3, 2, 5], "texture": "#0"},
				"down": {"uv": [1, 7, 2, 9], "texture": "#0"}
			}
		},
		{
			"from": [-2, 9, 6],
			"to": [-1, 13, 7],
			"faces": {
				"north": {"uv": [0, 0, 0, 0], "texture": "#0"},
				"east": {"uv": [0, 0, 0, 0], "texture": "#0"},
				"south": {"uv": [1, 4, 2, 8], "texture": "#0"},
				"west": {"uv": [1, 4, 2, 8], "texture": "#0"},
				"up": {"uv": [1, 3, 2, 5], "texture": "#0"},
				"down": {"uv": [12, 9, 13, 11], "texture": "#0"}
			}
		},
		{
			"from": [-3, 9, 3],
			"to": [-2, 14, 6],
			"faces": {
				"north": {"uv": [2, 3, 3, 8], "texture": "#0"},
				"east": {"uv": [0, 0, 0, 0], "texture": "#0"},
				"south": {"uv": [2, 3, 3, 8], "texture": "#0"},
				"west": {"uv": [2, 3, 3, 8], "texture": "#0"},
				"up": {"uv": [2, 3, 3, 5], "texture": "#0"},
				"down": {"uv": [1, 7, 2, 9], "texture": "#0"}
			}
		},
		{
			"from": [-4, 9, 2.5],
			"to": [-3, 14, 5],
			"faces": {
				"north": {"uv": [3, 3, 4, 8], "texture": "#0"},
				"east": {"uv": [3, 3, 4, 8], "texture": "#0"},
				"south": {"uv": [3, 3, 4, 8], "texture": "#0"},
				"west": {"uv": [3, 3, 4, 8], "texture": "#0"},
				"up": {"uv": [3, 3, 4, 5], "texture": "#0"},
				"down": {"uv": [1, 7, 2, 9], "texture": "#0"}
			}
		},
		{
			"from": [-5, 10, 2],
			"to": [-4, 15, 4.5],
			"faces": {
				"north": {"uv": [4, 2, 5, 7], "texture": "#0"},
				"east": {"uv": [4, 2, 5, 7], "texture": "#0"},
				"south": {"uv": [4, 2, 5, 7], "texture": "#0"},
				"west": {"uv": [5, 2, 4, 7], "texture": "#0"},
				"up": {"uv": [4, 2, 5, 4], "texture": "#0"},
				"down": {"uv": [4, 6, 5, 7], "texture": "#0"}
			}
		},
		{
			"from": [-6, 11, 2],
			"to": [-5, 16, 4],
			"faces": {
				"north": {"uv": [5, 1, 6, 6], "texture": "#0"},
				"east": {"uv": [5, 1, 6, 6], "texture": "#0"},
				"south": {"uv": [5, 1, 6, 6], "texture": "#0"},
				"west": {"uv": [5, 1, 6, 6], "texture": "#0"},
				"up": {"uv": [9, 2, 10, 3], "texture": "#0"},
				"down": {"uv": [9, 6, 10, 7], "texture": "#0"}
			}
		},
		{
			"from": [-7, 13, 2.5],
			"to": [-6, 17, 3.5],
			"faces": {
				"north": {"uv": [6, 0, 7, 4], "texture": "#0"},
				"east": {"uv": [6, 0, 7, 4], "texture": "#0"},
				"south": {"uv": [6, 0, 7, 4], "texture": "#0"},
				"west": {"uv": [6, 0, 7, 4], "texture": "#0"},
				"up": {"uv": [10, 1, 11, 3], "texture": "#0"},
				"down": {"uv": [6, 2, 7, 4], "texture": "#0"}
			}
		},
		{
			"from": [-2, 9, 2],
			"to": [-1, 13, 3],
			"faces": {
				"north": {"uv": [1, 4, 2, 8], "texture": "#0"},
				"east": {"uv": [0, 0, 0, 0], "texture": "#0"},
				"south": {"uv": [0, 0, 0, 0], "texture": "#0"},
				"west": {"uv": [1, 4, 2, 8], "texture": "#0"},
				"up": {"uv": [1, 3, 2, 5], "texture": "#0"},
				"down": {"uv": [12, 9, 13, 11], "texture": "#0"}
			}
		},
		{
			"from": [17, 9, 5.5],
			"to": [18, 13, 6.5],
			"faces": {
				"north": {"uv": [1, 4, 2, 8], "texture": "#0"},
				"east": {"uv": [1, 4, 2, 8], "texture": "#0"},
				"south": {"uv": [1, 4, 2, 8], "texture": "#0"},
				"west": {"uv": [0, 0, 0, 0], "texture": "#0"},
				"up": {"uv": [1, 3, 2, 5], "texture": "#0"},
				"down": {"uv": [12, 9, 13, 11], "texture": "#0"}
			}
		},
		{
			"from": [17, 9, 2],
			"to": [18, 13, 3],
			"faces": {
				"north": {"uv": [1, 4, 2, 8], "texture": "#0"},
				"east": {"uv": [1, 4, 2, 8], "texture": "#0"},
				"south": {"uv": [0, 0, 0, 0], "texture": "#0"},
				"west": {"uv": [0, 0, 0, 0], "texture": "#0"},
				"up": {"uv": [1, 3, 2, 5], "texture": "#0"},
				"down": {"uv": [12, 9, 13, 11], "texture": "#0"}
			}
		},
		{
			"from": [17, 8, 3],
			"to": [18, 14, 6],
			"faces": {
				"north": {"uv": [1, 3, 2, 9], "texture": "#0"},
				"east": {"uv": [1, 3, 2, 9], "texture": "#0"},
				"south": {"uv": [1, 3, 2, 9], "texture": "#0"},
				"west": {"uv": [0, 0, 0, 0], "texture": "#0"},
				"up": {"uv": [1, 3, 2, 5], "texture": "#0"},
				"down": {"uv": [1, 7, 2, 9], "texture": "#0"}
			}
		},
		{
			"from": [18, 9, 3],
			"to": [19, 14, 6],
			"faces": {
				"north": {"uv": [2, 3, 3, 8], "texture": "#0"},
				"east": {"uv": [2, 3, 3, 8], "texture": "#0"},
				"south": {"uv": [2, 3, 3, 8], "texture": "#0"},
				"west": {"uv": [0, 0, 0, 0], "texture": "#0"},
				"up": {"uv": [2, 3, 3, 5], "texture": "#0"},
				"down": {"uv": [1, 7, 2, 9], "texture": "#0"}
			}
		},
		{
			"from": [19, 9, 2.5],
			"to": [20, 14, 5],
			"faces": {
				"north": {"uv": [3, 3, 4, 8], "texture": "#0"},
				"east": {"uv": [3, 3, 4, 8], "texture": "#0"},
				"south": {"uv": [3, 3, 4, 8], "texture": "#0"},
				"west": {"uv": [3, 3, 4, 8], "texture": "#0"},
				"up": {"uv": [3, 3, 4, 5], "texture": "#0"},
				"down": {"uv": [1, 7, 2, 9], "texture": "#0"}
			}
		},
		{
			"from": [20, 10, 2],
			"to": [21, 15, 4.5],
			"faces": {
				"north": {"uv": [4, 2, 5, 7], "texture": "#0"},
				"east": {"uv": [4, 2, 5, 7], "texture": "#0"},
				"south": {"uv": [4, 2, 5, 7], "texture": "#0"},
				"west": {"uv": [5, 2, 4, 7], "texture": "#0"},
				"up": {"uv": [4, 2, 5, 4], "texture": "#0"},
				"down": {"uv": [4, 6, 5, 7], "texture": "#0"}
			}
		},
		{
			"from": [21, 11, 2],
			"to": [22, 16, 4],
			"faces": {
				"north": {"uv": [5, 1, 6, 6], "texture": "#0"},
				"east": {"uv": [5, 1, 6, 6], "texture": "#0"},
				"south": {"uv": [5, 1, 6, 6], "texture": "#0"},
				"west": {"uv": [5, 1, 6, 6], "texture": "#0"},
				"up": {"uv": [9, 2, 10, 3], "texture": "#0"},
				"down": {"uv": [9, 6, 10, 7], "texture": "#0"}
			}
		},
		{
			"from": [22, 13, 2.5],
			"to": [23, 17, 3.5],
			"faces": {
				"north": {"uv": [6, 0, 7, 4], "texture": "#0"},
				"east": {"uv": [6, 0, 7, 4], "texture": "#0"},
				"south": {"uv": [6, 0, 7, 4], "texture": "#0"},
				"west": {"uv": [6, 0, 7, 4], "texture": "#0"},
				"up": {"uv": [10, 1, 11, 3], "texture": "#0"},
				"down": {"uv": [6, 2, 7, 4], "texture": "#0"}
			}
		},
		{
			"from": [16, 2, 2],
			"to": [17, 14, 12],
			"faces": {
				"north": {"uv": [2, 2, 2.5, 8], "texture": "#0"},
				"east": {"uv": [7, 2, 2, 8], "texture": "#0"},
				"south": {"uv": [7, 2, 7.5, 8], "texture": "#0"},
				"west": {"uv": [0, 0, 0, 0], "texture": "#0"},
				"up": {"uv": [2, 2, 7, 2.5], "rotation": 90, "texture": "#0"},
				"down": {"uv": [2, 7.5, 7.5, 8], "texture": "#0"}
			}
		}
	],
	"display": {
		"thirdperson_righthand": {
			"scale": [0.5, 0.5, 0.5]
		},
		"thirdperson_lefthand": {
			"scale": [0.5, 0.5, 0.5]
		},
		"firstperson_righthand": {
			"translation": [0, 2, 2.25],
			"scale": [0.3, 0.3, 0.3]
		},
		"firstperson_lefthand": {
			"translation": [0, 2, 2.25],
			"scale": [0.3, 0.3, 0.3]
		},
		"ground": {
			"rotation": [1, 1, 1],
			"translation": [1, 1, 1],
			"scale": [0.3, 0.3, 0.3]
		},
		"gui": {
			"rotation": [14, 0, 0],
			"translation": [0, -0.1, 0],
			"scale": [0.5, 0.5, 0.5]
		},
		"head": {
			"rotation": [0, 180, 0],
			"translation": [0, 1, 0],
			"scale": [1.1, 1, 1.1]
		},
		"fixed": {
			"rotation": [-180, 1, -180],
			"translation": [0, 0.5, -3.5],
			"scale": [0.5, 0.5, 0.5]
		}
	}
}