{
	"credit": "Made with Blockbench",
	"texture_size": [64, 64],
	"textures": {
		"0": "custom/arc/ArcBoisVert/bow3d",
		"particle": "custom/arc/ArcBoisVert/bow3d"
	},
	"elements": [
		{
			"from": [7.5, 7, 5.5],
			"to": [8.5, 11, 6.5],
			"rotation": {"angle": 0, "axis": "y", "origin": [0, 2, -1.5]},
			"faces": {
				"north": {"uv": [14.5, 0, 15, 2], "texture": "#0"},
				"east": {"uv": [14, 0, 14.5, 2], "texture": "#0"},
				"south": {"uv": [13.5, 0, 14, 2], "texture": "#0"},
				"west": {"uv": [13, 0, 13.5, 2], "texture": "#0"},
				"up": {"uv": [15.5, 0, 16, 2], "texture": "#0"},
				"down": {"uv": [15.5, 0, 16, 2], "texture": "#0"}
			}
		},
		{
			"from": [7, 11, 5.5],
			"to": [9, 15, 6.5],
			"rotation": {"angle": 22.5, "axis": "x", "origin": [8, 11, 5.5]},
			"faces": {
				"north": {"uv": [1.5, 0, 2.5, 2], "texture": "#0"},
				"east": {"uv": [1.25, 0, 1.75, 2], "texture": "#0"},
				"south": {"uv": [2.75, 0, 3.75, 2], "texture": "#0"},
				"west": {"uv": [0, 0, 0.5, 2], "texture": "#0"},
				"up": {"uv": [1.5, 5.75, 2.5, 6.25], "texture": "#0"},
				"down": {"uv": [1.5, 5.75, 2.5, 6.25], "texture": "#0"}
			}
		},
		{
			"from": [7.75, 13, 4.5],
			"to": [8.25, 15, 5.5],
			"rotation": {"angle": 22.5, "axis": "x", "origin": [8, 11, 5.5]},
			"faces": {
				"north": {"uv": [5.25, 1.25, 5.5, 2.25], "texture": "#0"},
				"east": {"uv": [5.5, 2.25, 6, 3.25], "texture": "#0"},
				"south": {"uv": [4.25, 1.25, 4.75, 2.25], "texture": "#0"},
				"west": {"uv": [4.5, 2, 5, 3], "texture": "#0"},
				"up": {"uv": [4.25, 1.25, 4.5, 1.75], "texture": "#0"},
				"down": {"uv": [4.25, 1.25, 4.75, 2.25], "texture": "#0"}
			}
		},
		{
			"from": [7.75, 13, 4],
			"to": [8.25, 14, 4.5],
			"rotation": {"angle": 22.5, "axis": "x", "origin": [8, 11, 5.5]},
			"faces": {
				"north": {"uv": [4.5, 1.5, 4.75, 2], "texture": "#0"},
				"east": {"uv": [4.25, 1.5, 4.5, 2], "texture": "#0"},
				"south": {"uv": [4.75, 1.25, 5, 1.75], "texture": "#0"},
				"west": {"uv": [4.75, 1.25, 5, 1.75], "texture": "#0"},
				"up": {"uv": [4.75, 1.25, 5, 1.5], "texture": "#0"},
				"down": {"uv": [4.75, 1.25, 5, 1.75], "texture": "#0"}
			}
		},
		{
			"from": [7.75, 11, 3.5],
			"to": [8.25, 12, 4.5],
			"rotation": {"angle": 22.5, "axis": "x", "origin": [8, 11, 5.5]},
			"faces": {
				"north": {"uv": [4.25, 1.25, 4.5, 1.75], "texture": "#0"},
				"east": {"uv": [4.5, 3.25, 5, 3.75], "texture": "#0"},
				"south": {"uv": [4.25, 0, 4.5, 0.5], "texture": "#0"},
				"west": {"uv": [5.25, 1, 5.75, 1.5], "texture": "#0"},
				"up": {"uv": [0, 0, 0.125, 0.25], "texture": "#0"},
				"down": {"uv": [4.5, 0, 4.75, 0.5], "texture": "#0"}
			}
		},
		{
			"from": [7.75, 10, 4],
			"to": [8.25, 11, 4.5],
			"rotation": {"angle": 22.5, "axis": "x", "origin": [8, 11, 5.5]},
			"faces": {
				"north": {"uv": [5, 0, 5.25, 0.5], "texture": "#0"},
				"east": {"uv": [4.5, 0.25, 4.75, 0.75], "texture": "#0"},
				"south": {"uv": [5.25, 0.25, 5.5, 0.75], "texture": "#0"},
				"west": {"uv": [4.25, 0, 4.5, 0.5], "texture": "#0"},
				"up": {"uv": [4.25, 0, 4.5, 0.5], "texture": "#0"},
				"down": {"uv": [5.5, 1, 5.75, 1.25], "texture": "#0"}
			}
		},
		{
			"from": [7.5, 12, 3.5],
			"to": [8.5, 13, 5.5],
			"rotation": {"angle": 22.5, "axis": "x", "origin": [8, 11, 5.5]},
			"faces": {
				"north": {"uv": [6, 0.75, 6.5, 1.25], "texture": "#0"},
				"east": {"uv": [5.75, 2.5, 6.75, 3], "texture": "#0"},
				"south": {"uv": [6.25, 0.75, 7.25, 1.25], "texture": "#0"},
				"west": {"uv": [6.25, 0.75, 7.25, 1.25], "texture": "#0"},
				"up": {"uv": [6.75, 0.25, 7.25, 1.25], "texture": "#0"},
				"down": {"uv": [6.5, 1, 7, 2], "texture": "#0"}
			}
		},
		{
			"from": [7.75, 14.4, 6.55],
			"to": [8.25, 14.9, 8.55],
			"rotation": {"angle": -45, "axis": "x", "origin": [8, 14.9, 6.55]},
			"faces": {
				"north": {"uv": [7, 0.25, 7.25, 1.25], "rotation": 180, "texture": "#0"},
				"east": {"uv": [6.5, 0, 6.75, 1], "rotation": 270, "texture": "#0"},
				"south": {"uv": [7.5, 0.25, 7.75, 0.5], "texture": "#0"},
				"west": {"uv": [6.75, 0.25, 7, 1.25], "rotation": 90, "texture": "#0"},
				"up": {"uv": [7, 0.25, 7.25, 1.25], "rotation": 180, "texture": "#0"},
				"down": {"uv": [7, 0.25, 7.25, 1.25], "texture": "#0"}
			}
		},
		{
			"from": [7.5, 13.4, 6.55],
			"to": [8.5, 14.4, 11.55],
			"rotation": {"angle": -45, "axis": "x", "origin": [8, 14.9, 6.55]},
			"faces": {
				"north": {"uv": [1.25, 0, 1.75, 2.5], "rotation": 180, "texture": "#0"},
				"east": {"uv": [3.5, 0, 4, 2.5], "rotation": 270, "texture": "#0"},
				"south": {"uv": [1.75, 5.75, 2.25, 6.25], "texture": "#0"},
				"west": {"uv": [2.5, 0, 3, 2.5], "rotation": 90, "texture": "#0"},
				"up": {"uv": [0, 0, 0.5, 2.5], "rotation": 180, "texture": "#0"},
				"down": {"uv": [1.25, 0, 1.75, 2.5], "texture": "#0"}
			}
		},
		{
			"from": [7.5, 12.4, 8.55],
			"to": [8.5, 13.4, 10.55],
			"rotation": {"angle": -45, "axis": "x", "origin": [8, 14.9, 6.55]},
			"faces": {
				"north": {"uv": [1.75, 5.75, 2.25, 6.25], "rotation": 180, "texture": "#0"},
				"east": {"uv": [5.5, 2.5, 6, 3.5], "rotation": 270, "texture": "#0"},
				"south": {"uv": [7.25, 0, 7.75, 0.5], "texture": "#0"},
				"west": {"uv": [4.75, 1.75, 5.25, 2.75], "rotation": 90, "texture": "#0"},
				"up": {"uv": [0.75, 0, 1.25, 1], "rotation": 180, "texture": "#0"},
				"down": {"uv": [3.25, 0, 3.75, 1], "texture": "#0"}
			}
		},
		{
			"from": [7, 3, 5.5],
			"to": [9, 7, 6.5],
			"rotation": {"angle": -22.5, "axis": "x", "origin": [8, 7, 5.5]},
			"faces": {
				"north": {"uv": [0.25, 0, 1.25, 2], "texture": "#0"},
				"east": {"uv": [2.5, 0, 3, 2], "texture": "#0"},
				"south": {"uv": [1.75, 0, 2.75, 2], "texture": "#0"},
				"west": {"uv": [1.75, 0, 2.25, 2], "texture": "#0"},
				"up": {"uv": [1.75, 0, 2.75, 2], "texture": "#0"},
				"down": {"uv": [1.75, 0, 2.75, 2], "texture": "#0"}
			}
		},
		{
			"from": [7.75, 3, 4.5],
			"to": [8.25, 5, 5.5],
			"rotation": {"angle": -22.5, "axis": "x", "origin": [8, 7, 5.5]},
			"faces": {
				"north": {"uv": [7, 0.75, 7.25, 1.75], "texture": "#0"},
				"east": {"uv": [6.5, 0.75, 7, 1.75], "texture": "#0"},
				"south": {"uv": [6.5, 0.75, 7, 1.75], "texture": "#0"},
				"west": {"uv": [6.75, 0.75, 7.25, 1.75], "texture": "#0"},
				"up": {"uv": [6.5, 0.75, 7, 1.75], "texture": "#0"},
				"down": {"uv": [6.5, 0.75, 7, 1.75], "texture": "#0"}
			}
		},
		{
			"from": [7.75, 4, 4],
			"to": [8.25, 5, 4.5],
			"rotation": {"angle": -22.5, "axis": "x", "origin": [8, 7, 5.5]},
			"faces": {
				"north": {"uv": [0, 0, 0.125, 0.25], "texture": "#0"},
				"east": {"uv": [0, 0, 0.125, 0.25], "texture": "#0"},
				"south": {"uv": [0, 0, 0.125, 0.25], "texture": "#0"},
				"west": {"uv": [0, 0, 0.125, 0.25], "texture": "#0"},
				"up": {"uv": [0, 0, 0.125, 0.125], "texture": "#0"},
				"down": {"uv": [0, 0, 0.125, 0.125], "texture": "#0"}
			}
		},
		{
			"from": [7.75, 6, 3.5],
			"to": [8.25, 7, 4.5],
			"rotation": {"angle": -22.5, "axis": "x", "origin": [8, 7, 5.5]},
			"faces": {
				"north": {"uv": [5.25, 1.75, 5.5, 2.25], "texture": "#0"},
				"east": {"uv": [6.25, 2, 6.75, 2.5], "texture": "#0"},
				"south": {"uv": [6.5, 2, 6.75, 2.5], "texture": "#0"},
				"west": {"uv": [6, 1.5, 6.5, 2], "texture": "#0"},
				"up": {"uv": [6.25, 0.75, 6.5, 1.25], "texture": "#0"},
				"down": {"uv": [6, 1.5, 6.5, 2], "texture": "#0"}
			}
		},
		{
			"from": [7.75, 7, 4],
			"to": [8.25, 8, 4.5],
			"rotation": {"angle": -22.5, "axis": "x", "origin": [8, 7, 5.5]},
			"faces": {
				"north": {"uv": [7, 1.25, 7.25, 1.75], "texture": "#0"},
				"east": {"uv": [5.25, 1.5, 5.5, 2], "texture": "#0"},
				"south": {"uv": [4.25, 1.5, 4.5, 2], "texture": "#0"},
				"west": {"uv": [5.25, 1.5, 5.5, 2], "texture": "#0"},
				"up": {"uv": [4.25, 1.25, 4.5, 1.5], "texture": "#0"},
				"down": {"uv": [5.25, 1.5, 5.5, 2], "texture": "#0"}
			}
		},
		{
			"from": [7.5, 5, 3.5],
			"to": [8.5, 6, 5.5],
			"rotation": {"angle": -22.5, "axis": "x", "origin": [8, 7, 5.5]},
			"faces": {
				"north": {"uv": [5, 1.75, 5.5, 2.25], "texture": "#0"},
				"east": {"uv": [4.25, 1.25, 5.25, 1.75], "texture": "#0"},
				"south": {"uv": [4.25, 1.25, 5.25, 1.75], "texture": "#0"},
				"west": {"uv": [6.25, 0.75, 7.25, 1.25], "texture": "#0"},
				"up": {"uv": [6.75, 0.25, 7.25, 1.25], "texture": "#0"},
				"down": {"uv": [5.5, 2.5, 6, 3.5], "texture": "#0"}
			}
		},
		{
			"from": [7.5, 4.6, 8.55],
			"to": [8.5, 5.6, 10.55],
			"rotation": {"angle": 45, "axis": "x", "origin": [8, 3.1, 6.55]},
			"faces": {
				"north": {"uv": [1.75, 5.75, 2.25, 6.25], "rotation": 180, "texture": "#0"},
				"east": {"uv": [5.25, 1.75, 5.75, 2.75], "rotation": 90, "texture": "#0"},
				"south": {"uv": [5.25, 1.25, 5.75, 1.75], "texture": "#0"},
				"west": {"uv": [5, 3, 5.5, 4], "rotation": 270, "texture": "#0"},
				"up": {"uv": [0, 0, 0.5, 1], "texture": "#0"},
				"down": {"uv": [0, 0, 0.5, 1], "rotation": 180, "texture": "#0"}
			}
		},
		{
			"from": [7.5, 3.6, 6.55],
			"to": [8.5, 4.6, 11.55],
			"rotation": {"angle": 45, "axis": "x", "origin": [8, 3.1, 6.55]},
			"faces": {
				"north": {"uv": [0, 0, 0.5, 2.5], "rotation": 180, "texture": "#0"},
				"east": {"uv": [2.5, 0, 3, 2.5], "rotation": 90, "texture": "#0"},
				"south": {"uv": [1.75, 5.75, 2.25, 6.25], "texture": "#0"},
				"west": {"uv": [0, 0, 0.5, 2.5], "rotation": 270, "texture": "#0"},
				"up": {"uv": [1.25, 0, 1.75, 2.5], "texture": "#0"},
				"down": {"uv": [0.5, 0, 1, 2.5], "rotation": 180, "texture": "#0"}
			}
		},
		{
			"from": [7.75, 3.1, 6.55],
			"to": [8.25, 3.6, 8.55],
			"rotation": {"angle": 45, "axis": "x", "origin": [8, 3.1, 6.55]},
			"faces": {
				"north": {"uv": [6.75, 0.25, 7, 1.25], "rotation": 180, "texture": "#0"},
				"east": {"uv": [6.25, 0.25, 6.5, 1.25], "rotation": 90, "texture": "#0"},
				"south": {"uv": [6.25, 1, 6.5, 1.25], "texture": "#0"},
				"west": {"uv": [6.75, 0.25, 7, 1.25], "rotation": 270, "texture": "#0"},
				"up": {"uv": [6.75, 0.25, 7, 1.25], "texture": "#0"},
				"down": {"uv": [6.5, 0.25, 6.75, 1.25], "rotation": 180, "texture": "#0"}
			}
		},
		{
			"from": [7.75, 9, 10.25],
			"to": [8.25, 16, 10.75],
			"rotation": {"angle": 0, "axis": "x", "origin": [8, 9, 10.75]},
			"faces": {
				"north": {"uv": [15.25, 0.25, 15.5, 4], "texture": "#0"},
				"east": {"uv": [15.5, 0.25, 15.75, 4], "texture": "#0"},
				"south": {"uv": [15.75, 0.25, 16, 4], "texture": "#0"},
				"west": {"uv": [15, 0.25, 15.25, 4], "texture": "#0"},
				"up": {"uv": [15.75, 0, 16, 4], "texture": "#0"},
				"down": {"uv": [15.75, 0, 16, 4], "texture": "#0"}
			}
		},
		{
			"from": [7.75, 2, 10.25],
			"to": [8.25, 9, 10.75],
			"rotation": {"angle": 0, "axis": "x", "origin": [8, 9, 10.75]},
			"faces": {
				"north": {"uv": [15.25, 0, 15.5, 3.75], "texture": "#0"},
				"east": {"uv": [15.5, 0, 15.75, 3.75], "texture": "#0"},
				"south": {"uv": [15.75, 0, 16, 3.75], "texture": "#0"},
				"west": {"uv": [15, 0, 15.25, 3.75], "texture": "#0"},
				"up": {"uv": [15.75, 0, 16, 4], "texture": "#0"},
				"down": {"uv": [15.75, 0, 16, 4], "texture": "#0"}
			}
		}
	],
	"display": {
		"thirdperson_righthand": {
			"rotation": [1.25, 0.5, 8.75],
			"translation": [-0.5, -3, 2.5],
			"scale": [1.25, 1.25, 1.25]
		},
		"thirdperson_lefthand": {
			"translation": [0, -3, 2]
		},
		"firstperson_righthand": {
			"rotation": [11, 0, -3],
			"translation": [-0.75, 3.75, 1.25]
		},
		"firstperson_lefthand": {
			"rotation": [11, 0, -3],
			"translation": [-0.75, 3.75, 1.25]
		},
		"ground": {
			"rotation": [9.25, -7.25, -57]
		},
		"gui": {
			"rotation": [31, 145.25, -41.75],
			"translation": [0, -1.75, 0]
		},
		"fixed": {
			"rotation": [0, -90, 0],
			"translation": [0, -1, -1]
		}
	},
	"groups": [0,
		{
			"name": "group",
			"origin": [24, 19, 14],
			"children": [1, 2, 3, 4, 5, 6]
		},
		{
			"name": "group",
			"origin": [24, 23, 16],
			"children": [7, 8, 9]
		},
		{
			"name": "group",
			"origin": [24, 9, 14],
			"children": [10, 11, 12, 13, 14, 15]
		},
		{
			"name": "group",
			"origin": [24, 7, 14],
			"children": [16, 17, 18]
		},
		{
			"name": "group",
			"origin": [8, 8, 8],
			"children": [19, 20]
		}
	]
}