{
    "swagger": "2.0",
    "info": {
        "contact": {},
        "license": {}
    },
    "paths": {
        "/visitors/": {
            "get": {
                "description": "get all existing visitors",
                "consumes": [
                    "application/json"
                ],
                "produces": [
                    "application/json"
                ],
                "summary": "Show all visitors",
                "operationId": "get-all-visitors",
                "responses": {
                    "200": {
                        "description": "OK",
                        "schema": {
                            "type": "array",
                            "items": {
                                "$ref": "#/definitions/models.Visitor"
                            }
                        }
                    },
                    "204": {}
                }
            },
            "post": {
                "description": "Store a new visitor",
                "consumes": [
                    "application/json"
                ],
                "produces": [
                    "application/json"
                ],
                "summary": "Store a new visitor",
                "operationId": "store-new-visitor",
                "parameters": [
                    {
                        "description": "a new visitor object",
                        "name": "q",
                        "in": "body",
                        "schema": {
                            "$ref": "#/definitions/models.Visitor"
                        }
                    }
                ],
                "responses": {
                    "200": {
                        "description": "OK",
                        "schema": {
                            "type": "array",
                            "items": {
                                "$ref": "#/definitions/models.Visitor"
                            }
                        }
                    },
                    "400": {}
                }
            }
        }
    },
    "definitions": {
        "models.Visitor": {
            "type": "object",
            "properties": {
                "_id": {
                    "type": "string"
                },
                "added_on": {
                    "type": "string"
                },
                "email": {
                    "type": "string"
                },
                "name": {
                    "type": "string"
                }
            }
        }
    }
}