{
    "/js/app.js": "/js/app.js?id=620e0f0f6565c805dde7",
    "/css/app.css": "/css/app.css?id=1f87437dd73d1bb9e756",
    "/css/app-rtl.css": "/css/app-rtl.css?id=1f87437dd73d1bb9e756",
    "/js/sweetalert.min.js": "/js/sweetalert.min.js?id=0068f44b0aa1b83fa767"
}
