%YAML 1.1
%TAG !u! tag:unity3d.com,2011:
--- !u!1045 &1
EditorBuildSettings:
  m_ObjectHideFlags: 0
  serializedVersion: 2
  m_Scenes:
  - enabled: 0
    path: 
    guid: 00000000000000000000000000000000
  - enabled: 1
    path: Assets/Scenes/LoginPage.unity
    guid: 30fc7ae9052003249bac7c39c4522dbe
  - enabled: 1
    path: Assets/Scenes/QuestionPage.unity
    guid: 43b0ef8d5636f724fb1f019dad811994
  - enabled: 1
    path: Assets/Scenes/SuccessPage.unity
    guid: 207ccd2204ac6ee4f89cf917904f5e25
  m_configObjects: {}
