<?xml version="1.0" encoding="UTF-8" standalone="no"?>
<!-- DOCTYPE svg PUBLIC "-//W3C//DTD SVG 1.1//EN" "http://www.w3.org/Graphics/SVG/1.1/DTD/svg11.dtd" -->

<svg
   viewBox="0 0 377.95274 377.95274"
   preserveAspectRatio="xMidYMid"
   zoomAndPan="magnify"
   version="1.1"
   id="svg16181"
   sodipodi:docname="etoile.svg"
   width="100mm"
   height="100mm"
   inkscape:version="1.2.2 (732a01da63, 2022-12-09)"
   xmlns:inkscape="http://www.inkscape.org/namespaces/inkscape"
   xmlns:sodipodi="http://sodipodi.sourceforge.net/DTD/sodipodi-0.dtd"
   xmlns="http://www.w3.org/2000/svg"
   xmlns:svg="http://www.w3.org/2000/svg">
  <defs
     id="defs16185" />
  <sodipodi:namedview
     id="namedview16183"
     pagecolor="#ffffff"
     bordercolor="#666666"
     borderopacity="1.0"
     inkscape:showpageshadow="2"
     inkscape:pageopacity="0.0"
     inkscape:pagecheckerboard="0"
     inkscape:deskcolor="#d1d1d1"
     showgrid="false"
     inkscape:zoom="1.3037281"
     inkscape:cx="274.98064"
     inkscape:cy="368.55844"
     inkscape:window-width="1920"
     inkscape:window-height="1457"
     inkscape:window-x="2869"
     inkscape:window-y="-11"
     inkscape:window-maximized="1"
     inkscape:current-layer="svg16181"
     inkscape:document-units="mm" />
  <polygon
     points="1024,0 1024,1024 0,1024 0,0 "
     fill="none"
     stroke="#00c3c3"
     stroke-width="0.50"
     id="polygon16179"
     style="stroke-width:125.98425197;stroke-dasharray:none;stroke:#00c0ff;stroke-opacity:1"
     transform="matrix(0.3,0,0,0.3,37.315254,32.976271)" />
  <path
     style="fill:none;stroke:#00c0ff;stroke-width:8.69291339;stroke-linecap:butt;stroke-linejoin:miter;stroke-opacity:1;stroke-dasharray:none"
     d="M 37.315254,186.57627 H 344.51525"
     id="path16675" />
  <path
     style="fill:#00c0ff;stroke:#00c0ff;stroke-width:29.85826772;stroke-miterlimit:0;stroke-dasharray:none;stroke-opacity:1;paint-order:fill markers stroke;fill-opacity:1"
     d="M 56.376785,109.68545 V 52.158114 H 190.99074 325.6047 v 57.527336 57.52733 H 190.99074 56.376785 Z"
     id="path16756" />
</svg>
