<?xml version="1.0" encoding="UTF-8" standalone="no"?>
<!-- DOCTYPE svg PUBLIC "-//W3C//DTD SVG 1.1//EN" "http://www.w3.org/Graphics/SVG/1.1/DTD/svg11.dtd" -->

<svg
   viewBox="0 0 377.95274 377.95274"
   preserveAspectRatio="xMidYMid"
   zoomAndPan="magnify"
   version="1.1"
   id="svg16181"
   sodipodi:docname="epbs22.svg"
   width="100mm"
   height="100mm"
   inkscape:version="1.2.2 (732a01da63, 2022-12-09)"
   inkscape:export-filename="epbs22.png"
   inkscape:export-xdpi="90"
   inkscape:export-ydpi="90"
   xmlns:inkscape="http://www.inkscape.org/namespaces/inkscape"
   xmlns:sodipodi="http://sodipodi.sourceforge.net/DTD/sodipodi-0.dtd"
   xmlns="http://www.w3.org/2000/svg"
   xmlns:svg="http://www.w3.org/2000/svg">
  <defs
     id="defs16185">
    <rect
       x="95.457627"
       y="99.79661"
       width="190.91525"
       height="169.22034"
       id="rect20683" />
    <rect
       x="95.457626"
       y="99.796608"
       width="190.91525"
       height="169.22034"
       id="rect20683-5" />
  </defs>
  <sodipodi:namedview
     id="namedview16183"
     pagecolor="#ffffff"
     bordercolor="#666666"
     borderopacity="1.0"
     inkscape:showpageshadow="2"
     inkscape:pageopacity="0.0"
     inkscape:pagecheckerboard="0"
     inkscape:deskcolor="#d1d1d1"
     showgrid="false"
     inkscape:zoom="0.921875"
     inkscape:cx="-273.89831"
     inkscape:cy="520.13559"
     inkscape:window-width="1920"
     inkscape:window-height="1457"
     inkscape:window-x="2869"
     inkscape:window-y="-11"
     inkscape:window-maximized="1"
     inkscape:current-layer="svg16181"
     inkscape:document-units="mm" />
  <polygon
     points="1024,0 1024,1024 0,1024 0,0 "
     fill="none"
     stroke="#00c3c3"
     stroke-width="0.50"
     id="polygon16179"
     style="stroke-width:82.1367;stroke-dasharray:none;stroke:#00c0ff;stroke-opacity:1"
     transform="matrix(0.3,0,0,0.3,37.315254,32.976271)" />
  <text
     xml:space="preserve"
     id="text20681"
     style="font-style:normal;font-variant:normal;font-weight:normal;font-stretch:normal;font-size:37.7953px;line-height:1.25;font-family:Arial;-inkscape-font-specification:'Arial, Normal';font-variant-ligatures:normal;font-variant-caps:normal;font-variant-numeric:normal;font-variant-east-asian:normal;letter-spacing:0px;word-spacing:0px;white-space:pre;shape-inside:url(#rect20683);fill:#00c0ff;fill-opacity:1;stroke:#00c0ff;stroke-opacity:1"
     transform="matrix(4.2953118,0,0,3.7916013,-328.56788,-328.27505)"><tspan
       x="95.457031"
       y="133.84116"
       id="tspan1263">BS</tspan></text>
  <text
     xml:space="preserve"
     id="text20681-8"
     style="font-style:normal;font-variant:normal;font-weight:normal;font-stretch:normal;font-size:37.7953px;line-height:1.25;font-family:Arial;-inkscape-font-specification:'Arial, Normal';font-variant-ligatures:normal;font-variant-caps:normal;font-variant-numeric:normal;font-variant-east-asian:normal;letter-spacing:0px;word-spacing:0px;white-space:pre;shape-inside:url(#rect20683-5);fill:#00c0ff;fill-opacity:1;stroke:#00c0ff;stroke-opacity:1"
     transform="matrix(4.2953118,0,0,3.7916013,-316.07105,-203.43635)"><tspan
       x="95.457031"
       y="133.84116"
       id="tspan1265">22</tspan></text>
</svg>
