<?xml version="1.0" encoding="UTF-8" standalone="no"?>
<!-- DOCTYPE svg PUBLIC "-//W3C//DTD SVG 1.1//EN" "http://www.w3.org/Graphics/SVG/1.1/DTD/svg11.dtd" -->

<svg
   viewBox="0 0 377.95274 377.95274"
   preserveAspectRatio="xMidYMid"
   zoomAndPan="magnify"
   version="1.1"
   id="svg1305"
   sodipodi:docname="borne-exr.svg"
   width="100mm"
   height="100mm"
   inkscape:version="1.2.2 (732a01da63, 2022-12-09)"
   inkscape:export-filename="beton+foncx2.svg"
   inkscape:export-xdpi="90"
   inkscape:export-ydpi="90"
   xmlns:inkscape="http://www.inkscape.org/namespaces/inkscape"
   xmlns:sodipodi="http://sodipodi.sourceforge.net/DTD/sodipodi-0.dtd"
   xmlns="http://www.w3.org/2000/svg"
   xmlns:svg="http://www.w3.org/2000/svg">
  <defs
     id="defs1309">
    <linearGradient
       id="linearGradient19620"
       inkscape:swatch="solid">
      <stop
         style="stop-color:#a87153;stop-opacity:1"
         offset="0"
         id="stop19618" />
    </linearGradient>
  </defs>
  <sodipodi:namedview
     id="namedview1307"
     pagecolor="#ffffff"
     bordercolor="#666666"
     borderopacity="1.0"
     inkscape:showpageshadow="2"
     inkscape:pageopacity="0.0"
     inkscape:pagecheckerboard="0"
     inkscape:deskcolor="#d1d1d1"
     showgrid="false"
     inkscape:document-units="mm"
     inkscape:zoom="0.88141928"
     inkscape:cx="161.67107"
     inkscape:cy="232.57944"
     inkscape:window-width="1920"
     inkscape:window-height="1000"
     inkscape:window-x="-11"
     inkscape:window-y="-11"
     inkscape:window-maximized="1"
     inkscape:current-layer="svg1305" />
  <rect
     style="fill:#00ff00;fill-opacity:1;stroke:#000000;stroke-width:18.89763686;stroke-miterlimit:2;stroke-dasharray:none;stroke-opacity:1"
     id="rect1292"
     width="294.97879"
     height="181.52541"
     x="41.977749"
     y="98.704437" />
  <path
     d="m 64.056893,62.966926 a 178.0325,178.0325 0 0 0 0,251.778514"
     fill="none"
     id="path1239"
     style="stroke:#000000;stroke-width:19.2756;stroke-dasharray:none;stroke-opacity:1" />
  <path
     d="m 315.84388,314.74544 a 178.0325,178.0325 0 0 0 0,-251.778514"
     fill="none"
     id="path1245"
     style="stroke:#000000;stroke-width:19.2756;stroke-dasharray:none;stroke-opacity:1" />
  <circle
     cx="189.95041"
     cy="188.85619"
     r="178.03676"
     fill="none"
     id="circle1233"
     style="display:inline;stroke:#000000;stroke-width:19.27558959;stroke-dasharray:none;stroke-opacity:1" />
  <path
     style="fill:#000000;stroke:#000000;stroke-width:4.288;stroke-miterlimit:2;fill-opacity:1;stroke-opacity:1"
     d="M 58.581983,84.239138 C 65.2096,75.712222 82.641496,59.187313 92.166364,52.402162 110.85522,39.088943 133.06357,29.387535 156.6643,24.227149 c 15.48522,-3.385901 46.84224,-3.654821 63.43526,-0.544026 29.88129,5.602026 57.7039,19.088693 80.55191,39.046532 8.12261,7.095142 22.08378,22.364775 23.06885,25.230919 0.24289,0.706697 -47.78541,1.100332 -134.25396,1.100332 H 54.834223 Z"
     id="path16320" />
  <path
     style="fill:#000000;fill-opacity:1;stroke:#000000;stroke-width:4.288;stroke-miterlimit:2;stroke-opacity:1"
     d="m 346.7964,188.89988 -0.0274,-59.56302 2.7704,7.934 c 5.48857,15.71837 7.75698,31.13167 7.68186,52.19629 -0.0742,20.79925 -1.99805,33.60976 -7.58209,50.48676 l -2.81534,8.509 z"
     id="path16754" />
  <path
     style="fill:#000000;fill-opacity:1;stroke:#000000;stroke-width:4.288;stroke-miterlimit:2;stroke-opacity:1"
     d="M 169.87352,355.6383 C 140.9764,351.99476 113.11331,340.74677 89.227825,323.08262 80.143382,316.36436 65.764849,302.54249 59.697081,294.69516 L 55.968757,289.8734 H 190.02143 324.0741 l -2.06778,2.60814 c -21.00783,26.49777 -49.03125,45.94317 -80.91788,56.1488 -5.92794,1.89729 -15.11766,4.28751 -20.42161,5.31159 -11.51269,2.22285 -39.26642,3.14976 -50.79331,1.69637 z"
     id="path17121" />
  <path
     style="fill:#000000;fill-opacity:1;stroke:#000000;stroke-width:4.288;stroke-miterlimit:2;stroke-opacity:1"
     d="m 29.092021,236.26667 c -5.145647,-17.35904 -6.21982,-25.50937 -6.242704,-47.36679 -0.02295,-21.91857 1.61355,-33.60672 7.074525,-50.52747 l 2.183801,-6.76648 0.113286,56.44305 c 0.06231,31.04369 -0.06761,56.44306 -0.288711,56.44306 -0.221096,0 -1.499186,-3.70141 -2.840197,-8.22537 z"
     id="path17486" />
</svg>
