<?xml version="1.0" encoding="UTF-8" standalone="no"?>
<svg
   xmlns:osb="http://www.openswatchbook.org/uri/2009/osb"
   xmlns:dc="http://purl.org/dc/elements/1.1/"
   xmlns:cc="http://creativecommons.org/ns#"
   xmlns:rdf="http://www.w3.org/1999/02/22-rdf-syntax-ns#"
   xmlns:svg="http://www.w3.org/2000/svg"
   xmlns="http://www.w3.org/2000/svg"
   xmlns:sodipodi="http://sodipodi.sourceforge.net/DTD/sodipodi-0.dtd"
   xmlns:inkscape="http://www.inkscape.org/namespaces/inkscape"
   version="1.1"
   x="0px"
   y="0px"
   viewBox="0 0 2872.441 2872.441"
   enable-background="new 0 0 100 100"
   xml:space="preserve"
   id="svg8"
   sodipodi:docname="smdev=support_projecteur_a_deposer.svg"
   width="76cm"
   height="76cm"
   inkscape:version="0.92.4 (5da689c313, 2019-01-14)"><metadata
     id="metadata14"><rdf:RDF><cc:Work
         rdf:about=""><dc:format>image/svg+xml</dc:format><dc:type
           rdf:resource="http://purl.org/dc/dcmitype/StillImage" /><dc:title></dc:title></cc:Work></rdf:RDF></metadata><defs
     id="defs12"><linearGradient
       id="linearGradient847"
       osb:paint="solid"><stop
         style="stop-color:#0200f7;stop-opacity:1;"
         offset="0"
         id="stop845" /></linearGradient><linearGradient
       id="linearGradient858"
       osb:paint="solid"><stop
         style="stop-color:#000000;stop-opacity:1;"
         offset="0"
         id="stop856" /></linearGradient><linearGradient
       id="linearGradient850"
       osb:paint="solid"><stop
         style="stop-color:#000000;stop-opacity:1;"
         offset="0"
         id="stop848" /></linearGradient><linearGradient
       id="linearGradient4532"
       osb:paint="solid"><stop
         style="stop-color:#f60000;stop-opacity:1;"
         offset="0"
         id="stop4530" /></linearGradient></defs><sodipodi:namedview
     pagecolor="#ffffff"
     bordercolor="#666666"
     borderopacity="1"
     objecttolerance="10"
     gridtolerance="10"
     guidetolerance="10"
     inkscape:pageopacity="0"
     inkscape:pageshadow="2"
     inkscape:window-width="1024"
     inkscape:window-height="705"
     id="namedview10"
     showgrid="true"
     inkscape:snap-bbox="true"
     inkscape:bbox-paths="true"
     inkscape:bbox-nodes="true"
     inkscape:snap-bbox-edge-midpoints="true"
     inkscape:snap-bbox-midpoints="true"
     inkscape:object-paths="true"
     inkscape:snap-intersection-paths="true"
     inkscape:snap-smooth-nodes="true"
     inkscape:snap-midpoints="true"
     inkscape:snap-object-midpoints="true"
     inkscape:snap-center="true"
     inkscape:snap-text-baseline="true"
     inkscape:snap-page="true"
     inkscape:showpageshadow="false"
     inkscape:zoom="0.0417193"
     inkscape:cx="-1820.3478"
     inkscape:cy="-657.08888"
     inkscape:window-x="-8"
     inkscape:window-y="-8"
     inkscape:window-maximized="1"
     inkscape:current-layer="svg8"
     inkscape:document-units="cm"
     units="cm"
     showguides="true"
     inkscape:guide-bbox="true"
     inkscape:snap-grids="false"><sodipodi:guide
       position="0,0"
       orientation="0,2721.2598"
       id="guide820"
       inkscape:locked="false" /><sodipodi:guide
       position="1436.2204,1436.2206"
       orientation="-2721.2598,0"
       id="guide822"
       inkscape:locked="false" /><sodipodi:guide
       position="1436.2204,1436.2206"
       orientation="0,-2721.2598"
       id="guide824"
       inkscape:locked="false" /><sodipodi:guide
       position="0,2721.26"
       orientation="2721.2598,0"
       id="guide826"
       inkscape:locked="false" /><sodipodi:guide
       position="2872.441,2872.441"
       orientation="-0.70710678,0.70710678"
       id="guide828"
       inkscape:locked="false" /><sodipodi:guide
       position="0,2872.441"
       orientation="0.70710678,0.70710678"
       id="guide830"
       inkscape:locked="false" /><inkscape:grid
       type="xygrid"
       id="grid828" /></sodipodi:namedview><path
     sodipodi:type="star"
     style="opacity:1;fill:none;fill-opacity:0.96470588;fill-rule:nonzero;stroke:#a5a5a5;stroke-width:113.38583374;stroke-linecap:butt;stroke-linejoin:round;stroke-miterlimit:4;stroke-dasharray:none;stroke-opacity:1;paint-order:fill markers stroke"
     id="path868"
     sodipodi:sides="8"
     sodipodi:cx="1436.2204"
     sodipodi:cy="1436.2204"
     sodipodi:r1="1427.8278"
     sodipodi:r2="1319.1411"
     sodipodi:arg1="-1.9566789"
     sodipodi:arg2="-1.5639799"
     inkscape:flatsided="true"
     inkscape:rounded="0"
     inkscape:randomized="0"
     d="m 898.81899,113.38571 1092.78671,7.44911 767.4495,777.98417 -7.4491,1092.78671 -777.9842,767.4495 -1092.78664,-7.4491 -767.44955,-777.9842 7.44911,-1092.78664 z" /></svg>
