<?xml version="1.0" encoding="UTF-8" standalone="no"?>
<!-- Created with Inkscape (http://www.inkscape.org/) -->

<svg
   xmlns:dc="http://purl.org/dc/elements/1.1/"
   xmlns:cc="http://creativecommons.org/ns#"
   xmlns:rdf="http://www.w3.org/1999/02/22-rdf-syntax-ns#"
   xmlns:svg="http://www.w3.org/2000/svg"
   xmlns="http://www.w3.org/2000/svg"
   xmlns:sodipodi="http://sodipodi.sourceforge.net/DTD/sodipodi-0.dtd"
   xmlns:inkscape="http://www.inkscape.org/namespaces/inkscape"
   version="1.1"
   id="svg10"
   xml:space="preserve"
   width="380.74899"
   height="319.194"
   viewBox="0 0 380.74899 319.19401"
   sodipodi:docname="SMDEV 181017.svg"
   inkscape:version="0.92.1 r15371"
   inkscape:export-filename="C:\Users\JC\Desktop\SMDEV 181017.png"
   inkscape:export-xdpi="96"
   inkscape:export-ydpi="96"><metadata
     id="metadata16"><rdf:RDF><cc:Work
         rdf:about=""><dc:format>image/svg+xml</dc:format><dc:type
           rdf:resource="http://purl.org/dc/dcmitype/StillImage" /><dc:title /></cc:Work></rdf:RDF></metadata><defs
     id="defs14"><linearGradient
       x1="0"
       y1="0"
       x2="1"
       y2="0"
       gradientUnits="userSpaceOnUse"
       gradientTransform="matrix(96.99612,90.99626,-90.99626,96.99611,269.20117,-412.96387)"
       spreadMethod="pad"
       id="linearGradient38"><stop
         style="stop-opacity:1;stop-color:#ffffff"
         offset="0"
         id="stop32" /><stop
         style="stop-opacity:1;stop-color:#1575aa"
         offset="0.74781451"
         id="stop34" /><stop
         style="stop-opacity:1;stop-color:#1575aa"
         offset="1"
         id="stop36" /></linearGradient><pattern
       y="0"
       x="0"
       height="6"
       width="6"
       patternUnits="userSpaceOnUse"
       id="EMFhbasepattern" /></defs><sodipodi:namedview
     pagecolor="#ffffff"
     bordercolor="#666666"
     borderopacity="1"
     objecttolerance="10"
     gridtolerance="10"
     guidetolerance="10"
     inkscape:pageopacity="0"
     inkscape:pageshadow="2"
     inkscape:window-width="1920"
     inkscape:window-height="1028"
     id="namedview12"
     showgrid="false"
     inkscape:zoom="0.53480904"
     inkscape:cx="149.37901"
     inkscape:cy="564.14333"
     inkscape:window-x="-8"
     inkscape:window-y="-8"
     inkscape:window-maximized="1"
     inkscape:current-layer="g42" /><g
     id="g18"
     inkscape:groupmode="layer"
     inkscape:label="SMDEV logo"
     transform="matrix(1.3333333,0,0,-1.3333333,0,319.19406)"><g
       id="g42"
       transform="scale(1,-1)"><g
         id="g8497"
         transform="translate(-159.37842,298.47457)"><g
           id="g20"><g
             id="g22"><g
               id="g28"><g
                 id="g30"><path
                   inkscape:connector-curvature="0"
                   id="path40"
                   style="fill:url(#linearGradient38);stroke:none"
                   d="m 263.50049,-419.47461 c 0,0 126.49951,0 126.49951,0 0,0 0,121 0,121 0,0 -126.49951,0 -126.49951,0 0,0 0,-121 0,-121 z" /></g></g></g></g><path
           inkscape:connector-curvature="0"
           id="path44"
           style="fill:#f68712;fill-opacity:1;fill-rule:nonzero;stroke:none"
           d="m 257.0459,-517.03467 c -53.93994,0 -97.66748,44.14307 -97.66748,98.59522 0,54.45312 43.72754,98.5957 97.66748,98.5957 2.42285,0 7.66015,-0.0937 10.03906,-0.26855 -50.57568,-3.72168 -94.71582,-46.32032 -94.71582,-98.32715 0,-51.91993 41.17432,-94.46094 91.63086,-98.30664 0,0 0,-0.0352 0,-0.0352 -2.29736,-0.16309 -4.61572,-0.25342 -6.9541,-0.25342 z" /><path
           inkscape:connector-curvature="0"
           id="path46"
           style="fill:#f68712;fill-opacity:1;fill-rule:nonzero;stroke:none"
           d="m 272.61621,-339.30957 c 2.02246,0.14551 4.06397,0.22461 6.12305,0.22461 44.94043,0 81.51172,-35.71484 82.94336,-80.30469 0,0 -12.24219,0 -12.24219,0 -1.36523,42.54688 -34.72754,77.01074 -76.82422,80.08008 z" /><path
           inkscape:connector-curvature="0"
           id="path48"
           style="fill:#f68712;fill-opacity:1;fill-rule:nonzero;stroke:none"
           d="m 262.85938,-491.05859 c -35.15674,0 -63.65625,27.17187 -63.65625,60.6914 0,1.50537 0.0596,2.99903 0.17285,4.47656 2.40478,-31.42871 29.90576,-56.21582 63.4834,-56.21582 0.38232,0 0.75976,0.02 1.14062,0.0264 0,0 0,-8.95117 0,-8.95117 -0.38086,-0.006 -0.75781,-0.0273 -1.14062,-0.0273 z" /><path
           inkscape:connector-curvature="0"
           id="path50"
           style="fill:#f68712;fill-opacity:1;fill-rule:nonzero;stroke:none"
           d="m 263.2876,-355.23438 c -41.08203,0 -74.73389,-31.875 -77.67432,-72.29003 -0.13721,1.8999 -0.21142,3.82031 -0.21142,5.75683 0,43.10449 34.87109,78.04492 77.88574,78.04492 42.21826,0 76.56787,-33.66601 77.82568,-75.66699 0,0 -1.1875,0 -1.1875,0 -6.54199,36.47363 -38.35547,64.15527 -76.63818,64.15527 z" /><path
           inkscape:connector-curvature="0"
           id="path52"
           style="fill:#f68712;fill-opacity:1;fill-rule:nonzero;stroke:none"
           d="m 264.76904,-374.06934 c 1.11621,0.0801 2.2461,0.12305 3.38526,0.12305 25.22656,0 45.68945,-20.31445 45.88086,-45.44336 0,0 -6.76953,0 -6.76953,0 -0.18262,23.9961 -18.84864,43.59863 -42.49659,45.32031 z" /><path
           inkscape:connector-curvature="0"
           id="path54"
           style="fill:#f68712;fill-opacity:1;fill-rule:nonzero;stroke:none"
           d="m 263.60059,-400.28711 c 0.48535,0.0342 0.97607,0.0527 1.4707,0.0527 10.76172,0 19.50781,-8.51269 19.90478,-19.15527 0,0 -2.93994,0 -2.93994,0 -0.37842,10.15235 -8.35644,18.36719 -18.43554,19.10254 z" /><path
           inkscape:connector-curvature="0"
           id="path56"
           style="fill:#f68712;fill-opacity:1;fill-rule:nonzero;stroke:none"
           d="m 263.60059,-439.98438 c 0.13476,0.01 0.26513,0.0361 0.39941,0.0483 0,0 0,-0.063 0,-0.063 -0.13281,0.007 -0.26758,0.005 -0.39941,0.0146 z" /><path
           inkscape:connector-curvature="0"
           id="path58"
           style="fill:#f68712;fill-opacity:1;fill-rule:nonzero;stroke:none"
           d="m 262.20605,-474.04102 c -30.18798,0 -54.65771,24.42383 -54.65771,54.54786 0,30.12597 24.46973,54.54687 54.65771,54.54687 1.35645,0 2.70215,-0.0508 4.03174,-0.14648 -28.30566,-2.06055 -50.62646,-25.62696 -50.62646,-54.40039 0,-28.00977 21.1543,-51.07569 48.38867,-54.18116 0,0 0,-0.333 0,-0.333 -0.5957,-0.02 -1.19336,-0.0337 -1.79395,-0.0337 z" /><path
           inkscape:connector-curvature="0"
           id="path60"
           style="fill:#f68712;fill-opacity:1;fill-rule:nonzero;stroke:none"
           d="m 262.87061,-444.48926 c -0.58448,-0.0435 -1.17627,-0.0659 -1.77344,-0.0659 -13.27783,0 -24.04102,10.74317 -24.04102,23.99268 0,13.25195 10.76319,23.99316 24.04102,23.99316 0.59717,0 1.18896,-0.0225 1.77344,-0.0644 -12.4502,-0.90723 -22.26807,-11.27246 -22.26807,-23.92871 0,-12.65527 9.81787,-23.02051 22.26807,-23.92676 z" /><path
           inkscape:connector-curvature="0"
           id="path62"
           style="fill:#f68712;fill-opacity:1;fill-rule:nonzero;stroke:none"
           d="m 264,-514.92773 c 0,0 0,0.0352 0,0.0352 0.0835,-0.006 0.1665,-0.0156 0.25,-0.0215 -0.083,-0.006 -0.16699,-0.008 -0.25,-0.0137 z" /><path
           inkscape:connector-curvature="0"
           id="path64"
           style="fill:#f68712;fill-opacity:1;fill-rule:nonzero;stroke:none"
           d="m 340.96094,-427.52441 c -0.2002,2.75537 -0.55664,5.4663 -1.03516,8.13476 0,0 1.1875,0 1.1875,0 0.0234,-0.79199 0.0596,-1.58056 0.0596,-2.37793 0,-1.93652 -0.0723,-3.85693 -0.21191,-5.75683 z" /><path
           inkscape:connector-curvature="0"
           id="path66"
           style="fill:#fabd55;fill-opacity:1;fill-rule:nonzero;stroke:none"
           d="m 278.73926,-505.10449 c -2.05908,0 -4.10059,0.0781 -6.12305,0.2251 42.98731,3.13525 76.88965,38.99804 76.88965,82.78418 0,0.90722 -0.0361,1.80517 -0.0654,2.70556 0,0 12.24219,0 12.24219,0 0.0283,-0.90039 0.0684,-1.79834 0.0684,-2.70556 0,-45.84473 -37.16407,-83.00928 -83.01172,-83.00928 z" /><path
           inkscape:connector-curvature="0"
           id="path68"
           style="fill:#fabd55;fill-opacity:1;fill-rule:nonzero;stroke:none"
           d="m 326.34277,-425.89063 c 0.11231,-1.47753 0.17286,-2.97119 0.17286,-4.47656 0,-33.15478 -27.88819,-60.08154 -62.51563,-60.66406 0,0 0,8.95117 0,8.95117 33.05518,0.55567 59.9668,25.11865 62.34277,56.18945 z" /><path
           inkscape:connector-curvature="0"
           id="path70"
           style="fill:#fabd55;fill-opacity:1;fill-rule:nonzero;stroke:none"
           d="m 268.15452,-465.54102 c -1.13916,0 -2.26905,0.043 -3.38526,0.12549 23.76465,1.72998 42.50537,21.51416 42.50537,45.67237 0,0.11816 -0.008,0.23535 -0.009,0.35351 0,0 6.76953,0 6.76953,0 9.7e-4,-0.11816 0.009,-0.23535 0.009,-0.35351 0,-25.292 -20.54444,-45.79786 -45.88965,-45.79786 z" /><path
           inkscape:connector-curvature="0"
           id="path72"
           style="fill:#fabd55;fill-opacity:1;fill-rule:nonzero;stroke:none"
           d="m 265.07129,-440.03857 c -0.36035,0 -0.71582,0.0205 -1.07129,0.0396 0,0 0,0.063 0,0.063 10.13477,0.94385 18.07227,9.43897 18.07227,19.79932 0,0.25195 -0.0269,0.49707 -0.0361,0.74707 0,0 2.93994,0 2.93994,0 0.009,-0.25 0.0376,-0.49512 0.0376,-0.74707 0,-10.99023 -8.92773,-19.90185 -19.94238,-19.90185 z" /><path
           inkscape:connector-curvature="0"
           id="path74"
           style="fill:#f68712;fill-opacity:1;fill-rule:nonzero;stroke:none"
           d="m 264,-474.00732 c 0,0 0,0.333 0,0.333 0.74219,-0.085 1.48682,-0.16259 2.23779,-0.21728 -0.74072,-0.0547 -1.48779,-0.0908 -2.23779,-0.11572 z" /><path
           inkscape:connector-curvature="0"
           id="path76"
           style="fill:none;stroke:#ffffff;stroke-width:3.07430005;stroke-linecap:round;stroke-linejoin:bevel;stroke-miterlimit:4;stroke-dasharray:0, 8.71051;stroke-dashoffset:0;stroke-opacity:1"
           d="m 372.7207,-396.44336 c -16.59668,44.30273 -43.01465,67.96973 -98.5581,76.05273" /><text
           id="text176"
           y="-481.3288"
           x="257.80899"
           style="font-style:normal;font-variant:normal;font-weight:bold;font-stretch:normal;font-size:26px;line-height:1.25;font-family:'Trebuchet MS';-inkscape-font-specification:'Trebuchet MS, Bold';font-variant-ligatures:normal;font-variant-caps:normal;font-variant-numeric:normal;font-feature-settings:normal;text-align:start;letter-spacing:0px;word-spacing:0px;writing-mode:lr-tb;text-anchor:start;fill:#000000;fill-opacity:1;stroke:none;stroke-width:0.75"
           xml:space="preserve"><tspan
             style="font-style:normal;font-variant:normal;font-weight:bold;font-stretch:normal;font-size:26px;font-family:'Trebuchet MS';-inkscape-font-specification:'Trebuchet MS, Bold';font-variant-ligatures:normal;font-variant-caps:normal;font-variant-numeric:normal;font-feature-settings:normal;text-align:start;writing-mode:lr-tb;text-anchor:start;stroke-width:0.75"
             y="-481.3288"
             x="257.80899"
             id="tspan174"
             sodipodi:role="line"><tspan
   id="tspan56"
   style="font-size:36px;fill:#3771c8;fill-opacity:1">D</tspan>épartemental</tspan></text>
<text
           id="text190"
           y="-511.67865"
           x="258.81415"
           style="font-style:normal;font-variant:normal;font-weight:bold;font-stretch:normal;font-size:28px;line-height:1.25;font-family:'Trebuchet MS';-inkscape-font-specification:'Trebuchet MS, Bold';font-variant-ligatures:normal;font-variant-caps:normal;font-variant-numeric:normal;font-feature-settings:normal;text-align:start;letter-spacing:0px;word-spacing:0px;writing-mode:lr-tb;text-anchor:start;fill:#000000;fill-opacity:1;stroke:none;stroke-width:0.75"
           xml:space="preserve"><tspan
             style="font-style:normal;font-variant:normal;font-weight:bold;font-stretch:normal;font-size:28px;font-family:'Trebuchet MS';-inkscape-font-specification:'Trebuchet MS, Bold';font-variant-ligatures:normal;font-variant-caps:normal;font-variant-numeric:normal;font-feature-settings:normal;text-align:start;writing-mode:lr-tb;text-anchor:start;stroke-width:0.75"
             y="-511.67865"
             x="258.81415"
             id="tspan188"
             sodipodi:role="line"><tspan
   id="tspan54"
   style="font-size:36px;fill:#3771c8;fill-opacity:1">S</tspan>yndicat</tspan></text>
<text
           id="text194"
           y="-451.68527"
           x="237.49422"
           style="font-style:normal;font-variant:normal;font-weight:bold;font-stretch:normal;font-size:28px;line-height:1.25;font-family:'Trebuchet MS';-inkscape-font-specification:'Trebuchet MS, Bold';font-variant-ligatures:normal;font-variant-caps:normal;font-variant-numeric:normal;font-feature-settings:normal;text-align:start;letter-spacing:0px;word-spacing:0px;writing-mode:lr-tb;text-anchor:start;fill:#000000;fill-opacity:1;stroke:none;stroke-width:0.75"
           xml:space="preserve"><tspan
             style="font-style:normal;font-variant:normal;font-weight:bold;font-stretch:normal;font-size:28px;font-family:'Trebuchet MS';-inkscape-font-specification:'Trebuchet MS, Bold';font-variant-ligatures:normal;font-variant-caps:normal;font-variant-numeric:normal;font-feature-settings:normal;text-align:start;writing-mode:lr-tb;text-anchor:start;stroke-width:0.75"
             y="-451.68527"
             x="237.49422"
             id="tspan192"
             sodipodi:role="line"><tspan
   id="tspan4777"
   style="font-style:normal;font-variant:normal;font-weight:normal;font-stretch:normal;font-size:28px;font-family:'Trebuchet MS';-inkscape-font-specification:'Trebuchet MS, Normal';font-variant-ligatures:normal;font-variant-caps:normal;font-variant-numeric:normal;font-feature-settings:normal;text-align:start;writing-mode:lr-tb;text-anchor:start">d'</tspan><tspan
   id="tspan4769"
   style="font-style:normal;font-variant:normal;font-weight:bold;font-stretch:normal;font-size:36px;font-family:'Trebuchet MS';-inkscape-font-specification:'Trebuchet MS, Bold';font-variant-ligatures:normal;font-variant-caps:normal;font-variant-numeric:normal;font-feature-settings:normal;text-align:start;writing-mode:lr-tb;text-anchor:start;fill:#3771c8">E</tspan>lectricité</tspan></text>
<text
           id="text4773"
           y="-422.4324"
           x="208.73712"
           style="font-style:normal;font-variant:normal;font-weight:normal;font-stretch:normal;font-size:28px;line-height:1.25;font-family:'Trebuchet MS';-inkscape-font-specification:'Trebuchet MS, Normal';font-variant-ligatures:normal;font-variant-caps:normal;font-variant-numeric:normal;font-feature-settings:normal;text-align:start;letter-spacing:0px;word-spacing:0px;writing-mode:lr-tb;text-anchor:start;fill:#000000;fill-opacity:1;stroke:none;stroke-width:0.75"
           xml:space="preserve"><tspan
             style="font-style:normal;font-variant:normal;font-weight:normal;font-stretch:normal;font-size:28px;font-family:'Trebuchet MS';-inkscape-font-specification:'Trebuchet MS, Normal';font-variant-ligatures:normal;font-variant-caps:normal;font-variant-numeric:normal;font-feature-settings:normal;text-align:start;writing-mode:lr-tb;text-anchor:start;stroke-width:0.75"
             y="-422.4324"
             x="208.73712"
             id="tspan4771"
             sodipodi:role="line">des <tspan
   id="tspan4775"
   style="font-style:normal;font-variant:normal;font-weight:bold;font-stretch:normal;font-size:28px;font-family:'Trebuchet MS';-inkscape-font-specification:'Trebuchet MS, Bold';font-variant-ligatures:normal;font-variant-caps:normal;font-variant-numeric:normal;font-feature-settings:normal;text-align:start;writing-mode:lr-tb;text-anchor:start"><tspan
   id="tspan60"
   style="font-size:36px;fill:#3771c8;fill-opacity:1">V</tspan>osges</tspan></tspan></text>
</g></g></g></svg>
