<?xml version="1.0" encoding="UTF-8" standalone="no"?>
<!-- DOCTYPE svg PUBLIC "-//W3C//DTD SVG 1.1//EN" "http://www.w3.org/Graphics/SVG/1.1/DTD/svg11.dtd" -->

<svg
   viewBox="0 0 377.95274 377.95274"
   preserveAspectRatio="xMidYMid"
   zoomAndPan="magnify"
   version="1.1"
   id="svg1305"
   sodipodi:docname="cand-ap.svg"
   width="100mm"
   height="100mm"
   inkscape:version="1.2.2 (732a01da63, 2022-12-09)"
   inkscape:export-filename="beton+foncx2.svg"
   inkscape:export-xdpi="90"
   inkscape:export-ydpi="90"
   xmlns:inkscape="http://www.inkscape.org/namespaces/inkscape"
   xmlns:sodipodi="http://sodipodi.sourceforge.net/DTD/sodipodi-0.dtd"
   xmlns="http://www.w3.org/2000/svg"
   xmlns:svg="http://www.w3.org/2000/svg">
  <defs
     id="defs1309">
    <linearGradient
       id="linearGradient19620"
       inkscape:swatch="solid">
      <stop
         style="stop-color:#a87153;stop-opacity:1"
         offset="0"
         id="stop19618" />
    </linearGradient>
  </defs>
  <sodipodi:namedview
     id="namedview1307"
     pagecolor="#ffffff"
     bordercolor="#666666"
     borderopacity="1.0"
     inkscape:showpageshadow="2"
     inkscape:pageopacity="0.0"
     inkscape:pagecheckerboard="0"
     inkscape:deskcolor="#d1d1d1"
     showgrid="false"
     inkscape:document-units="mm"
     inkscape:zoom="0.44070964"
     inkscape:cx="-9.0762707"
     inkscape:cy="282.49893"
     inkscape:window-width="1440"
     inkscape:window-height="750"
     inkscape:window-x="2393"
     inkscape:window-y="-7"
     inkscape:window-maximized="1"
     inkscape:current-layer="svg1305" />
  <ellipse
     style="fill:#ff0000;fill-opacity:1;stroke:#ff0000;stroke-width:50.6375;stroke-miterlimit:0;paint-order:stroke markers fill"
     id="path8732"
     cx="192.87077"
     cy="184.929"
     rx="144.96619"
     ry="125.33534" />
</svg>
