<?xml version="1.0" encoding="UTF-8" standalone="no"?>
<svg
   xmlns:osb="http://www.openswatchbook.org/uri/2009/osb"
   xmlns:dc="http://purl.org/dc/elements/1.1/"
   xmlns:cc="http://creativecommons.org/ns#"
   xmlns:rdf="http://www.w3.org/1999/02/22-rdf-syntax-ns#"
   xmlns:svg="http://www.w3.org/2000/svg"
   xmlns="http://www.w3.org/2000/svg"
   xmlns:sodipodi="http://sodipodi.sourceforge.net/DTD/sodipodi-0.dtd"
   xmlns:inkscape="http://www.inkscape.org/namespaces/inkscape"
   version="1.1"
   x="0px"
   y="0px"
   viewBox="0 0 1300 1300"
   id="svg2"
   inkscape:version="0.92.4 (5da689c313, 2019-01-14)"
   sodipodi:docname="smdev=foyer_mat_a_deposer.svg"
   width="130cm"
   height="130cm"
   style="enable-background:new">
  <metadata
     id="metadata16">
    <rdf:RDF>
      <cc:Work
         rdf:about="">
        <dc:format>image/svg+xml</dc:format>
        <dc:type
           rdf:resource="http://purl.org/dc/dcmitype/StillImage" />
        <dc:title></dc:title>
      </cc:Work>
    </rdf:RDF>
  </metadata>
  <defs
     id="defs14">
    <linearGradient
       id="linearGradient5169"
       osb:paint="solid">
      <stop
         style="stop-color:#000000;stop-opacity:1;"
         offset="0"
         id="stop5167" />
    </linearGradient>
    <marker
       inkscape:stockid="Tail"
       orient="auto"
       refY="0"
       refX="0"
       id="Tail"
       style="overflow:visible"
       inkscape:isstock="true">
      <g
         id="g4867"
         transform="scale(-1.2)"
         style="fill:#000000;fill-opacity:1;stroke:#000000;stroke-opacity:1">
        <path
           id="path4855"
           d="M -3.8048674,-3.9585227 0.54352094,0"
           style="fill:#000000;fill-opacity:1;fill-rule:evenodd;stroke:#000000;stroke-width:0.80000001;stroke-linecap:round;stroke-opacity:1"
           inkscape:connector-curvature="0" />
        <path
           id="path4857"
           d="M -1.2866832,-3.9585227 3.0617053,0"
           style="fill:#000000;fill-opacity:1;fill-rule:evenodd;stroke:#000000;stroke-width:0.80000001;stroke-linecap:round;stroke-opacity:1"
           inkscape:connector-curvature="0" />
        <path
           id="path4859"
           d="M 1.3053582,-3.9585227 5.6537466,0"
           style="fill:#000000;fill-opacity:1;fill-rule:evenodd;stroke:#000000;stroke-width:0.80000001;stroke-linecap:round;stroke-opacity:1"
           inkscape:connector-curvature="0" />
        <path
           id="path4861"
           d="M -3.8048674,4.1775838 0.54352094,0.21974226"
           style="fill:#000000;fill-opacity:1;fill-rule:evenodd;stroke:#000000;stroke-width:0.80000001;stroke-linecap:round;stroke-opacity:1"
           inkscape:connector-curvature="0" />
        <path
           id="path4863"
           d="M -1.2866832,4.1775838 3.0617053,0.21974226"
           style="fill:#000000;fill-opacity:1;fill-rule:evenodd;stroke:#000000;stroke-width:0.80000001;stroke-linecap:round;stroke-opacity:1"
           inkscape:connector-curvature="0" />
        <path
           id="path4865"
           d="M 1.3053582,4.1775838 5.6537466,0.21974226"
           style="fill:#000000;fill-opacity:1;fill-rule:evenodd;stroke:#000000;stroke-width:0.80000001;stroke-linecap:round;stroke-opacity:1"
           inkscape:connector-curvature="0" />
      </g>
    </marker>
    <linearGradient
       id="linearGradient4815"
       osb:paint="solid">
      <stop
         style="stop-color:#000000;stop-opacity:1;"
         offset="0"
         id="stop4813" />
    </linearGradient>
    <linearGradient
       id="linearGradient4809"
       osb:paint="solid">
      <stop
         style="stop-color:#000000;stop-opacity:1;"
         offset="0"
         id="stop4807" />
    </linearGradient>
    <linearGradient
       id="linearGradient8113"
       osb:paint="solid">
      <stop
         style="stop-color:#000000;stop-opacity:1;"
         offset="0"
         id="stop8115" />
    </linearGradient>
    <inkscape:path-effect
       effect="spiro"
       id="path-effect8121"
       is_visible="true" />
    <inkscape:path-effect
       effect="spiro"
       id="path-effect8117"
       is_visible="true" />
    <inkscape:path-effect
       effect="spiro"
       id="path-effect8113"
       is_visible="true" />
    <inkscape:path-effect
       effect="spiro"
       id="path-effect8109"
       is_visible="true" />
    <inkscape:path-effect
       effect="spiro"
       id="path-effect8100"
       is_visible="true" />
    <inkscape:path-effect
       effect="spiro"
       id="path-effect8096"
       is_visible="true" />
    <inkscape:path-effect
       effect="spiro"
       id="path-effect8098"
       is_visible="true" />
    <inkscape:path-effect
       effect="spiro"
       id="path-effect8146"
       is_visible="true" />
    <inkscape:path-effect
       effect="spiro"
       id="path-effect8142"
       is_visible="true" />
    <inkscape:path-effect
       effect="spiro"
       id="path-effect8138"
       is_visible="true" />
    <inkscape:path-effect
       effect="spiro"
       id="path-effect8134"
       is_visible="true" />
    <linearGradient
       id="linearGradient8108"
       osb:paint="solid">
      <stop
         style="stop-color:#000000;stop-opacity:0.76417911;"
         offset="0"
         id="stop8110" />
    </linearGradient>
    <linearGradient
       id="linearGradient8098"
       osb:paint="solid">
      <stop
         style="stop-color:#000000;stop-opacity:1;"
         offset="0"
         id="stop8100" />
    </linearGradient>
    <linearGradient
       id="linearGradient8092"
       osb:paint="solid">
      <stop
         style="stop-color:#000000;stop-opacity:1;"
         offset="0"
         id="stop8094" />
    </linearGradient>
    <linearGradient
       id="linearGradient8086"
       osb:paint="solid">
      <stop
         style="stop-color:#000007;stop-opacity:1;"
         offset="0"
         id="stop8088" />
    </linearGradient>
    <linearGradient
       id="linearGradient8080"
       osb:paint="solid">
      <stop
         style="stop-color:#000000;stop-opacity:1;"
         offset="0"
         id="stop8082" />
    </linearGradient>
    <inkscape:path-effect
       effect="spiro"
       id="path-effect8098-0"
       is_visible="true" />
    <inkscape:path-effect
       effect="spiro"
       id="path-effect8098-2"
       is_visible="true" />
    <inkscape:path-effect
       effect="spiro"
       id="path-effect8098-2-2"
       is_visible="true" />
    <filter
       inkscape:collect="always"
       style="color-interpolation-filters:sRGB"
       id="filter8472">
      <feBlend
         inkscape:collect="always"
         mode="screen"
         in2="BackgroundImage"
         id="feBlend8474" />
    </filter>
    <filter
       inkscape:menu-tooltip="In and out glow with a possible offset and colorizable flood"
       inkscape:menu="Shadows and Glows"
       inkscape:label="Cutout Glow"
       style="color-interpolation-filters:sRGB"
       id="filter8479">
      <feOffset
         dy="3"
         dx="3"
         id="feOffset8481" />
      <feGaussianBlur
         stdDeviation="3"
         result="blur"
         id="feGaussianBlur8483" />
      <feFlood
         flood-color="rgb(0,0,0)"
         flood-opacity="1"
         result="flood"
         id="feFlood8485" />
      <feComposite
         in="flood"
         in2="SourceGraphic"
         operator="in"
         result="composite"
         id="feComposite8487" />
      <feBlend
         in="blur"
         in2="composite"
         mode="normal"
         id="feBlend8489" />
    </filter>
    <filter
       inkscape:menu-tooltip="In and out glow with a possible offset and colorizable flood"
       inkscape:menu="Shadows and Glows"
       inkscape:label="Cutout Glow"
       style="color-interpolation-filters:sRGB"
       id="filter8491">
      <feOffset
         dy="3"
         dx="3"
         id="feOffset8493" />
      <feGaussianBlur
         stdDeviation="3"
         result="blur"
         id="feGaussianBlur8495" />
      <feFlood
         flood-color="rgb(0,0,0)"
         flood-opacity="1"
         result="flood"
         id="feFlood8497" />
      <feComposite
         in="flood"
         in2="SourceGraphic"
         operator="in"
         result="composite"
         id="feComposite8499" />
      <feBlend
         in="blur"
         in2="composite"
         mode="normal"
         id="feBlend8501" />
    </filter>
    <filter
       y="-0.25"
       height="1.5"
       inkscape:menu-tooltip="Darkens the edge with an inner blur and adds a flexible glow"
       inkscape:menu="Shadows and Glows"
       inkscape:label="Dark And Glow"
       style="color-interpolation-filters:sRGB"
       id="filter8503">
      <feGaussianBlur
         stdDeviation="5"
         result="result6"
         id="feGaussianBlur8505" />
      <feComposite
         result="result8"
         in="SourceGraphic"
         operator="atop"
         in2="result6"
         id="feComposite8507" />
      <feComposite
         result="result9"
         operator="over"
         in2="SourceAlpha"
         in="result8"
         id="feComposite8509" />
      <feColorMatrix
         values="1 0 0 0 0 0 1 0 0 0 0 0 1 0 0 0 0 0 1 0 "
         result="result10"
         id="feColorMatrix8511" />
      <feBlend
         in="result10"
         mode="normal"
         in2="result6"
         id="feBlend8513" />
    </filter>
    <filter
       style="color-interpolation-filters:sRGB"
       inkscape:label="Dark And Glow"
       id="filter8575"
       y="-0.25"
       height="1.5"
       inkscape:menu-tooltip="Darkens the edge with an inner blur and adds a flexible glow"
       inkscape:menu="Shadows and Glows">
      <feFlood
         flood-opacity="0.32549"
         flood-color="rgb(0,0,0)"
         result="flood"
         id="feFlood8577" />
      <feComposite
         in="flood"
         in2="SourceGraphic"
         operator="in"
         result="composite1"
         id="feComposite8579" />
      <feGaussianBlur
         in="composite1"
         stdDeviation="3"
         result="blur"
         id="feGaussianBlur8581" />
      <feOffset
         dx="6"
         dy="6"
         result="offset"
         id="feOffset8583" />
      <feComposite
         in="SourceGraphic"
         in2="offset"
         operator="over"
         result="fbSourceGraphic"
         id="feComposite8585" />
      <feColorMatrix
         result="fbSourceGraphicAlpha"
         in="fbSourceGraphic"
         values="0 0 0 -1 0 0 0 0 -1 0 0 0 0 -1 0 0 0 0 1 0"
         id="feColorMatrix8627" />
      <feGaussianBlur
         id="feGaussianBlur8629"
         stdDeviation="5"
         result="result6"
         in="fbSourceGraphic" />
      <feComposite
         id="feComposite8631"
         in2="result6"
         result="result8"
         in="fbSourceGraphic"
         operator="atop" />
      <feComposite
         id="feComposite8633"
         in2="fbSourceGraphicAlpha"
         result="result9"
         operator="over"
         in="result8" />
      <feColorMatrix
         id="feColorMatrix8635"
         values="1 0 0 0 0 0 1 0 0 0 0 0 1 0 0 0 0 0 1 0 "
         result="result10" />
      <feBlend
         id="feBlend8637"
         in2="result6"
         in="result10"
         mode="normal" />
    </filter>
  </defs>
  <sodipodi:namedview
     pagecolor="#ffffff"
     bordercolor="#666666"
     borderopacity="1"
     objecttolerance="10"
     gridtolerance="10"
     guidetolerance="10"
     inkscape:pageopacity="0"
     inkscape:pageshadow="2"
     inkscape:window-width="1024"
     inkscape:window-height="705"
     id="namedview12"
     showgrid="true"
     inkscape:zoom="0.03125"
     inkscape:cx="2536.5432"
     inkscape:cy="2105.8934"
     inkscape:window-x="-8"
     inkscape:window-y="-8"
     inkscape:window-maximized="1"
     inkscape:current-layer="svg2"
     inkscape:snap-bbox="true"
     showguides="true"
     units="cm"
     inkscape:document-units="cm"
     inkscape:snap-object-midpoints="true"
     inkscape:measure-start="5618.64,2381.36"
     inkscape:measure-end="5138.9,2560"
     inkscape:snap-page="true"
     inkscape:snap-midpoints="true"
     inkscape:snap-bbox-midpoints="true"
     inkscape:snap-bbox-edge-midpoints="true"
     inkscape:bbox-paths="true"
     inkscape:bbox-nodes="true"
     inkscape:object-paths="true"
     inkscape:snap-intersection-paths="true"
     inkscape:snap-smooth-nodes="true"
     inkscape:snap-center="true"
     inkscape:showpageshadow="false"
     inkscape:snap-grids="false"
     inkscape:snap-to-guides="true"
     inkscape:guide-bbox="true">
    <inkscape:grid
       type="xygrid"
       id="grid8076"
       enabled="true" />
    <sodipodi:guide
       position="1300,1300"
       orientation="-0.70710678,0.70710678"
       id="guide942"
       inkscape:locked="false" />
    <sodipodi:guide
       position="0,1300"
       orientation="0.70710678,0.70710678"
       id="guide944"
       inkscape:locked="false" />
  </sodipodi:namedview>
  <g
     id="g8476"
     style="filter:url(#filter8491)"
     transform="translate(385.41316,2856.4892)" />
  <g
     inkscape:groupmode="layer"
     id="layer1"
     inkscape:label="Layer 1"
     style="display:none;filter:url(#filter8472)"
     transform="translate(0,3017.2835)" />
  <g
     id="g940"
     transform="matrix(1.000867,0,0,0.9931079,0.13645994,11.803165)">
    <path
       inkscape:transform-center-y="675.82192"
       inkscape:transform-center-x="-337.90574"
       transform="matrix(0.99999717,-0.00237957,1.9301256e-4,0.99999998,0,0)"
       d="m 1160.4682,1260.4546 a 211.66705,41.807274 0 0 1 -211.5904,41.8073 211.66705,41.807274 0 0 1 -211.74365,-41.777 211.66705,41.807274 0 0 1 211.43703,-41.8376 211.66705,41.807274 0 0 1 211.89682,41.7467"
       sodipodi:open="true"
       sodipodi:end="6.2817367"
       sodipodi:start="0"
       sodipodi:ry="41.807274"
       sodipodi:rx="211.66705"
       sodipodi:cy="1260.4546"
       sodipodi:cx="948.80115"
       sodipodi:type="arc"
       id="path5161"
       style="opacity:1;fill:none;fill-opacity:0.98820759;fill-rule:nonzero;stroke:none;stroke-width:59.62609482;stroke-linecap:butt;stroke-linejoin:miter;stroke-miterlimit:4;stroke-dasharray:178.87828748, 59.62609583;stroke-dashoffset:113.38582611;stroke-opacity:1;paint-order:markers fill stroke" />
    <ellipse
       inkscape:transform-center-y="60.251"
       inkscape:transform-center-x="-38.164578"
       ry="631.50006"
       rx="639.44739"
       transform="matrix(0.99999717,-0.00237957,1.9301256e-4,0.99999998,0,0)"
       cy="644.17065"
       cx="649.1781"
       id="path4647"
       style="color:#000000;clip-rule:nonzero;display:inline;overflow:visible;visibility:visible;opacity:1;isolation:auto;mix-blend-mode:normal;color-interpolation:sRGB;color-interpolation-filters:linearRGB;solid-color:#000000;solid-opacity:1;fill:#ffffff;fill-opacity:1;fill-rule:evenodd;stroke:#000000;stroke-width:19.58476067;stroke-linecap:butt;stroke-linejoin:miter;stroke-miterlimit:4;stroke-dasharray:58.75427604, 19.58475868;stroke-dashoffset:0;stroke-opacity:1;color-rendering:auto;image-rendering:auto;shape-rendering:auto;text-rendering:auto;enable-background:accumulate" />
    <ellipse
       inkscape:transform-center-y="60.251"
       inkscape:transform-center-x="-38.164578"
       ry="484.0983"
       rx="490.19061"
       transform="matrix(0.99999717,-0.00237957,1.9301256e-4,0.99999998,0,0)"
       cy="644.17065"
       cx="649.1781"
       id="path940"
       style="color:#000000;clip-rule:nonzero;display:inline;overflow:visible;visibility:visible;opacity:1;isolation:auto;mix-blend-mode:normal;color-interpolation:sRGB;color-interpolation-filters:linearRGB;solid-color:#000000;solid-opacity:1;fill:#a5a5a5;fill-opacity:1;fill-rule:evenodd;stroke:#000000;stroke-width:19.49840164;stroke-linecap:butt;stroke-linejoin:miter;stroke-miterlimit:4;stroke-dasharray:none;stroke-dashoffset:0;stroke-opacity:1;color-rendering:auto;image-rendering:auto;shape-rendering:auto;text-rendering:auto;enable-background:accumulate" />
  </g>
</svg>
