<?xml version="1.0" encoding="UTF-8" standalone="no"?>
<svg
   xmlns:osb="http://www.openswatchbook.org/uri/2009/osb"
   xmlns:dc="http://purl.org/dc/elements/1.1/"
   xmlns:cc="http://creativecommons.org/ns#"
   xmlns:rdf="http://www.w3.org/1999/02/22-rdf-syntax-ns#"
   xmlns:svg="http://www.w3.org/2000/svg"
   xmlns="http://www.w3.org/2000/svg"
   xmlns:sodipodi="http://sodipodi.sourceforge.net/DTD/sodipodi-0.dtd"
   xmlns:inkscape="http://www.inkscape.org/namespaces/inkscape"
   version="1.1"
   x="0px"
   y="0px"
   viewBox="0 0 2721.2599 2721.2598"
   id="svg2"
   inkscape:version="0.92.4 (5da689c313, 2019-01-14)"
   sodipodi:docname="smdev=mat_double_a_deposer.svg"
   width="72cm"
   height="72cm">
  <metadata
     id="metadata16">
    <rdf:RDF>
      <cc:Work
         rdf:about="">
        <dc:format>image/svg+xml</dc:format>
        <dc:type
           rdf:resource="http://purl.org/dc/dcmitype/StillImage" />
        <dc:title></dc:title>
      </cc:Work>
    </rdf:RDF>
  </metadata>
  <defs
     id="defs14">
    <inkscape:path-effect
       effect="spiro"
       id="path-effect5080"
       is_visible="true" />
    <linearGradient
       id="linearGradient5072"
       osb:paint="solid">
      <stop
         style="stop-color:#000000;stop-opacity:1;"
         offset="0"
         id="stop5070" />
    </linearGradient>
    <inkscape:path-effect
       effect="spiro"
       id="path-effect5068"
       is_visible="true" />
    <linearGradient
       id="linearGradient5094"
       osb:paint="solid">
      <stop
         style="stop-color:#ffff00;stop-opacity:1;"
         offset="0"
         id="stop5092" />
    </linearGradient>
    <inkscape:path-effect
       effect="spiro"
       id="path-effect5090"
       is_visible="true" />
    <inkscape:path-effect
       effect="spiro"
       id="path-effect5086"
       is_visible="true" />
    <inkscape:path-effect
       effect="spiro"
       id="path-effect5082"
       is_visible="true" />
    <marker
       inkscape:stockid="Tail"
       orient="auto"
       refY="0"
       refX="0"
       id="Tail"
       style="overflow:visible"
       inkscape:isstock="true">
      <g
         id="g4942"
         transform="scale(-1.2)"
         style="fill:#000000;fill-opacity:1;stroke:#000000;stroke-opacity:1">
        <path
           id="path4930"
           d="M -3.8048674,-3.9585227 0.54352094,0"
           style="fill:#000000;fill-opacity:1;fill-rule:evenodd;stroke:#000000;stroke-width:0.80000001;stroke-linecap:round;stroke-opacity:1"
           inkscape:connector-curvature="0" />
        <path
           id="path4932"
           d="M -1.2866832,-3.9585227 3.0617053,0"
           style="fill:#000000;fill-opacity:1;fill-rule:evenodd;stroke:#000000;stroke-width:0.80000001;stroke-linecap:round;stroke-opacity:1"
           inkscape:connector-curvature="0" />
        <path
           id="path4934"
           d="M 1.3053582,-3.9585227 5.6537466,0"
           style="fill:#000000;fill-opacity:1;fill-rule:evenodd;stroke:#000000;stroke-width:0.80000001;stroke-linecap:round;stroke-opacity:1"
           inkscape:connector-curvature="0" />
        <path
           id="path4936"
           d="M -3.8048674,4.1775838 0.54352094,0.21974226"
           style="fill:#000000;fill-opacity:1;fill-rule:evenodd;stroke:#000000;stroke-width:0.80000001;stroke-linecap:round;stroke-opacity:1"
           inkscape:connector-curvature="0" />
        <path
           id="path4938"
           d="M -1.2866832,4.1775838 3.0617053,0.21974226"
           style="fill:#000000;fill-opacity:1;fill-rule:evenodd;stroke:#000000;stroke-width:0.80000001;stroke-linecap:round;stroke-opacity:1"
           inkscape:connector-curvature="0" />
        <path
           id="path4940"
           d="M 1.3053582,4.1775838 5.6537466,0.21974226"
           style="fill:#000000;fill-opacity:1;fill-rule:evenodd;stroke:#000000;stroke-width:0.80000001;stroke-linecap:round;stroke-opacity:1"
           inkscape:connector-curvature="0" />
      </g>
    </marker>
    <inkscape:path-effect
       effect="spiro"
       id="path-effect6757"
       is_visible="true" />
    <marker
       inkscape:stockid="SquareS"
       orient="auto"
       refY="0"
       refX="0"
       id="SquareS"
       style="overflow:visible"
       inkscape:isstock="true">
      <path
         id="path4941"
         d="M -5,-5 V 5 H 5 V -5 Z"
         style="fill:#000000;fill-opacity:1;fill-rule:evenodd;stroke:#000000;stroke-width:1.00000003pt;stroke-opacity:1"
         transform="scale(0.2)"
         inkscape:connector-curvature="0" />
    </marker>
    <marker
       inkscape:stockid="Arrow2Send"
       orient="auto"
       refY="0"
       refX="0"
       id="Arrow2Send"
       style="overflow:visible"
       inkscape:isstock="true">
      <path
         id="path4898"
         style="fill:#000000;fill-opacity:1;fill-rule:evenodd;stroke:#000000;stroke-width:0.625;stroke-linejoin:round;stroke-opacity:1"
         d="M 8.7185878,4.0337352 -2.2072895,0.01601326 8.7185884,-4.0017078 c -1.7454984,2.3720609 -1.7354408,5.6174519 -6e-7,8.035443 z"
         transform="matrix(-0.3,0,0,-0.3,0.69,0)"
         inkscape:connector-curvature="0" />
    </marker>
    <inkscape:path-effect
       effect="spiro"
       id="path-effect5766"
       is_visible="true" />
    <marker
       inkscape:stockid="ExperimentalArrow"
       orient="auto-start-reverse"
       refY="3"
       refX="5"
       id="ExperimentalArrow"
       inkscape:isstock="true">
      <path
         id="path5118"
         d="M 10,3 0,6 V 0 Z"
         style="fill:#000000;fill-opacity:1;stroke:#000000;stroke-opacity:1"
         inkscape:connector-curvature="0" />
    </marker>
    <marker
       inkscape:stockid="Torso"
       orient="auto"
       refY="0"
       refX="0"
       id="Torso"
       style="overflow:visible"
       inkscape:isstock="true">
      <g
         id="g5091"
         transform="scale(0.7)"
         style="fill:#000000;fill-opacity:1;stroke:#000000;stroke-opacity:1">
        <path
           id="path5077"
           d="m -4.7792281,-3.239542 c 2.350374,0.3659393 5.30026732,1.9375477 5.03715532,3.62748546 C -0.00518779,2.0778819 -2.2126741,2.6176539 -4.5630471,2.2517169 -6.9134221,1.8857769 -8.521035,0.75201414 -8.257922,-0.93792336 -7.994809,-2.6278615 -7.1296041,-3.6054813 -4.7792281,-3.239542 Z"
           style="fill:#000000;fill-opacity:1;fill-rule:evenodd;stroke:#000000;stroke-width:1.25;stroke-opacity:1"
           inkscape:connector-curvature="0" />
        <path
           id="path5079"
           d="M 4.4598789,0.08866574 C -2.5564571,-4.378332 5.2248769,-3.9061806 -0.84829578,-8.7197331"
           style="fill:#000000;fill-opacity:1;fill-rule:evenodd;stroke:#000000;stroke-width:1.00000003pt;stroke-opacity:1"
           inkscape:connector-curvature="0" />
        <path
           id="path5081"
           d="M 4.9298719,0.05752074 C -1.3872731,1.7494689 1.8027579,5.4782079 -4.9448731,7.5462725"
           style="fill:#000000;fill-opacity:1;fill-rule:evenodd;stroke:#000000;stroke-width:1.00000003pt;stroke-opacity:1"
           inkscape:connector-curvature="0" />
        <rect
           id="rect5083"
           transform="matrix(0.527536,-0.849533,0.887668,0.460484,0,0)"
           y="-1.7408575"
           x="-10.391706"
           height="2.7608147"
           width="2.6366582"
           style="fill:#000000;fill-opacity:1;fill-rule:evenodd;stroke:#000000;stroke-width:1.00000003pt;stroke-opacity:1" />
        <rect
           id="rect5085"
           transform="matrix(0.671205,-0.741272,0.790802,0.612072,0,0)"
           y="-7.9629307"
           x="4.9587269"
           height="2.8614161"
           width="2.7327356"
           style="fill:#000000;fill-opacity:1;fill-rule:evenodd;stroke:#000000;stroke-width:1.00000003pt;stroke-opacity:1" />
        <path
           id="path5087"
           transform="matrix(0,-1.109517,1.109517,0,25.96648,19.71619)"
           d="m 16.779951,-28.685045 a 0.60731727,0.60731727 0 1 0 -1.214634,0 0.60731727,0.60731727 0 1 0 1.214634,0 z"
           style="fill:#000000;fill-opacity:1;fill-rule:evenodd;stroke:#000000;stroke-width:1.00000003pt;stroke-opacity:1"
           inkscape:connector-curvature="0" />
        <path
           id="path5089"
           transform="matrix(0,-1.109517,1.109517,0,26.8245,16.99126)"
           d="m 16.779951,-28.685045 a 0.60731727,0.60731727 0 1 0 -1.214634,0 0.60731727,0.60731727 0 1 0 1.214634,0 z"
           style="fill:#000000;fill-opacity:1;fill-rule:evenodd;stroke:#000000;stroke-width:1.00000003pt;stroke-opacity:1"
           inkscape:connector-curvature="0" />
      </g>
    </marker>
    <marker
       inkscape:stockid="Arrow1Lend"
       orient="auto"
       refY="0"
       refX="0"
       id="Arrow1Lend"
       style="overflow:visible"
       inkscape:isstock="true">
      <path
         id="path4868"
         d="M 0,0 5,-5 -12.5,0 5,5 Z"
         style="fill:#000000;fill-opacity:1;fill-rule:evenodd;stroke:#000000;stroke-width:1.00000003pt;stroke-opacity:1"
         transform="matrix(-0.8,0,0,-0.8,-10,0)"
         inkscape:connector-curvature="0" />
    </marker>
    <marker
       inkscape:stockid="Arrow2Lstart"
       orient="auto"
       refY="0"
       refX="0"
       id="Arrow2Lstart"
       style="overflow:visible"
       inkscape:isstock="true">
      <path
         id="path4883"
         style="fill:#000000;fill-opacity:1;fill-rule:evenodd;stroke:#000000;stroke-width:0.625;stroke-linejoin:round;stroke-opacity:1"
         d="M 8.7185878,4.0337352 -2.2072895,0.01601326 8.7185884,-4.0017078 c -1.7454984,2.3720609 -1.7354408,5.6174519 -6e-7,8.035443 z"
         transform="matrix(1.1,0,0,1.1,1.1,0)"
         inkscape:connector-curvature="0" />
    </marker>
    <marker
       inkscape:stockid="Arrow1Mstart"
       orient="auto"
       refY="0"
       refX="0"
       id="Arrow1Mstart"
       style="overflow:visible"
       inkscape:isstock="true">
      <path
         id="path4871"
         d="M 0,0 5,-5 -12.5,0 5,5 Z"
         style="fill:#000000;fill-opacity:1;fill-rule:evenodd;stroke:#000000;stroke-width:1.00000003pt;stroke-opacity:1"
         transform="matrix(0.4,0,0,0.4,4,0)"
         inkscape:connector-curvature="0" />
    </marker>
    <marker
       inkscape:stockid="Arrow1Lstart"
       orient="auto"
       refY="0"
       refX="0"
       id="Arrow1Lstart"
       style="overflow:visible"
       inkscape:isstock="true">
      <path
         id="path4865"
         d="M 0,0 5,-5 -12.5,0 5,5 Z"
         style="fill:#000000;fill-opacity:1;fill-rule:evenodd;stroke:#000000;stroke-width:1.00000003pt;stroke-opacity:1"
         transform="matrix(0.8,0,0,0.8,10,0)"
         inkscape:connector-curvature="0" />
    </marker>
    <linearGradient
       id="linearGradient4861"
       osb:paint="solid">
      <stop
         style="stop-color:#000000;stop-opacity:1;"
         offset="0"
         id="stop4859" />
    </linearGradient>
    <inkscape:path-effect
       effect="spiro"
       id="path-effect4857"
       is_visible="true" />
    <inkscape:path-effect
       is_visible="true"
       id="path-effect8510"
       effect="spiro" />
    <inkscape:path-effect
       effect="spiro"
       id="path-effect8502"
       is_visible="true" />
    <inkscape:path-effect
       effect="spiro"
       id="path-effect8498"
       is_visible="true" />
    <inkscape:path-effect
       effect="spiro"
       id="path-effect8494"
       is_visible="true" />
    <inkscape:path-effect
       effect="spiro"
       id="path-effect8490"
       is_visible="true" />
    <inkscape:path-effect
       effect="spiro"
       id="path-effect4797"
       is_visible="true" />
    <inkscape:path-effect
       effect="spiro"
       id="path-effect8121"
       is_visible="true" />
    <inkscape:path-effect
       effect="spiro"
       id="path-effect8117"
       is_visible="true" />
    <inkscape:path-effect
       effect="spiro"
       id="path-effect8113"
       is_visible="true" />
    <inkscape:path-effect
       effect="spiro"
       id="path-effect8109"
       is_visible="true" />
    <inkscape:path-effect
       effect="spiro"
       id="path-effect8100"
       is_visible="true" />
    <inkscape:path-effect
       effect="spiro"
       id="path-effect8096"
       is_visible="true" />
    <inkscape:path-effect
       effect="spiro"
       id="path-effect8098"
       is_visible="true" />
    <inkscape:path-effect
       effect="spiro"
       id="path-effect8146"
       is_visible="true" />
    <inkscape:path-effect
       effect="spiro"
       id="path-effect8142"
       is_visible="true" />
    <inkscape:path-effect
       effect="spiro"
       id="path-effect8138"
       is_visible="true" />
    <inkscape:path-effect
       effect="spiro"
       id="path-effect8134"
       is_visible="true" />
    <linearGradient
       id="linearGradient8108"
       osb:paint="solid">
      <stop
         style="stop-color:#000000;stop-opacity:1;"
         offset="0"
         id="stop8110" />
    </linearGradient>
    <linearGradient
       id="linearGradient8098"
       osb:paint="solid">
      <stop
         style="stop-color:#000000;stop-opacity:1;"
         offset="0"
         id="stop8100" />
    </linearGradient>
    <linearGradient
       id="linearGradient8092"
       osb:paint="solid">
      <stop
         style="stop-color:#000000;stop-opacity:1;"
         offset="0"
         id="stop8094" />
    </linearGradient>
    <linearGradient
       id="linearGradient8086"
       osb:paint="solid">
      <stop
         style="stop-color:#000007;stop-opacity:1;"
         offset="0"
         id="stop8088" />
    </linearGradient>
    <linearGradient
       id="linearGradient8080"
       osb:paint="solid">
      <stop
         style="stop-color:#000000;stop-opacity:1;"
         offset="0"
         id="stop8082" />
    </linearGradient>
    <inkscape:path-effect
       is_visible="true"
       id="path-effect8510-6"
       effect="spiro" />
    <marker
       inkscape:stockid="Arrow2Send"
       orient="auto"
       refY="0"
       refX="0"
       id="Arrow2Send-5"
       style="overflow:visible"
       inkscape:isstock="true">
      <path
         id="path4898-7"
         style="fill:#000000;fill-opacity:1;fill-rule:evenodd;stroke:#000000;stroke-width:0.625;stroke-linejoin:round;stroke-opacity:1"
         d="M 8.7185878,4.0337352 -2.2072895,0.01601326 8.7185884,-4.0017078 c -1.7454984,2.3720609 -1.7354408,5.6174519 -6e-7,8.035443 z"
         transform="matrix(-0.3,0,0,-0.3,0.69,0)"
         inkscape:connector-curvature="0" />
    </marker>
    <inkscape:path-effect
       effect="spiro"
       id="path-effect6757-8"
       is_visible="true" />
    <inkscape:path-effect
       effect="spiro"
       id="path-effect8639"
       is_visible="true" />
    <inkscape:path-effect
       effect="spiro"
       id="path-effect5245"
       is_visible="true" />
    <inkscape:path-effect
       effect="spiro"
       id="path-effect5099-3"
       is_visible="true" />
    <inkscape:path-effect
       effect="spiro"
       id="path-effect5099"
       is_visible="true" />
    <inkscape:path-effect
       effect="spiro"
       id="path-effect8639-9"
       is_visible="true" />
    <inkscape:path-effect
       effect="spiro"
       id="path-effect5245-6"
       is_visible="true" />
    <inkscape:path-effect
       effect="spiro"
       id="path-effect5099-3-5"
       is_visible="true" />
    <inkscape:path-effect
       effect="spiro"
       id="path-effect5099-9"
       is_visible="true" />
    <inkscape:path-effect
       effect="spiro"
       id="path-effect8639-4"
       is_visible="true" />
    <inkscape:path-effect
       effect="spiro"
       id="path-effect5245-4"
       is_visible="true" />
    <inkscape:path-effect
       effect="spiro"
       id="path-effect5099-3-7"
       is_visible="true" />
    <inkscape:path-effect
       effect="spiro"
       id="path-effect5099-5"
       is_visible="true" />
    <inkscape:path-effect
       effect="spiro"
       id="path-effect8639-4-2"
       is_visible="true" />
    <inkscape:path-effect
       effect="spiro"
       id="path-effect5245-4-8"
       is_visible="true" />
    <inkscape:path-effect
       effect="spiro"
       id="path-effect5099-3-7-0"
       is_visible="true" />
    <inkscape:path-effect
       effect="spiro"
       id="path-effect5099-5-6"
       is_visible="true" />
    <inkscape:path-effect
       effect="spiro"
       id="path-effect5080-4"
       is_visible="true" />
  </defs>
  <sodipodi:namedview
     pagecolor="#ffffff"
     bordercolor="#666666"
     borderopacity="1"
     objecttolerance="10"
     gridtolerance="10"
     guidetolerance="10"
     inkscape:pageopacity="0"
     inkscape:pageshadow="2"
     inkscape:window-width="1024"
     inkscape:window-height="705"
     id="namedview12"
     showgrid="true"
     inkscape:zoom="0.12499999"
     inkscape:cx="973.76367"
     inkscape:cy="1185.9131"
     inkscape:window-x="-8"
     inkscape:window-y="-8"
     inkscape:window-maximized="1"
     inkscape:current-layer="svg2"
     inkscape:snap-bbox="true"
     inkscape:lockguides="false"
     inkscape:snap-midpoints="true"
     inkscape:snap-smooth-nodes="true"
     inkscape:document-units="cm"
     units="cm"
     inkscape:snap-page="true"
     inkscape:snap-grids="true"
     inkscape:snap-to-guides="true"
     inkscape:snap-object-midpoints="true"
     inkscape:object-nodes="true"
     inkscape:snap-intersection-paths="true"
     inkscape:snap-nodes="true"
     inkscape:snap-center="true"
     inkscape:snap-others="true"
     inkscape:object-paths="true"
     inkscape:bbox-nodes="true"
     inkscape:snap-bbox-edge-midpoints="true"
     inkscape:snap-bbox-midpoints="true"
     inkscape:bbox-paths="true"
     inkscape:snap-text-baseline="true"
     inkscape:showpageshadow="false"
     fit-margin-top="0"
     fit-margin-left="0"
     fit-margin-right="0"
     fit-margin-bottom="0"
     showguides="true"
     inkscape:guide-bbox="true">
    <inkscape:grid
       type="xygrid"
       id="grid8076"
       originx="0.19811706"
       originy="0.018670537" />
    <sodipodi:guide
       position="2721.2599,2721.2599"
       orientation="-0.70710678,0.70710678"
       id="guide1114"
       inkscape:locked="false" />
    <sodipodi:guide
       position="0,2721.2598"
       orientation="0.70710678,0.70710678"
       id="guide1116"
       inkscape:locked="false" />
  </sodipodi:namedview>
  <path
     inkscape:connector-curvature="0"
     id="path6-0"
     d="m 337.04753,221.18188 -100.7665,170.07183 100.7665,170.06928 H 538.58051 L 639.34699,391.25371 538.58051,221.18188 Z m 100.76648,73.54569 c 55.65178,0 100.7665,43.21624 100.7665,96.52614 0,53.30991 -45.11472,96.52616 -100.7665,96.52616 -55.65177,0 -100.76648,-43.21626 -100.76648,-96.52616 0,-53.3099 45.11471,-96.52615 100.76648,-96.52614 z"
     style="color:#000000;display:inline;overflow:visible;visibility:visible;opacity:1;fill:#a5a5a5;stroke:none;stroke-width:111.64038086;stroke-linecap:round;stroke-linejoin:round;stroke-miterlimit:4;stroke-dasharray:none;stroke-dashoffset:0;stroke-opacity:1;marker:none;enable-background:accumulate;fill-opacity:1" />
  <rect
     style="opacity:1;fill:none;fill-opacity:1;fill-rule:nonzero;stroke:#a5a5a5;stroke-width:111.58135223;stroke-linecap:butt;stroke-linejoin:round;stroke-miterlimit:4;stroke-dasharray:none;stroke-dashoffset:0;stroke-opacity:1"
     id="rect8078-7"
     width="2449.6599"
     height="2532.2834"
     x="133.0517"
     y="94.488266" />
  <path
     inkscape:connector-curvature="0"
     id="path6-7-7"
     d="m 2198.4796,221.1819 -100.7664,170.0718 100.7664,170.06929 h 201.5331 L 2500.7791,391.2537 2400.0127,221.18189 Z m 100.7664,73.54565 c 55.6519,0 100.7667,43.21626 100.7667,96.52615 0,53.30991 -45.1148,96.52616 -100.7667,96.52616 -55.6516,0 -100.7664,-43.21626 -100.7664,-96.52616 0,-53.30989 45.1148,-96.52615 100.7664,-96.52615 z"
     style="color:#000000;display:inline;overflow:visible;visibility:visible;opacity:1;fill:#a5a5a5;stroke:none;stroke-width:111.64038086;stroke-linecap:round;stroke-linejoin:round;stroke-miterlimit:4;stroke-dasharray:none;stroke-dashoffset:0;stroke-opacity:1;marker:none;enable-background:accumulate;fill-opacity:1" />
  <path
     inkscape:connector-curvature="0"
     id="path6-4-1"
     d="m 337.04753,2141.0894 -100.7665,170.0718 100.7665,170.0693 H 538.58051 L 639.34699,2311.1612 538.58051,2141.0894 Z m 100.76648,73.5458 c 55.65178,0 100.7665,43.2161 100.7665,96.526 0,53.31 -45.11472,96.5262 -100.7665,96.5262 -55.65177,0 -100.76648,-43.2162 -100.76648,-96.5262 0,-53.3099 45.11471,-96.526 100.76648,-96.526 z"
     style="color:#000000;display:inline;overflow:visible;visibility:visible;opacity:1;fill:#a5a5a5;stroke:none;stroke-width:111.64038086;stroke-linecap:round;stroke-linejoin:round;stroke-miterlimit:4;stroke-dasharray:none;stroke-dashoffset:0;stroke-opacity:1;marker:none;enable-background:accumulate;fill-opacity:1" />
  <path
     inkscape:connector-curvature="0"
     id="path6-6-7"
     d="m 2198.4797,2141.0894 -100.7665,170.0706 100.7665,170.0705 h 201.5329 L 2500.7791,2311.16 2400.0126,2141.0894 Z m 100.7664,73.5438 c 55.652,0 100.7665,43.2165 100.7665,96.5268 0,53.3103 -45.1145,96.5269 -100.7665,96.5269 -55.6519,0 -100.7664,-43.2166 -100.7664,-96.5269 0,-53.3103 45.1145,-96.5268 100.7664,-96.5268 z"
     style="color:#000000;display:inline;overflow:visible;visibility:visible;opacity:1;fill:#a5a5a5;stroke:none;stroke-width:111.64038086;stroke-linecap:round;stroke-linejoin:round;stroke-miterlimit:4;stroke-dasharray:none;stroke-dashoffset:0;stroke-opacity:1;marker:none;enable-background:accumulate;fill-opacity:1" />
  <ellipse
     style="opacity:1;fill:none;fill-opacity:0.90447759;fill-rule:nonzero;stroke:#a5a5a5;stroke-width:111.58135223;stroke-linecap:square;stroke-linejoin:round;stroke-miterlimit:4;stroke-dasharray:none;stroke-dashoffset:0;stroke-opacity:1"
     id="path4793-2"
     cx="1360.6295"
     cy="1360.63"
     rx="971.02271"
     ry="1001.5266" />
  <path
     style="opacity:1;fill:#000000;fill-opacity:1;fill-rule:nonzero;stroke:#000000;stroke-width:27.89533997;stroke-linecap:butt;stroke-linejoin:miter;stroke-miterlimit:4;stroke-dasharray:none;stroke-dashoffset:0;stroke-opacity:1;paint-order:markers stroke fill"
     id="path5076"
     sodipodi:type="arc"
     sodipodi:cx="133.0517"
     sodipodi:cy="1360.63"
     sodipodi:rx="41.311722"
     sodipodi:ry="42.381119"
     sodipodi:start="0"
     sodipodi:end="6.2817367"
     sodipodi:open="true"
     d="m 174.36342,1360.63 a 41.311722,42.381119 0 0 1 -41.29676,42.3811 41.311722,42.381119 0 0 1 -41.326674,-42.3504 41.311722,42.381119 0 0 1 41.266824,-42.4118 41.311722,42.381119 0 0 1 41.35657,42.3197" />
  <path
     style="fill:none;fill-rule:evenodd;stroke:#a5a5a5;stroke-width:37.79527664;stroke-linecap:butt;stroke-linejoin:miter;stroke-miterlimit:4;stroke-dasharray:none;stroke-opacity:1"
     d="M 3988.0144,1517.3478 H 5254.1568"
     id="path5078"
     inkscape:connector-curvature="0"
     inkscape:path-effect="#path-effect5080"
     inkscape:original-d="M 3988.0144,1517.3478 H 5254.1568"
     transform="matrix(0.96949585,0,0,0.99995185,-2505.734,-156.64479)" />
  <path
     style="opacity:1;fill:#000000;fill-opacity:1;fill-rule:nonzero;stroke:#000000;stroke-width:27.89533997;stroke-linecap:butt;stroke-linejoin:miter;stroke-miterlimit:4;stroke-dasharray:none;stroke-dashoffset:0;stroke-opacity:1;paint-order:markers stroke fill"
     id="path5082"
     sodipodi:type="arc"
     sodipodi:cx="2582.7117"
     sodipodi:cy="1360.6299"
     sodipodi:rx="41.311722"
     sodipodi:ry="42.381119"
     sodipodi:start="0"
     sodipodi:end="6.2817367"
     sodipodi:open="true"
     d="m 2624.0234,1360.6299 a 41.311722,42.381119 0 0 1 -41.2968,42.3811 41.311722,42.381119 0 0 1 -41.3266,-42.3504 41.311722,42.381119 0 0 1 41.2668,-42.4118 41.311722,42.381119 0 0 1 41.3565,42.3197" />
  <path
     style="fill:none;fill-rule:evenodd;stroke:#a5a5a5;stroke-width:37.79527664;stroke-linecap:butt;stroke-linejoin:miter;stroke-miterlimit:4;stroke-dasharray:none;stroke-opacity:1"
     d="M 3988.0144,1517.3478 H 5254.1568"
     id="path5078-2"
     inkscape:connector-curvature="0"
     inkscape:path-effect="#path-effect5080-4"
     inkscape:original-d="M 3988.0144,1517.3478 H 5254.1568"
     transform="matrix(0.96949585,0,0,0.99995185,-3733.2532,-156.64479)" />
</svg>
