<?xml version="1.0" encoding="UTF-8" standalone="no"?>
<!-- DOCTYPE svg PUBLIC "-//W3C//DTD SVG 1.1//EN" "http://www.w3.org/Graphics/SVG/1.1/DTD/svg11.dtd" -->

<svg
   viewBox="0 0 529.13383 529.13385"
   preserveAspectRatio="xMidYMid"
   zoomAndPan="magnify"
   version="1.1"
   id="svg23662"
   sodipodi:docname="fac-ex.svg"
   width="140mm"
   height="140mm"
   inkscape:version="1.2.2 (732a01da63, 2022-12-09)"
   xmlns:inkscape="http://www.inkscape.org/namespaces/inkscape"
   xmlns:sodipodi="http://sodipodi.sourceforge.net/DTD/sodipodi-0.dtd"
   xmlns="http://www.w3.org/2000/svg"
   xmlns:svg="http://www.w3.org/2000/svg">
  <defs
     id="defs23666" />
  <sodipodi:namedview
     id="namedview23664"
     pagecolor="#ffffff"
     bordercolor="#666666"
     borderopacity="1.0"
     inkscape:showpageshadow="2"
     inkscape:pageopacity="0.0"
     inkscape:pagecheckerboard="0"
     inkscape:deskcolor="#d1d1d1"
     showgrid="false"
     inkscape:zoom="0.91384317"
     inkscape:cx="166.87765"
     inkscape:cy="198.61176"
     inkscape:window-width="1920"
     inkscape:window-height="1000"
     inkscape:window-x="-11"
     inkscape:window-y="-11"
     inkscape:window-maximized="1"
     inkscape:current-layer="svg23662"
     inkscape:document-units="mm" />
  <path
     style="fill:#ff8000;fill-opacity:1;stroke:#ff8000;stroke-width:37.7953;stroke-linecap:butt;stroke-linejoin:miter;stroke-dasharray:none;stroke-opacity:1"
     d="M 258.25,474.91737 261.53284,51.431144 479.29448,271.38135 Z"
     id="path26513"
     sodipodi:nodetypes="cccc" />
  <line
     x1="256.89249"
     y1="272.9361"
     x2="512.89252"
     y2="272.9361"
     stroke="#c3c300"
     stroke-width="0.5"
     id="line23656"
     style="stroke:#ff8000;stroke-width:37.45889693;stroke-dasharray:none;stroke-opacity:1;stroke-linecap:butt;stroke-linejoin:miter;paint-order:fill markers stroke" />
  <line
     x1="256.89249"
     y1="522.94366"
     x2="256.89249"
     y2="6.398643"
     stroke="#c3c300"
     stroke-width="0.5"
     id="line23658"
     style="stroke:#ff8000;stroke-width:37.45889693;stroke-dasharray:none;stroke-opacity:1;stroke-linecap:butt;stroke-linejoin:miter;paint-order:fill markers stroke" />
  <rect
     style="fill:#000000;fill-opacity:1;fill-rule:evenodd;stroke-width:0.121"
     id="rect21238-6"
     width="3.0453804"
     height="3.3101959"
     x="17.08007"
     y="270.82053" />
  <path
     style="fill:#ffe1e1;fill-opacity:1;stroke:#000000;stroke-width:1px;stroke-linecap:butt;stroke-linejoin:miter;stroke-opacity:1"
     d="m 256.06144,473.82309 0,-203.53602 219.95021,2.18856 z"
     id="path27531"
     sodipodi:nodetypes="cccc" />
  <rect
     style="fill:#ff0000;fill-opacity:1;fill-rule:evenodd;stroke-width:1.21;stroke-linecap:butt;stroke-linejoin:miter;paint-order:fill markers stroke"
     id="rect21238"
     width="30.453804"
     height="33.101959"
     x="241.38168"
     y="256.47177" />
</svg>
