<?xml version="1.0" encoding="UTF-8" standalone="no"?>
<!-- Created with Inkscape (http://www.inkscape.org/) -->

<svg
   xmlns:osb="http://www.openswatchbook.org/uri/2009/osb"
   xmlns:dc="http://purl.org/dc/elements/1.1/"
   xmlns:cc="http://creativecommons.org/ns#"
   xmlns:rdf="http://www.w3.org/1999/02/22-rdf-syntax-ns#"
   xmlns:svg="http://www.w3.org/2000/svg"
   xmlns="http://www.w3.org/2000/svg"
   xmlns:sodipodi="http://sodipodi.sourceforge.net/DTD/sodipodi-0.dtd"
   xmlns:inkscape="http://www.inkscape.org/namespaces/inkscape"
   width="175cm"
   height="95cm"
   version="1.1"
   viewBox="0 0 1750 950.00005"
   id="svg22"
   sodipodi:docname="smdev=poteau_bois_double_a_deposer.svg"
   inkscape:version="0.92.4 (5da689c313, 2019-01-14)">
  <defs
     id="defs26">
    <inkscape:path-effect
       effect="spiro"
       id="path-effect4804"
       is_visible="true" />
    <inkscape:path-effect
       effect="spiro"
       id="path-effect4800"
       is_visible="true" />
    <inkscape:path-effect
       effect="spiro"
       id="path-effect4796"
       is_visible="true" />
    <inkscape:path-effect
       effect="spiro"
       id="path-effect4804-3"
       is_visible="true" />
    <inkscape:path-effect
       effect="spiro"
       id="path-effect4800-6"
       is_visible="true" />
    <inkscape:path-effect
       effect="spiro"
       id="path-effect4796-7"
       is_visible="true" />
    <inkscape:path-effect
       effect="spiro"
       id="path-effect4796-9"
       is_visible="true" />
    <inkscape:path-effect
       effect="spiro"
       id="path-effect4800-8"
       is_visible="true" />
    <linearGradient
       id="linearGradient896"
       osb:paint="solid">
      <stop
         style="stop-color:#000000;stop-opacity:1;"
         offset="0"
         id="stop894" />
    </linearGradient>
    <inkscape:path-effect
       effect="spiro"
       id="path-effect4796-4"
       is_visible="true" />
    <inkscape:path-effect
       effect="spiro"
       id="path-effect4800-1"
       is_visible="true" />
    <inkscape:path-effect
       effect="spiro"
       id="path-effect4800-3"
       is_visible="true" />
    <inkscape:path-effect
       effect="spiro"
       id="path-effect4796-8"
       is_visible="true" />
    <inkscape:path-effect
       effect="spiro"
       id="path-effect4800-7"
       is_visible="true" />
    <inkscape:path-effect
       effect="spiro"
       id="path-effect4796-0"
       is_visible="true" />
  </defs>
  <sodipodi:namedview
     pagecolor="#ffffff"
     bordercolor="#666666"
     borderopacity="1"
     objecttolerance="10"
     gridtolerance="10"
     guidetolerance="10"
     inkscape:pageopacity="0"
     inkscape:pageshadow="2"
     inkscape:window-width="1024"
     inkscape:window-height="705"
     id="namedview24"
     showgrid="true"
     inkscape:document-units="cm"
     units="cm"
     inkscape:zoom="0.05656854"
     inkscape:cx="2470.321"
     inkscape:cy="2770.0513"
     inkscape:window-x="-8"
     inkscape:window-y="-8"
     inkscape:window-maximized="1"
     inkscape:current-layer="svg22"
     inkscape:snap-object-midpoints="true"
     inkscape:snap-center="true"
     inkscape:snap-grids="false"
     inkscape:snap-bbox="true"
     inkscape:bbox-nodes="true"
     inkscape:bbox-paths="true"
     inkscape:snap-bbox-edge-midpoints="true"
     inkscape:snap-bbox-midpoints="true"
     inkscape:object-paths="true"
     inkscape:snap-intersection-paths="true"
     inkscape:snap-smooth-nodes="true"
     inkscape:snap-midpoints="true"
     inkscape:snap-page="true"
     inkscape:snap-to-guides="true"
     showguides="true"
     inkscape:guide-bbox="true"
     inkscape:showpageshadow="false">
    <inkscape:grid
       type="xygrid"
       id="grid8498" />
  </sodipodi:namedview>
  <metadata
     id="metadata2">
    <rdf:RDF>
      <cc:Work
         rdf:about="">
        <dc:format>image/svg+xml</dc:format>
        <dc:type
           rdf:resource="http://purl.org/dc/dcmitype/StillImage" />
        <dc:title></dc:title>
        <cc:license
           rdf:resource="http://creativecommons.org/licenses/by-nc-sa/4.0/" />
        <dc:creator>
          <cc:Agent>
            <dc:title>jma</dc:title>
          </cc:Agent>
        </dc:creator>
        <dc:publisher>
          <cc:Agent>
            <dc:title>Azimut</dc:title>
          </cc:Agent>
        </dc:publisher>
        <dc:rights>
          <cc:Agent>
            <dc:title>(c)Azimut</dc:title>
          </cc:Agent>
        </dc:rights>
      </cc:Work>
      <cc:License
         rdf:about="http://creativecommons.org/licenses/by-nc-sa/4.0/">
        <cc:permits
           rdf:resource="http://creativecommons.org/ns#Reproduction" />
        <cc:permits
           rdf:resource="http://creativecommons.org/ns#Distribution" />
        <cc:requires
           rdf:resource="http://creativecommons.org/ns#Notice" />
        <cc:requires
           rdf:resource="http://creativecommons.org/ns#Attribution" />
        <cc:prohibits
           rdf:resource="http://creativecommons.org/ns#CommercialUse" />
        <cc:permits
           rdf:resource="http://creativecommons.org/ns#DerivativeWorks" />
        <cc:requires
           rdf:resource="http://creativecommons.org/ns#ShareAlike" />
      </cc:License>
    </rdf:RDF>
  </metadata>
  <path
     style="display:inline;opacity:0.719;fill:none;fill-opacity:1;fill-rule:nonzero;stroke:#030303;stroke-width:150.7381897;stroke-linecap:butt;stroke-linejoin:miter;stroke-miterlimit:4;stroke-dasharray:none;stroke-dashoffset:0;stroke-opacity:0"
     id="path14811"
     sodipodi:type="arc"
     sodipodi:cx="450.24695"
     sodipodi:cy="471.93417"
     sodipodi:rx="365.11087"
     sodipodi:ry="366.30603"
     sodipodi:start="0"
     sodipodi:end="4.7151306"
     d="M 815.35782,471.93417 A 365.11087,366.30603 0 0 1 589.7376,810.45282 365.11087,366.30603 0 0 1 191.72091,730.59634 365.11087,366.30603 0 0 1 113.2165,331.05935 365.11087,366.30603 0 0 1 451.24794,105.62952 l -1.00099,366.30465 z" />
  <path
     style="display:inline;opacity:0.719;fill:none;fill-opacity:1;fill-rule:nonzero;stroke:#030303;stroke-width:46.39660645;stroke-linecap:butt;stroke-linejoin:bevel;stroke-miterlimit:4;stroke-dasharray:none;stroke-dashoffset:0;stroke-opacity:0"
     id="path14821"
     sodipodi:type="arc"
     sodipodi:cx="450.25317"
     sodipodi:cy="465.1673"
     sodipodi:rx="417.19766"
     sodipodi:ry="418.4635"
     sodipodi:start="0"
     sodipodi:end="5.912041"
     sodipodi:open="true"
     d="M 867.45084,465.1673 A 417.19766,418.4635 0 0 1 488.90779,881.83076 417.19766,418.4635 0 0 1 40.218443,542.37754 417.19766,418.4635 0 0 1 335.61667,62.811354 417.19766,418.4635 0 0 1 839.04507,313.39809" />
  <path
     style="opacity:0.719;fill:none;fill-opacity:1;fill-rule:nonzero;stroke:#030303;stroke-width:150.7381897;stroke-linecap:butt;stroke-linejoin:miter;stroke-miterlimit:4;stroke-dasharray:none;stroke-dashoffset:0;stroke-opacity:0"
     id="path14811-8"
     sodipodi:type="arc"
     sodipodi:cx="458.18124"
     sodipodi:cy="474.20413"
     sodipodi:rx="364.83374"
     sodipodi:ry="357.47821"
     sodipodi:start="0"
     sodipodi:end="4.7151306"
     d="M 823.01498,474.20413 A 364.83374,357.47821 0 0 1 597.56601,804.56462 364.83374,357.47821 0 0 1 199.85144,726.63265 364.83374,357.47821 0 0 1 121.40661,336.72433 364.83374,357.47821 0 0 1 459.18148,116.72727 l -1.00024,357.47686 z" />
  <path
     style="opacity:0.719;fill:none;fill-opacity:1;fill-rule:nonzero;stroke:#030303;stroke-width:46.39660645;stroke-linecap:butt;stroke-linejoin:bevel;stroke-miterlimit:4;stroke-dasharray:none;stroke-dashoffset:0;stroke-opacity:0"
     id="path14821-2"
     sodipodi:type="arc"
     sodipodi:cx="458.18744"
     sodipodi:cy="467.60046"
     sodipodi:rx="416.88095"
     sodipodi:ry="408.37872"
     sodipodi:start="0"
     sodipodi:end="5.912041"
     sodipodi:open="true"
     d="M 875.06839,467.60046 A 416.88095,408.37872 0 0 1 496.81271,874.22253 416.88095,408.37872 0 0 1 48.463982,542.94997 416.88095,408.37872 0 0 1 343.63796,74.941114 416.88095,408.37872 0 0 1 846.68419,319.48883" />
  <path
     style="display:inline;fill:none;fill-rule:evenodd;stroke:#a5a5a5;stroke-width:166.34999084;stroke-linecap:butt;stroke-linejoin:miter;stroke-miterlimit:4;stroke-dasharray:none;stroke-opacity:1"
     d="m 5498.6718,-1767.6723 -5333.6674,-0.049"
     id="path4794"
     inkscape:connector-curvature="0"
     inkscape:path-effect="#path-effect4796-8"
     inkscape:original-d="m 5498.6718,-1767.6723 -5333.6674,-0.049"
     transform="matrix(-0.15936501,0,0,-0.20408164,1751.2958,114.24018)"
     sodipodi:nodetypes="cc" />
  <path
     style="display:inline;fill:none;fill-rule:evenodd;stroke:#a5a5a5;stroke-width:83.18354034;stroke-linecap:butt;stroke-linejoin:round;stroke-miterlimit:4;stroke-dasharray:none;stroke-opacity:1;paint-order:markers fill stroke"
     d="m 2831.8519,-4576.6862 v 2805.0085"
     id="path4798"
     inkscape:connector-curvature="0"
     inkscape:path-effect="#path-effect4800-3"
     inkscape:original-d="m 2831.8519,-4576.6862 v 2805.0085"
     transform="matrix(0.42922325,0,0,0.30302922,84.503311,1436.8695)"
     sodipodi:nodetypes="cc" />
  <circle
     style="display:inline;opacity:1;fill:none;fill-opacity:0.90447759;fill-rule:nonzero;stroke:#a5a5a5;stroke-width:30.00000191;stroke-linecap:square;stroke-linejoin:round;stroke-miterlimit:4;stroke-dasharray:none;stroke-dashoffset:0;stroke-opacity:1"
     id="path4793"
     cx="1300"
     cy="474.99936"
     r="425.00003" />
  <path
     style="display:inline;fill:none;fill-rule:evenodd;stroke:#a5a5a5;stroke-width:166.34999084;stroke-linecap:butt;stroke-linejoin:miter;stroke-miterlimit:4;stroke-dasharray:none;stroke-opacity:1"
     d="m 5498.6718,-1767.6723 -5333.6674,-0.049"
     id="path4794-1"
     inkscape:connector-curvature="0"
     inkscape:path-effect="#path-effect4796-0"
     inkscape:original-d="m 5498.6718,-1767.6723 -5333.6674,-0.049"
     transform="matrix(-0.15936501,0,0,-0.20408164,901.29598,114.23018)"
     sodipodi:nodetypes="cc" />
  <path
     style="display:inline;fill:none;fill-rule:evenodd;stroke:#a5a5a5;stroke-width:83.18354034;stroke-linecap:butt;stroke-linejoin:round;stroke-miterlimit:4;stroke-dasharray:none;stroke-opacity:1;paint-order:markers fill stroke"
     d="m 2831.8519,-4576.6862 v 2805.0085"
     id="path4798-4"
     inkscape:connector-curvature="0"
     inkscape:path-effect="#path-effect4800-7"
     inkscape:original-d="m 2831.8519,-4576.6862 v 2805.0085"
     transform="matrix(0.42922325,0,0,0.30302922,-765.49666,1436.8596)"
     sodipodi:nodetypes="cc" />
  <circle
     style="display:inline;opacity:1;fill:none;fill-opacity:0.90447759;fill-rule:nonzero;stroke:#a5a5a5;stroke-width:30.00000191;stroke-linecap:square;stroke-linejoin:round;stroke-miterlimit:4;stroke-dasharray:none;stroke-dashoffset:0;stroke-opacity:1"
     id="path4793-2"
     cx="450.25317"
     cy="471.70383"
     r="425.00003" />
</svg>
