<?xml version="1.0" encoding="UTF-8" standalone="no"?>
<svg
   xmlns:osb="http://www.openswatchbook.org/uri/2009/osb"
   xmlns:dc="http://purl.org/dc/elements/1.1/"
   xmlns:cc="http://creativecommons.org/ns#"
   xmlns:rdf="http://www.w3.org/1999/02/22-rdf-syntax-ns#"
   xmlns:svg="http://www.w3.org/2000/svg"
   xmlns="http://www.w3.org/2000/svg"
   xmlns:sodipodi="http://sodipodi.sourceforge.net/DTD/sodipodi-0.dtd"
   xmlns:inkscape="http://www.inkscape.org/namespaces/inkscape"
   version="1.1"
   x="0px"
   y="0px"
   viewBox="0 0 2721.2599 2721.2599"
   id="svg2"
   inkscape:version="0.92.4 (5da689c313, 2019-01-14)"
   sodipodi:docname="smdev=mat_boule_a_remplacer.svg"
   width="72cm"
   height="72cm">
  <metadata
     id="metadata16">
    <rdf:RDF>
      <cc:Work
         rdf:about="">
        <dc:format>image/svg+xml</dc:format>
        <dc:type
           rdf:resource="http://purl.org/dc/dcmitype/StillImage" />
        <dc:title></dc:title>
      </cc:Work>
    </rdf:RDF>
  </metadata>
  <defs
     id="defs14">
    <inkscape:path-effect
       is_visible="true"
       id="path-effect8510"
       effect="spiro" />
    <inkscape:path-effect
       effect="spiro"
       id="path-effect8502"
       is_visible="true" />
    <inkscape:path-effect
       effect="spiro"
       id="path-effect8498"
       is_visible="true" />
    <inkscape:path-effect
       effect="spiro"
       id="path-effect8494"
       is_visible="true" />
    <inkscape:path-effect
       effect="spiro"
       id="path-effect8490"
       is_visible="true" />
    <inkscape:path-effect
       effect="spiro"
       id="path-effect4797"
       is_visible="true" />
    <inkscape:path-effect
       effect="spiro"
       id="path-effect8121"
       is_visible="true" />
    <inkscape:path-effect
       effect="spiro"
       id="path-effect8117"
       is_visible="true" />
    <inkscape:path-effect
       effect="spiro"
       id="path-effect8113"
       is_visible="true" />
    <inkscape:path-effect
       effect="spiro"
       id="path-effect8109"
       is_visible="true" />
    <inkscape:path-effect
       effect="spiro"
       id="path-effect8100"
       is_visible="true" />
    <inkscape:path-effect
       effect="spiro"
       id="path-effect8096"
       is_visible="true" />
    <inkscape:path-effect
       effect="spiro"
       id="path-effect8098"
       is_visible="true" />
    <inkscape:path-effect
       effect="spiro"
       id="path-effect8146"
       is_visible="true" />
    <inkscape:path-effect
       effect="spiro"
       id="path-effect8142"
       is_visible="true" />
    <inkscape:path-effect
       effect="spiro"
       id="path-effect8138"
       is_visible="true" />
    <inkscape:path-effect
       effect="spiro"
       id="path-effect8134"
       is_visible="true" />
    <linearGradient
       id="linearGradient8108"
       osb:paint="solid">
      <stop
         style="stop-color:#000000;stop-opacity:1;"
         offset="0"
         id="stop8110" />
    </linearGradient>
    <linearGradient
       id="linearGradient8098"
       osb:paint="solid">
      <stop
         style="stop-color:#000000;stop-opacity:1;"
         offset="0"
         id="stop8100" />
    </linearGradient>
    <linearGradient
       id="linearGradient8092"
       osb:paint="solid">
      <stop
         style="stop-color:#000000;stop-opacity:1;"
         offset="0"
         id="stop8094" />
    </linearGradient>
    <linearGradient
       id="linearGradient8086"
       osb:paint="solid">
      <stop
         style="stop-color:#000007;stop-opacity:1;"
         offset="0"
         id="stop8088" />
    </linearGradient>
    <linearGradient
       id="linearGradient8080"
       osb:paint="solid">
      <stop
         style="stop-color:#000000;stop-opacity:1;"
         offset="0"
         id="stop8082" />
    </linearGradient>
    <inkscape:path-effect
       is_visible="true"
       id="path-effect8510-6"
       effect="spiro" />
  </defs>
  <sodipodi:namedview
     pagecolor="#ffffff"
     bordercolor="#666666"
     borderopacity="1"
     objecttolerance="10"
     gridtolerance="10"
     guidetolerance="10"
     inkscape:pageopacity="0"
     inkscape:pageshadow="2"
     inkscape:window-width="1024"
     inkscape:window-height="705"
     id="namedview12"
     showgrid="true"
     inkscape:zoom="0.062499998"
     inkscape:cx="674.80938"
     inkscape:cy="473.93535"
     inkscape:window-x="-8"
     inkscape:window-y="-8"
     inkscape:window-maximized="1"
     inkscape:current-layer="svg2"
     inkscape:snap-bbox="true"
     inkscape:lockguides="false"
     inkscape:snap-midpoints="true"
     inkscape:snap-smooth-nodes="true"
     inkscape:document-units="cm"
     units="cm"
     inkscape:snap-object-midpoints="true"
     inkscape:object-nodes="false"
     inkscape:snap-page="true"
     inkscape:snap-grids="false"
     inkscape:snap-to-guides="true"
     inkscape:bbox-paths="true"
     inkscape:bbox-nodes="true"
     inkscape:snap-bbox-edge-midpoints="true"
     inkscape:snap-bbox-midpoints="true"
     inkscape:object-paths="true"
     inkscape:snap-intersection-paths="true"
     inkscape:snap-center="true"
     inkscape:showpageshadow="false"
     showguides="true"
     inkscape:guide-bbox="true">
    <inkscape:grid
       type="xygrid"
       id="grid8076" />
    <sodipodi:guide
       position="0,2721.2599"
       orientation="0.70710678,0.70710678"
       id="guide856"
       inkscape:locked="false" />
    <sodipodi:guide
       position="2721.26,2721.26"
       orientation="-0.70710678,0.70710678"
       id="guide858"
       inkscape:locked="false" />
  </sodipodi:namedview>
  <g
     id="g854"
     transform="matrix(0.99984871,0,0,1.0001206,38.066738,37.667024)">
    <path
       style="color:#000000;display:inline;overflow:visible;visibility:visible;opacity:1;fill:#ffc94e;fill-opacity:0.98823529;stroke:none;stroke-width:113.37316132;stroke-linecap:round;stroke-linejoin:round;stroke-miterlimit:4;stroke-dasharray:none;stroke-dashoffset:0;stroke-opacity:1;marker:none;enable-background:accumulate"
       d="M 266.80931,184.07028 162.85597,354.0856 266.80931,524.09836 H 474.71596 L 578.66929,354.0856 474.71596,184.07028 Z m 103.95334,73.52125 c 57.41183,0 103.95331,43.20188 103.95331,96.49407 0,53.29218 -46.54148,96.49408 -103.95331,96.49408 -57.41186,0 -103.95334,-43.2019 -103.95334,-96.49408 0,-53.29219 46.54148,-96.49407 103.95334,-96.49407 z"
       id="path6"
       inkscape:connector-curvature="0" />
    <rect
       y="56.814312"
       x="56.429985"
       height="2531.9783"
       width="2532.6667"
       id="rect8078"
       style="opacity:1;fill:none;fill-opacity:1;fill-rule:nonzero;stroke:#ffc94e;stroke-width:113.38757324;stroke-linecap:butt;stroke-linejoin:round;stroke-miterlimit:4;stroke-dasharray:none;stroke-dashoffset:0;stroke-opacity:0.98823529" />
    <ellipse
       ry="62.94313"
       rx="217.94791"
       cy="1197.2534"
       cx="668.91974"
       id="path8104"
       style="opacity:1;fill:none;fill-opacity:1;fill-rule:nonzero;stroke:none;stroke-width:113.37316132;stroke-linecap:butt;stroke-linejoin:bevel;stroke-miterlimit:4;stroke-dasharray:none;stroke-dashoffset:0;stroke-opacity:1" />
    <path
       style="color:#000000;display:inline;overflow:visible;visibility:visible;opacity:1;fill:#ffc94e;fill-opacity:0.98823529;stroke:none;stroke-width:113.37316132;stroke-linecap:round;stroke-linejoin:round;stroke-miterlimit:4;stroke-dasharray:none;stroke-dashoffset:0;stroke-opacity:1;marker:none;enable-background:accumulate"
       d="m 2187.1107,184.07029 -103.9532,170.0153 103.9532,170.01276 h 207.9069 l 103.9532,-170.01276 -103.9532,-170.0153 z m 103.9534,73.52123 c 57.4118,0 103.9535,43.20189 103.9535,96.49407 0,53.29218 -46.5417,96.49408 -103.9535,96.49408 -57.4118,0 -103.9534,-43.2019 -103.9534,-96.49408 0,-53.29218 46.5416,-96.49407 103.9534,-96.49407 z"
       id="path6-7"
       inkscape:connector-curvature="0" />
    <path
       style="color:#000000;display:inline;overflow:visible;visibility:visible;opacity:1;fill:#ffc94e;fill-opacity:0.98823529;stroke:none;stroke-width:113.37316132;stroke-linecap:round;stroke-linejoin:round;stroke-miterlimit:4;stroke-dasharray:none;stroke-dashoffset:0;stroke-opacity:1;marker:none;enable-background:accumulate"
       d="M 266.8093,2103.3399 162.85597,2273.3552 266.8093,2443.3679 H 474.71594 L 578.66929,2273.3552 474.71594,2103.3399 Z m 103.95331,73.5213 c 57.41186,0 103.95333,43.2017 103.95333,96.494 0,53.2922 -46.54147,96.494 -103.95333,96.494 -57.41182,0 -103.95331,-43.2018 -103.95331,-96.494 0,-53.2923 46.54149,-96.494 103.95331,-96.494 z"
       id="path6-4"
       inkscape:connector-curvature="0" />
    <path
       style="color:#000000;display:inline;overflow:visible;visibility:visible;opacity:1;fill:#ffc94e;fill-opacity:0.98823529;stroke:none;stroke-width:113.37316132;stroke-linecap:round;stroke-linejoin:round;stroke-miterlimit:4;stroke-dasharray:none;stroke-dashoffset:0;stroke-opacity:1;marker:none;enable-background:accumulate"
       d="m 2187.1108,2103.3399 -103.9533,170.0141 103.9533,170.0139 h 207.9067 l 103.9533,-170.0139 -103.9533,-170.0141 z m 103.9534,73.5193 c 57.4119,0 103.9533,43.2021 103.9533,96.4948 0,53.2925 -46.5414,96.4947 -103.9533,96.4947 -57.4121,0 -103.9534,-43.2022 -103.9534,-96.4947 0,-53.2927 46.5413,-96.4948 103.9534,-96.4948 z"
       id="path6-6"
       inkscape:connector-curvature="0" />
    <ellipse
       ry="1001.1938"
       rx="1001.7321"
       cy="1323.1396"
       cx="1322.7634"
       id="path4793"
       style="opacity:1;fill:none;fill-opacity:0.90447759;fill-rule:nonzero;stroke:#ffc94e;stroke-width:113.37316132;stroke-linecap:square;stroke-linejoin:round;stroke-miterlimit:4;stroke-dasharray:none;stroke-dashoffset:0;stroke-opacity:0.98823529" />
  </g>
</svg>
