#descriptif des colonnes (paragraphe 3.2.2 du cahier des charges);;;;;;;;;;
#entreprise_georeferencement;;;;;;;;; ;
#Operateur_georeferencement;;;;;;;;;;
#nature_ouvrage;EP;;;;;;;;;
#appareil_gps;S/N;;;;;;;;;
#appareil_station_totale;S/N;;;;;;;;;
#methode_leve;;;;;;;;;;
#entreprise_detection;;;;;;;;;;
#operateur_detection;;;;;;;;;;
#appareil_detection;S/N;;;;;;;;;
#technologie_mesure;;;;;;;;;;
#numero;X;Y;Z;profondeur;DateHeure;Cod_Proj;commentaire;HDOP;PDOP;methode_leve
