<?xml version="1.0" encoding="UTF-8" standalone="no"?>
<!-- DOCTYPE svg PUBLIC "-//W3C//DTD SVG 1.1//EN" "http://www.w3.org/Graphics/SVG/1.1/DTD/svg11.dtd" -->

<svg
   viewBox="0 0 377.95275 377.95275"
   preserveAspectRatio="xMidYMid"
   zoomAndPan="magnify"
   version="1.1"
   id="svg1305"
   sodipodi:docname="pbois-aps.svg"
   width="100mm"
   height="100mm"
   inkscape:version="1.2.2 (732a01da63, 2022-12-09)"
   xmlns:inkscape="http://www.inkscape.org/namespaces/inkscape"
   xmlns:sodipodi="http://sodipodi.sourceforge.net/DTD/sodipodi-0.dtd"
   xmlns="http://www.w3.org/2000/svg"
   xmlns:svg="http://www.w3.org/2000/svg">
  <defs
     id="defs1309">
    <linearGradient
       id="linearGradient19620"
       inkscape:swatch="solid">
      <stop
         style="stop-color:#a87153;stop-opacity:1"
         offset="0"
         id="stop19618" />
    </linearGradient>
  </defs>
  <sodipodi:namedview
     id="namedview1307"
     pagecolor="#ffffff"
     bordercolor="#666666"
     borderopacity="1.0"
     inkscape:showpageshadow="2"
     inkscape:pageopacity="0.0"
     inkscape:pagecheckerboard="0"
     inkscape:deskcolor="#d1d1d1"
     showgrid="false"
     inkscape:document-units="mm"
     inkscape:zoom="2.0425833"
     inkscape:cx="161.80491"
     inkscape:cy="184.32541"
     inkscape:window-width="1920"
     inkscape:window-height="1000"
     inkscape:window-x="-11"
     inkscape:window-y="-11"
     inkscape:window-maximized="1"
     inkscape:current-layer="svg1305" />
  <ellipse
     style="fill:#ffffff;fill-opacity:1;stroke:#000000;stroke-width:15.11810989;stroke-linecap:square;stroke-opacity:1;stroke-dasharray:none"
     id="path50165"
     cx="188.97638"
     cy="188.97638"
     rx="153.42773"
     ry="151.42215" />
  <ellipse
     style="fill:#ffffff;fill-opacity:1;stroke:#000000;stroke-width:15.11810989;stroke-linecap:square;stroke-dasharray:none;stroke-opacity:1"
     id="path50165-1"
     cx="188.97638"
     cy="188.97638"
     rx="153.42773"
     ry="151.42215" />
  <path
     style="fill:none;stroke:#000000;stroke-width:0;stroke-linecap:butt;stroke-linejoin:miter;stroke-dasharray:none;stroke-opacity:1"
     d="M 105.22749,209.955 V 331.09271"
     id="path59655" />
  <path
     style="fill:none;stroke:#000000;stroke-width:15.11810989;stroke-linecap:butt;stroke-linejoin:miter;stroke-dasharray:none;stroke-opacity:1"
     d="M 188.97636,37.554231 V 340.39851"
     id="path59661" />
  <path
     style="fill:#000000;stroke:#000000;stroke-width:5.13027;stroke-miterlimit:0;stroke-opacity:1;paint-order:fill markers stroke;fill-opacity:1"
     d="m 171.84122,331.61636 c -11.1933,-1.33362 -23.68911,-4.33936 -34.35511,-8.26376 -7.0546,-2.59564 -21.64589,-9.91028 -27.73523,-13.90372 -14.30312,-9.38012 -26.379256,-20.37344 -36.405312,-33.14101 -7.630622,-9.71713 -16.874779,-26.30541 -21.111798,-37.8843 -6.225661,-17.01344 -8.636689,-30.81717 -8.636689,-49.44719 0,-12.46913 0.366057,-16.54727 2.460904,-27.41626 6.463029,-33.53306 26.079456,-65.014931 53.570755,-85.974248 22.47488,-17.13481 49.04622,-27.303888 77.965,-29.837867 l 3.79421,-0.332464 V 188.91886 332.42218 l -1.83591,-0.0529 c -1.00975,-0.0291 -4.47962,-0.36792 -7.71082,-0.7529 z"
     id="path47267" />
</svg>
