<?xml version="1.0" encoding="UTF-8" standalone="no"?>
<!-- Created with Inkscape (http://www.inkscape.org/) -->

<svg
   xmlns:osb="http://www.openswatchbook.org/uri/2009/osb"
   xmlns:dc="http://purl.org/dc/elements/1.1/"
   xmlns:cc="http://creativecommons.org/ns#"
   xmlns:rdf="http://www.w3.org/1999/02/22-rdf-syntax-ns#"
   xmlns:svg="http://www.w3.org/2000/svg"
   xmlns="http://www.w3.org/2000/svg"
   xmlns:xlink="http://www.w3.org/1999/xlink"
   xmlns:sodipodi="http://sodipodi.sourceforge.net/DTD/sodipodi-0.dtd"
   xmlns:inkscape="http://www.inkscape.org/namespaces/inkscape"
   width="95cm"
   height="95cm"
   viewBox="0 0 950 950"
   id="svg2"
   version="1.1"
   inkscape:version="0.92.4 (5da689c313, 2019-01-14)"
   sodipodi:docname="smdev=poteau_bois_a_deposer.svg">
  <defs
     id="defs4">
    <linearGradient
       id="linearGradient872"
       osb:paint="solid">
      <stop
         style="stop-color:#000000;stop-opacity:1;"
         offset="0"
         id="stop870" />
    </linearGradient>
    <linearGradient
       id="linearGradient874"
       osb:paint="solid">
      <stop
         style="stop-color:#e70000;stop-opacity:1;"
         offset="0"
         id="stop872" />
    </linearGradient>
    <linearGradient
       id="linearGradient902"
       osb:paint="solid">
      <stop
         style="stop-color:#000000;stop-opacity:1;"
         offset="0"
         id="stop900" />
    </linearGradient>
    <linearGradient
       id="linearGradient896"
       osb:paint="solid">
      <stop
         style="stop-color:#000000;stop-opacity:1;"
         offset="0"
         id="stop894" />
    </linearGradient>
    <linearGradient
       id="linearGradient888"
       osb:paint="solid">
      <stop
         style="stop-color:#000000;stop-opacity:1;"
         offset="0"
         id="stop886" />
    </linearGradient>
    <inkscape:path-effect
       effect="spiro"
       id="path-effect4804"
       is_visible="true" />
    <inkscape:path-effect
       effect="spiro"
       id="path-effect4800"
       is_visible="true" />
    <inkscape:path-effect
       effect="spiro"
       id="path-effect4796"
       is_visible="true" />
    <inkscape:path-effect
       effect="spiro"
       id="path-effect4792"
       is_visible="true" />
    <inkscape:path-effect
       effect="spiro"
       id="path-effect4788"
       is_visible="true" />
    <inkscape:path-effect
       effect="spiro"
       id="path-effect4784"
       is_visible="true" />
    <inkscape:path-effect
       effect="spiro"
       id="path-effect4780"
       is_visible="true" />
    <inkscape:path-effect
       effect="spiro"
       id="path-effect13822"
       is_visible="true" />
    <inkscape:path-effect
       effect="spiro"
       id="path-effect14857"
       is_visible="true" />
    <inkscape:path-effect
       effect="spiro"
       id="path-effect14853"
       is_visible="true" />
    <inkscape:path-effect
       effect="spiro"
       id="path-effect14849"
       is_visible="true" />
    <inkscape:path-effect
       effect="spiro"
       id="path-effect14845"
       is_visible="true" />
    <linearGradient
       id="linearGradient14831"
       osb:paint="solid">
      <stop
         style="stop-color:#030303;stop-opacity:1;"
         offset="0"
         id="stop14833" />
    </linearGradient>
    <linearGradient
       id="linearGradient14825"
       osb:paint="solid">
      <stop
         style="stop-color:#000000;stop-opacity:1;"
         offset="0"
         id="stop14827" />
    </linearGradient>
    <linearGradient
       id="linearGradient14815"
       osb:paint="solid">
      <stop
         style="stop-color:#000000;stop-opacity:1;"
         offset="0"
         id="stop14817" />
    </linearGradient>
    <inkscape:path-effect
       effect="spiro"
       id="path-effect8142"
       is_visible="true" />
    <inkscape:path-effect
       effect="spiro"
       id="path-effect8138"
       is_visible="true" />
    <inkscape:path-effect
       effect="spiro"
       id="path-effect8134"
       is_visible="true" />
    <inkscape:path-effect
       effect="spiro"
       id="path-effect8130"
       is_visible="true" />
    <inkscape:path-effect
       effect="spiro"
       id="path-effect8113"
       is_visible="true" />
    <inkscape:path-effect
       effect="spiro"
       id="path-effect8109"
       is_visible="true" />
    <inkscape:path-effect
       effect="spiro"
       id="path-effect8105"
       is_visible="true" />
    <inkscape:path-effect
       effect="spiro"
       id="path-effect8101"
       is_visible="true" />
    <inkscape:path-effect
       effect="spiro"
       id="path-effect8097"
       is_visible="true" />
    <inkscape:path-effect
       effect="spiro"
       id="path-effect8093"
       is_visible="true" />
    <inkscape:path-effect
       effect="spiro"
       id="path-effect8084"
       is_visible="true" />
    <inkscape:path-effect
       effect="spiro"
       id="path-effect8080"
       is_visible="true" />
    <inkscape:path-effect
       effect="spiro"
       id="path-effect8076"
       is_visible="true" />
    <inkscape:path-effect
       effect="spiro"
       id="path-effect8072"
       is_visible="true" />
    <linearGradient
       inkscape:collect="always"
       xlink:href="#linearGradient888"
       id="linearGradient890"
       x1="1736.6364"
       y1="-1517.4099"
       x2="7401.6245"
       y2="-1517.4099"
       gradientUnits="userSpaceOnUse" />
    <inkscape:path-effect
       effect="spiro"
       id="path-effect4800-8"
       is_visible="true" />
    <inkscape:path-effect
       effect="spiro"
       id="path-effect4796-9"
       is_visible="true" />
  </defs>
  <sodipodi:namedview
     id="base"
     pagecolor="#ffffff"
     bordercolor="#666666"
     borderopacity="1.0"
     inkscape:pageopacity="0.0"
     inkscape:pageshadow="2"
     inkscape:zoom="0.04"
     inkscape:cx="505.94184"
     inkscape:cy="3588.0309"
     inkscape:document-units="cm"
     inkscape:current-layer="layer1"
     showgrid="true"
     inkscape:snap-nodes="true"
     showborder="true"
     inkscape:snap-global="true"
     inkscape:window-width="1024"
     inkscape:window-height="705"
     inkscape:window-x="-8"
     inkscape:window-y="-8"
     inkscape:window-maximized="1"
     units="cm"
     inkscape:snap-object-midpoints="true"
     inkscape:snap-midpoints="true"
     inkscape:snap-bbox="true"
     inkscape:snap-grids="false"
     inkscape:snap-page="true"
     inkscape:snap-to-guides="true"
     inkscape:object-nodes="true"
     inkscape:snap-smooth-nodes="true"
     inkscape:object-paths="true"
     inkscape:snap-others="true"
     inkscape:snap-center="true"
     inkscape:bbox-paths="true"
     inkscape:bbox-nodes="true"
     inkscape:snap-bbox-edge-midpoints="true"
     inkscape:snap-bbox-midpoints="true"
     inkscape:snap-intersection-paths="true"
     showguides="true"
     objecttolerance="7"
     inkscape:snap-perpendicular="false"
     inkscape:snap-tangential="false"
     inkscape:snap-path-clip="false"
     inkscape:snap-path-mask="false"
     gridtolerance="10"
     scale-x="15"
     inkscape:lockguides="false"
     inkscape:guide-bbox="true"
     inkscape:showpageshadow="false">
    <inkscape:grid
       type="xygrid"
       id="grid8068"
       units="mm"
       spacingx="0.037795276"
       spacingy="0.037795276"
       dotted="false"
       empspacing="2"
       snapvisiblegridlinesonly="true"
       enabled="true"
       originx="616.20458"
       originy="603.36806" />
    <sodipodi:guide
       position="0,949.99998"
       orientation="0.70710678,0.70710678"
       id="guide891"
       inkscape:locked="false" />
    <sodipodi:guide
       position="949.99998,949.99998"
       orientation="-0.70710678,0.70710678"
       id="guide893"
       inkscape:locked="false" />
  </sodipodi:namedview>
  <metadata
     id="metadata7">
    <rdf:RDF>
      <cc:Work
         rdf:about="">
        <dc:format>image/svg+xml</dc:format>
        <dc:type
           rdf:resource="http://purl.org/dc/dcmitype/StillImage" />
        <dc:title></dc:title>
      </cc:Work>
    </rdf:RDF>
  </metadata>
  <g
     inkscape:label="Calque 1"
     inkscape:groupmode="layer"
     id="layer1"
     transform="translate(616.20459,6337.7242)"
     style="display:inline">
    <circle
       style="opacity:0.719;fill:none;fill-opacity:1;fill-rule:nonzero;stroke:#030303;stroke-width:639.02606201;stroke-linecap:butt;stroke-linejoin:miter;stroke-miterlimit:4;stroke-dasharray:none;stroke-dashoffset:0;stroke-opacity:0"
       id="path8098"
       cx="3020.8511"
       cy="-1867.3547"
       r="0" />
    <circle
       style="opacity:0.719;fill:none;fill-opacity:1;fill-rule:nonzero;stroke:#030303;stroke-width:87.59214783;stroke-linecap:butt;stroke-linejoin:miter;stroke-miterlimit:4;stroke-dasharray:none;stroke-dashoffset:0;stroke-opacity:0"
       id="path14803"
       cx="3032.3486"
       cy="-1871.3721"
       r="0" />
    <path
       style="opacity:0.719;fill:none;fill-opacity:1;fill-rule:nonzero;stroke:#030303;stroke-width:1447.64318848;stroke-linecap:butt;stroke-linejoin:miter;stroke-miterlimit:4;stroke-dasharray:none;stroke-dashoffset:0;stroke-opacity:0"
       id="path14811"
       sodipodi:type="arc"
       sodipodi:cx="-6521.8052"
       sodipodi:cy="-2470.4929"
       sodipodi:rx="3495.5234"
       sodipodi:ry="3441.1914"
       sodipodi:start="0"
       sodipodi:end="4.7151306"
       d="M -3026.2817,-2470.4929 A 3495.5234,3441.1914 0 0 1 -5186.3401,709.65524 3495.5234,3441.1914 0 0 1 -8996.8994,-40.541004 3495.5234,3441.1914 0 0 1 -9748.4904,-3793.9143 3495.5234,3441.1914 0 0 1 -6512.2218,-5911.6714 l -9.5834,3441.1785 z" />
    <path
       style="opacity:0.719;fill:none;fill-opacity:1;fill-rule:nonzero;stroke:#030303;stroke-width:445.57870483;stroke-linecap:butt;stroke-linejoin:bevel;stroke-miterlimit:4;stroke-dasharray:none;stroke-dashoffset:0;stroke-opacity:0"
       id="path14821"
       sodipodi:type="arc"
       sodipodi:cx="-6521.7461"
       sodipodi:cy="-2534.0625"
       sodipodi:rx="3994.1953"
       sodipodi:ry="3931.1748"
       sodipodi:start="0"
       sodipodi:end="5.912041"
       sodipodi:open="true"
       d="m -2527.5508,-2534.0625 a 3994.1953,3931.1748 0 0 1 -3624.1211,3914.2647 3994.1953,3931.1748 0 0 1 -4295.6921,-3188.928 3994.1953,3931.1748 0 0 1 2828.1031,-4505.1922 3994.1953,3931.1748 0 0 1 4819.7571,2354.0889" />
    <path
       style="fill:none;fill-rule:evenodd;stroke:#a5a5a5;stroke-width:166.34999084;stroke-linecap:butt;stroke-linejoin:miter;stroke-miterlimit:4;stroke-dasharray:none;stroke-opacity:1"
       d="m 5498.6718,-1767.6723 -5333.6674,-0.049"
       id="path4794"
       inkscape:connector-curvature="0"
       inkscape:path-effect="#path-effect4796"
       inkscape:original-d="m 5498.6718,-1767.6723 -5333.6674,-0.049"
       transform="matrix(-0.15936501,0,0,-0.20408163,310.09131,-6223.4786)"
       sodipodi:nodetypes="cc" />
    <path
       style="fill:none;fill-rule:evenodd;stroke:#a5a5a5;stroke-width:83.18353662;stroke-linecap:butt;stroke-linejoin:round;stroke-miterlimit:4;stroke-dasharray:none;stroke-opacity:1;paint-order:markers fill stroke"
       d="m 2831.8519,-4576.6862 v 2805.0085"
       id="path4798"
       inkscape:connector-curvature="0"
       inkscape:path-effect="#path-effect4800"
       inkscape:original-d="m 2831.8519,-4576.6862 v 2805.0085"
       transform="matrix(0.42922323,0,0,0.30302922,-1356.7012,-4900.8493)"
       sodipodi:nodetypes="cc" />
    <circle
       style="opacity:1;fill:none;fill-opacity:0.90447759;fill-rule:nonzero;stroke:#a5a5a5;stroke-width:30;stroke-linecap:square;stroke-linejoin:round;stroke-miterlimit:4;stroke-dasharray:none;stroke-dashoffset:0;stroke-opacity:1"
       id="path4793"
       cx="-141.20457"
       cy="-5862.7188"
       r="425" />
  </g>
</svg>
