<?xml version="1.0" encoding="UTF-8" standalone="no"?>
<!-- Created with Inkscape (http://www.inkscape.org/) -->

<svg
   xmlns:osb="http://www.openswatchbook.org/uri/2009/osb"
   xmlns:dc="http://purl.org/dc/elements/1.1/"
   xmlns:cc="http://creativecommons.org/ns#"
   xmlns:rdf="http://www.w3.org/1999/02/22-rdf-syntax-ns#"
   xmlns:svg="http://www.w3.org/2000/svg"
   xmlns="http://www.w3.org/2000/svg"
   xmlns:sodipodi="http://sodipodi.sourceforge.net/DTD/sodipodi-0.dtd"
   xmlns:inkscape="http://www.inkscape.org/namespaces/inkscape"
   width="95cm"
   height="160cm"
   viewBox="0 0 950.00001 1600"
   id="svg2"
   version="1.1"
   inkscape:version="0.92.4 (5da689c313, 2019-01-14)"
   sodipodi:docname="smdev=poteau_beton_a_deposer.svg">
  <defs
     id="defs4">
    <linearGradient
       id="linearGradient6318"
       osb:paint="solid">
      <stop
         style="stop-color:#000000;stop-opacity:1;"
         offset="0"
         id="stop6316" />
    </linearGradient>
    <inkscape:path-effect
       effect="spiro"
       id="path-effect6314"
       is_visible="true" />
    <inkscape:path-effect
       effect="spiro"
       id="path-effect6310"
       is_visible="true" />
    <linearGradient
       id="linearGradient6268"
       osb:paint="solid">
      <stop
         style="stop-color:#000000;stop-opacity:1;"
         offset="0"
         id="stop6266" />
    </linearGradient>
    <linearGradient
       id="linearGradient4799"
       osb:paint="solid">
      <stop
         style="stop-color:#000000;stop-opacity:1;"
         offset="0"
         id="stop4797" />
    </linearGradient>
    <inkscape:path-effect
       effect="spiro"
       id="path-effect4795"
       is_visible="true" />
    <linearGradient
       id="linearGradient4789"
       osb:paint="solid">
      <stop
         style="stop-color:#000000;stop-opacity:1;"
         offset="0"
         id="stop4787" />
    </linearGradient>
    <inkscape:path-effect
       effect="spiro"
       id="path-effect4804"
       is_visible="true" />
    <inkscape:path-effect
       effect="spiro"
       id="path-effect4800"
       is_visible="true" />
    <inkscape:path-effect
       effect="spiro"
       id="path-effect4796"
       is_visible="true" />
    <inkscape:path-effect
       effect="spiro"
       id="path-effect4792"
       is_visible="true" />
    <inkscape:path-effect
       effect="spiro"
       id="path-effect4788"
       is_visible="true" />
    <inkscape:path-effect
       effect="spiro"
       id="path-effect4784"
       is_visible="true" />
    <inkscape:path-effect
       effect="spiro"
       id="path-effect4780"
       is_visible="true" />
    <inkscape:path-effect
       effect="spiro"
       id="path-effect13822"
       is_visible="true" />
    <inkscape:path-effect
       effect="spiro"
       id="path-effect14857"
       is_visible="true" />
    <inkscape:path-effect
       effect="spiro"
       id="path-effect14853"
       is_visible="true" />
    <inkscape:path-effect
       effect="spiro"
       id="path-effect14849"
       is_visible="true" />
    <inkscape:path-effect
       effect="spiro"
       id="path-effect14845"
       is_visible="true" />
    <linearGradient
       id="linearGradient14831"
       osb:paint="solid">
      <stop
         style="stop-color:#030303;stop-opacity:1;"
         offset="0"
         id="stop14833" />
    </linearGradient>
    <linearGradient
       id="linearGradient14825"
       osb:paint="solid">
      <stop
         style="stop-color:#000000;stop-opacity:1;"
         offset="0"
         id="stop14827" />
    </linearGradient>
    <linearGradient
       id="linearGradient14815"
       osb:paint="solid">
      <stop
         style="stop-color:#000000;stop-opacity:1;"
         offset="0"
         id="stop14817" />
    </linearGradient>
    <inkscape:path-effect
       effect="spiro"
       id="path-effect8142"
       is_visible="true" />
    <inkscape:path-effect
       effect="spiro"
       id="path-effect8138"
       is_visible="true" />
    <inkscape:path-effect
       effect="spiro"
       id="path-effect8134"
       is_visible="true" />
    <inkscape:path-effect
       effect="spiro"
       id="path-effect8130"
       is_visible="true" />
    <inkscape:path-effect
       effect="spiro"
       id="path-effect8113"
       is_visible="true" />
    <inkscape:path-effect
       effect="spiro"
       id="path-effect8109"
       is_visible="true" />
    <inkscape:path-effect
       effect="spiro"
       id="path-effect8105"
       is_visible="true" />
    <inkscape:path-effect
       effect="spiro"
       id="path-effect8101"
       is_visible="true" />
    <inkscape:path-effect
       effect="spiro"
       id="path-effect8097"
       is_visible="true" />
    <inkscape:path-effect
       effect="spiro"
       id="path-effect8093"
       is_visible="true" />
    <inkscape:path-effect
       effect="spiro"
       id="path-effect8084"
       is_visible="true" />
    <inkscape:path-effect
       effect="spiro"
       id="path-effect8080"
       is_visible="true" />
    <inkscape:path-effect
       effect="spiro"
       id="path-effect8076"
       is_visible="true" />
    <inkscape:path-effect
       effect="spiro"
       id="path-effect8072"
       is_visible="true" />
  </defs>
  <sodipodi:namedview
     id="base"
     pagecolor="#ffffff"
     bordercolor="#666666"
     borderopacity="1.0"
     inkscape:pageopacity="0.0"
     inkscape:pageshadow="2"
     inkscape:zoom="0.30374166"
     inkscape:cx="2884.6477"
     inkscape:cy="478.27041"
     inkscape:document-units="cm"
     inkscape:current-layer="g4875"
     showgrid="true"
     inkscape:snap-nodes="true"
     showborder="true"
     inkscape:snap-global="true"
     inkscape:window-width="1024"
     inkscape:window-height="705"
     inkscape:window-x="-8"
     inkscape:window-y="-8"
     inkscape:window-maximized="1"
     units="cm"
     inkscape:snap-object-midpoints="false"
     inkscape:snap-midpoints="true"
     inkscape:snap-bbox="true"
     inkscape:snap-grids="true"
     inkscape:snap-page="true"
     inkscape:snap-to-guides="false"
     inkscape:object-nodes="true"
     inkscape:snap-smooth-nodes="true"
     inkscape:object-paths="true"
     inkscape:snap-others="true"
     inkscape:snap-center="false"
     inkscape:bbox-paths="true"
     inkscape:bbox-nodes="true"
     inkscape:snap-bbox-edge-midpoints="true"
     inkscape:snap-bbox-midpoints="true"
     inkscape:snap-intersection-paths="true"
     showguides="true"
     objecttolerance="7"
     inkscape:snap-perpendicular="false"
     inkscape:snap-tangential="false"
     inkscape:snap-path-clip="false"
     inkscape:snap-path-mask="false"
     gridtolerance="10">
    <inkscape:grid
       type="xygrid"
       id="grid8068"
       units="mm"
       spacingx="0.037795276"
       spacingy="0.037795276"
       dotted="false"
       empspacing="2"
       snapvisiblegridlinesonly="false"
       enabled="false" />
  </sodipodi:namedview>
  <metadata
     id="metadata7">
    <rdf:RDF>
      <cc:Work
         rdf:about="">
        <dc:format>image/svg+xml</dc:format>
        <dc:type
           rdf:resource="http://purl.org/dc/dcmitype/StillImage" />
        <dc:title></dc:title>
      </cc:Work>
    </rdf:RDF>
  </metadata>
  <g
     inkscape:label="Calque 1"
     inkscape:groupmode="layer"
     id="layer1"
     transform="translate(0,4716.9293)"
     style="display:inline">
    <g
       id="g4875"
       transform="matrix(0.99999741,0,0,1,4180.3728,3295.5565)"
       style="stroke-width:1.00000131">
      <g
         id="g864"
         transform="matrix(0.99631902,0,0,1.0263829,12.833302,133.09482)">
        <path
           inkscape:transform-center-y="149.98246"
           inkscape:transform-center-x="6855.6083"
           style="opacity:1;fill:#a5a5a5;fill-opacity:0.98820759;fill-rule:nonzero;stroke:none;stroke-width:816.69873047;stroke-linecap:butt;stroke-linejoin:miter;stroke-miterlimit:4;stroke-dasharray:none;stroke-dashoffset:0;stroke-opacity:1;paint-order:markers fill stroke"
           d="m -3314.9808,-6435.6034 c -9.5217,-14.6611 -843.5434,-1437.4682 -843.5434,-1439.0507 0,-0.7638 191.2505,-1.3889 425.0011,-1.3889 h 425.0011 l -0.1249,725.0002 -0.1248,724.9998 z"
           id="path6322"
           inkscape:connector-curvature="0" />
        <rect
           inkscape:transform-center-y="155.53761"
           inkscape:transform-center-x="7329.6326"
           y="-7887.4858"
           x="-4155.3838"
           height="1450"
           width="850.0022"
           id="rect891"
           style="opacity:1;fill:none;fill-opacity:1;stroke:#a5a5a5;stroke-width:50.00006485;stroke-miterlimit:4;stroke-dasharray:none;stroke-dashoffset:0;stroke-opacity:1" />
      </g>
    </g>
  </g>
</svg>
