<?xml version="1.0" encoding="UTF-8" standalone="no"?>
<!-- Created with Inkscape (http://www.inkscape.org/) -->

<svg
   width="48"
   height="48"
   viewBox="0 0 12.7 12.7"
   version="1.1"
   id="svg5"
   inkscape:version="1.2.2 (732a01da63, 2022-12-09)"
   sodipodi:docname="icon_lumigis.svg"
   xmlns:inkscape="http://www.inkscape.org/namespaces/inkscape"
   xmlns:sodipodi="http://sodipodi.sourceforge.net/DTD/sodipodi-0.dtd"
   xmlns="http://www.w3.org/2000/svg"
   xmlns:svg="http://www.w3.org/2000/svg">
  <sodipodi:namedview
     id="namedview7"
     pagecolor="#ffffff"
     bordercolor="#666666"
     borderopacity="1.0"
     inkscape:showpageshadow="2"
     inkscape:pageopacity="0.0"
     inkscape:pagecheckerboard="0"
     inkscape:deskcolor="#d1d1d1"
     inkscape:document-units="mm"
     showgrid="true"
     inkscape:zoom="9.8332037"
     inkscape:cx="24.152861"
     inkscape:cy="32.034321"
     inkscape:window-width="1920"
     inkscape:window-height="1000"
     inkscape:window-x="-11"
     inkscape:window-y="-11"
     inkscape:window-maximized="1"
     inkscape:current-layer="layer1">
    <inkscape:grid
       type="xygrid"
       id="grid132" />
  </sodipodi:namedview>
  <defs
     id="defs2" />
  <g
     inkscape:label="Calque 1"
     inkscape:groupmode="layer"
     id="layer1">
    <path
       style="fill:none;stroke:#ff0000;stroke-width:0.365;stroke-linecap:butt;stroke-linejoin:miter;stroke-opacity:1;stroke-dasharray:none"
       d="M 1.8520833,11.377083 9.5249999,9.2604166"
       id="path463" />
    <path
       style="fill:none;stroke:#00abff;stroke-width:0.502;stroke-linecap:round;stroke-linejoin:round;stroke-dasharray:none;stroke-opacity:1"
       d="M 1.2093594,0.81248445 H 5.9341822 V 8.0508489 H 1.2093595"
       id="path414" />
    <path
       style="fill:none;stroke:#00abff;stroke-width:0.477;stroke-linecap:round;stroke-linejoin:round;stroke-dasharray:none;stroke-opacity:1"
       d="M 1.1906249,8.0597358 V 0.80119001"
       id="path970" />
    <path
       style="fill:none;stroke:#00abff;stroke-width:0.264583px;stroke-linecap:butt;stroke-linejoin:miter;stroke-opacity:1"
       d="M 1.5875,1.9843752 H 4.2333333"
       id="path972" />
    <path
       style="fill:none;stroke:#00abff;stroke-width:0.264583px;stroke-linecap:butt;stroke-linejoin:miter;stroke-opacity:1"
       d="M 1.5875,2.9104167 H 4.7624999"
       id="path974" />
    <path
       style="fill:none;stroke:#00abff;stroke-width:0.264583px;stroke-linecap:butt;stroke-linejoin:miter;stroke-opacity:1"
       d="M 1.5875,3.8364582 H 4.2333333"
       id="path976" />
    <path
       style="fill:none;stroke:#00abff;stroke-width:0.264583px;stroke-linecap:butt;stroke-linejoin:miter;stroke-opacity:1"
       d="M 1.5875,4.7625 H 4.7624999"
       id="path978" />
    <path
       style="fill:#00abff;fill-opacity:1;stroke:#00abff;stroke-width:0.264583px;stroke-linecap:butt;stroke-linejoin:miter;stroke-opacity:1"
       d="M 1.5875,5.8208333 H 4.2333333"
       id="path980" />
    <ellipse
       style="fill:#00abff;fill-opacity:1;stroke:#00abff;stroke-width:0.220786;stroke-linecap:round;stroke-linejoin:round;stroke-miterlimit:3.3;stroke-dasharray:none;stroke-opacity:1;paint-order:fill markers stroke"
       id="path1034"
       cx="1.8962266"
       cy="7.4083333"
       rx="0.22043997"
       ry="0.22044" />
    <ellipse
       style="fill:#00abff;fill-opacity:1;stroke:#00abff;stroke-width:0.220786;stroke-linecap:round;stroke-linejoin:round;stroke-miterlimit:3.3;stroke-dasharray:none;stroke-opacity:1;paint-order:fill markers stroke"
       id="path1034-6"
       cx="2.9104166"
       cy="7.4083333"
       rx="0.22043997"
       ry="0.22044" />
    <path
       style="fill:none;stroke:#ff0000;stroke-width:0.365;stroke-linecap:butt;stroke-linejoin:miter;stroke-dasharray:none;stroke-opacity:1"
       d="M 9.6251074,9.1836413 8.1143828,5.3574421 11.377083,1.8520833"
       id="path2021"
       sodipodi:nodetypes="ccc" />
    <ellipse
       style="fill:#ffff00;fill-opacity:1;stroke:#0000ff;stroke-width:0.193176;stroke-linecap:round;stroke-linejoin:round;stroke-miterlimit:3.3;stroke-dasharray:none;stroke-opacity:1;paint-order:fill markers stroke"
       id="path1034-6-6-1"
       cx="8.1143827"
       cy="5.3574419"
       rx="1.1534121"
       ry="1.153412" />
    <ellipse
       style="fill:#ffff00;fill-opacity:1;stroke:#0000ff;stroke-width:0.193175;stroke-linecap:round;stroke-linejoin:round;stroke-miterlimit:3.3;stroke-dasharray:none;stroke-opacity:1;paint-order:fill markers stroke"
       id="path1034-6-6"
       cx="11.377083"
       cy="1.8520833"
       rx="1.1534125"
       ry="1.1534122" />
    <ellipse
       style="fill:#ffff00;fill-opacity:1;stroke:#0000ff;stroke-width:0.193175;stroke-linecap:round;stroke-linejoin:round;stroke-miterlimit:3.3;stroke-dasharray:none;stroke-opacity:1;paint-order:fill markers stroke"
       id="path1034-6-6-1-9"
       cx="9.7172575"
       cy="9.2323017"
       rx="1.1534125"
       ry="1.1534122" />
    <ellipse
       style="fill:#ffff00;fill-opacity:1;stroke:#0000ff;stroke-width:0.193175;stroke-linecap:round;stroke-linejoin:round;stroke-miterlimit:3.3;stroke-dasharray:none;stroke-opacity:1;paint-order:fill markers stroke"
       id="path1034-6-6-1-2-8"
       cx="1.8520833"
       cy="11.377083"
       rx="1.1534125"
       ry="1.1534122" />
  </g>
</svg>
