<?xml version="1.0" encoding="UTF-8" standalone="no"?>
<svg
   inkscape:version="1.2.2 (732a01da63, 2022-12-09)"
   height="65"
   width="65"
   sodipodi:docname="smdev=terre.svg"
   id="svg24"
   y="0px"
   x="0px"
   version="1.1"
   viewBox="0 0 65.000001 65.000001"
   xmlns:inkscape="http://www.inkscape.org/namespaces/inkscape"
   xmlns:sodipodi="http://sodipodi.sourceforge.net/DTD/sodipodi-0.dtd"
   xmlns="http://www.w3.org/2000/svg"
   xmlns:svg="http://www.w3.org/2000/svg"
   xmlns:rdf="http://www.w3.org/1999/02/22-rdf-syntax-ns#"
   xmlns:cc="http://creativecommons.org/ns#"
   xmlns:dc="http://purl.org/dc/elements/1.1/">
  <metadata
     id="metadata30">
    <rdf:RDF>
      <cc:Work
         rdf:about="">
        <dc:format>image/svg+xml</dc:format>
        <dc:type
           rdf:resource="http://purl.org/dc/dcmitype/StillImage" />
      </cc:Work>
    </rdf:RDF>
  </metadata>
  <defs
     id="defs28" />
  <sodipodi:namedview
     inkscape:current-layer="svg24"
     inkscape:window-maximized="1"
     inkscape:window-y="-8"
     inkscape:window-x="1912"
     inkscape:cy="38.662774"
     inkscape:cx="-4.6760288"
     inkscape:zoom="4.384062"
     inkscape:snap-page="true"
     inkscape:snap-text-baseline="true"
     inkscape:snap-center="true"
     inkscape:snap-object-midpoints="true"
     inkscape:snap-midpoints="true"
     inkscape:snap-smooth-nodes="true"
     inkscape:snap-intersection-paths="true"
     inkscape:object-paths="true"
     inkscape:snap-bbox-midpoints="true"
     inkscape:snap-bbox-edge-midpoints="true"
     inkscape:bbox-paths="true"
     inkscape:bbox-nodes="true"
     inkscape:snap-bbox="true"
     inkscape:guide-bbox="true"
     showguides="true"
     showgrid="false"
     id="namedview26"
     inkscape:window-height="1027"
     inkscape:window-width="1920"
     inkscape:pageshadow="2"
     inkscape:pageopacity="0"
     guidetolerance="10"
     gridtolerance="10"
     objecttolerance="10"
     borderopacity="1"
     bordercolor="#666666"
     pagecolor="#ffffff"
     inkscape:pagecheckerboard="0"
     inkscape:showpageshadow="2"
     inkscape:deskcolor="#d1d1d1">
    <sodipodi:guide
       id="guide43"
       orientation="0.70710678,-0.70710678"
       position="65.000001,65.000001"
       inkscape:locked="false" />
    <sodipodi:guide
       id="guide47"
       orientation="-0.70710678,-0.70710678"
       position="0,65.000001"
       inkscape:locked="false" />
  </sodipodi:namedview>
  <circle
     style="fill:#ffffff;fill-opacity:1;fill-rule:nonzero;stroke:#ff3300;stroke-width:5.486;stroke-linecap:square;stroke-linejoin:round;stroke-miterlimit:11.2;stroke-dasharray:none;stroke-dashoffset:0;stroke-opacity:0.964706"
     cx="32.5"
     cy="32.5"
     r="29.257143"
     id="circle2" />
  <g
     display="inline"
     id="g18"
     transform="translate(0.5,0.50001842)"
     style="stroke:#ff3300;stroke-opacity:0.96470588">
    <g
       id="g16"
       style="stroke:#ff3300;stroke-opacity:0.96470588">
      <path
         d="M 32.00908,12.988641 V 29.30729"
         fill="none"
         stroke="#000000"
         stroke-width="4"
         stroke-linecap="round"
         stroke-linejoin="miter"
         stroke-miterlimit="4"
         stroke-dasharray="none"
         stroke-opacity="1"
         id="path6"
         style="stroke:#ff3300;stroke-opacity:0.96470588" />
      <path
         d="M 13.041113,31.490295 H 50.995799"
         fill="none"
         stroke="#000000"
         stroke-width="4"
         stroke-linecap="round"
         stroke-linejoin="miter"
         stroke-miterlimit="4"
         stroke-dasharray="none"
         stroke-opacity="1"
         id="path8"
         style="stroke:#ff3300;stroke-opacity:0.96470588" />
      <path
         d="M 18.029495,37.903828 H 46.011634"
         fill="none"
         stroke="#000000"
         stroke-width="4"
         stroke-linecap="round"
         stroke-linejoin="miter"
         stroke-miterlimit="4"
         stroke-dasharray="none"
         stroke-opacity="1"
         id="path10"
         style="stroke:#ff3300;stroke-opacity:0.96470588" />
      <path
         d="m 23.121304,44.296706 h 17.77452"
         fill="none"
         stroke="#000000"
         stroke-width="4"
         stroke-linecap="round"
         stroke-linejoin="miter"
         stroke-miterlimit="4"
         stroke-dasharray="none"
         stroke-opacity="1"
         id="path12"
         style="stroke:#ff3300;stroke-opacity:0.96470588" />
      <path
         d="m 28.384382,50.69721 h 7.23872"
         fill="none"
         stroke="#000000"
         stroke-width="4"
         stroke-linecap="round"
         stroke-linejoin="miter"
         stroke-miterlimit="4"
         stroke-dasharray="none"
         stroke-opacity="1"
         id="path14"
         style="stroke:#ff3300;stroke-opacity:0.96470588" />
    </g>
  </g>
</svg>
