<?xml version="1.0" encoding="UTF-8" standalone="no"?>
<svg
   version="1.1"
   x="0px"
   y="0px"
   viewBox="0 0 7937.0081 7937.0079"
   enable-background="new 0 0 110 110"
   xml:space="preserve"
   id="svg2"
   inkscape:version="1.2.2 (732a01da63, 2022-12-09)"
   sodipodi:docname="sde=regard_ep.svg"
   width="210cm"
   height="210cm"
   xmlns:inkscape="http://www.inkscape.org/namespaces/inkscape"
   xmlns:sodipodi="http://sodipodi.sourceforge.net/DTD/sodipodi-0.dtd"
   xmlns="http://www.w3.org/2000/svg"
   xmlns:svg="http://www.w3.org/2000/svg"
   xmlns:rdf="http://www.w3.org/1999/02/22-rdf-syntax-ns#"
   xmlns:cc="http://creativecommons.org/ns#"
   xmlns:dc="http://purl.org/dc/elements/1.1/"
   xmlns:osb="http://www.openswatchbook.org/uri/2009/osb"><metadata
     id="metadata24"><rdf:RDF><cc:Work
         rdf:about=""><dc:format>image/svg+xml</dc:format><dc:type
           rdf:resource="http://purl.org/dc/dcmitype/StillImage" /><dc:title /></cc:Work></rdf:RDF></metadata><defs
     id="defs22"><linearGradient
       id="linearGradient8459"
       osb:paint="solid"><stop
         style="stop-color:#000000;stop-opacity:1"
         offset="0"
         id="stop8457" /></linearGradient><inkscape:path-effect
       effect="spiro"
       id="path-effect9577"
       is_visible="true" /><inkscape:path-effect
       effect="spiro"
       id="path-effect9573"
       is_visible="true" /><inkscape:path-effect
       effect="spiro"
       id="path-effect9561"
       is_visible="true" /><inkscape:path-effect
       is_visible="true"
       id="path-effect9557"
       effect="spiro" /><inkscape:path-effect
       effect="spiro"
       id="path-effect9549"
       is_visible="true" /><inkscape:path-effect
       effect="spiro"
       id="path-effect9545"
       is_visible="true" /><inkscape:path-effect
       effect="spiro"
       id="path-effect9541"
       is_visible="true" /><inkscape:path-effect
       effect="spiro"
       id="path-effect9537"
       is_visible="true" /><inkscape:path-effect
       effect="spiro"
       id="path-effect9533"
       is_visible="true" /><inkscape:path-effect
       effect="spiro"
       id="path-effect9529"
       is_visible="true" /><linearGradient
       id="linearGradient9521"
       osb:paint="solid"><stop
         style="stop-color:#000000;stop-opacity:1"
         offset="0"
         id="stop9523" /></linearGradient><linearGradient
       id="linearGradient9513"
       osb:paint="gradient"><stop
         style="stop-color:#000000;stop-opacity:1"
         offset="0"
         id="stop9515" /><stop
         style="stop-color:#000000;stop-opacity:0"
         offset="1"
         id="stop9517" /></linearGradient><linearGradient
       id="linearGradient9600"
       osb:paint="solid"><stop
         style="stop-color:#000000;stop-opacity:1"
         offset="0"
         id="stop9602" /></linearGradient></defs><sodipodi:namedview
     pagecolor="#ffffff"
     bordercolor="#666666"
     borderopacity="1"
     objecttolerance="10"
     gridtolerance="10"
     guidetolerance="10"
     inkscape:pageopacity="0"
     inkscape:pageshadow="2"
     inkscape:window-width="2048"
     inkscape:window-height="1072"
     id="namedview20"
     showgrid="true"
     inkscape:zoom="0.08"
     inkscape:cx="3981.25"
     inkscape:cy="4012.5"
     inkscape:window-x="-11"
     inkscape:window-y="-11"
     inkscape:window-maximized="1"
     inkscape:current-layer="g4"
     inkscape:snap-bbox="false"
     inkscape:snap-nodes="true"
     inkscape:document-units="cm"
     units="cm"
     inkscape:snap-object-midpoints="true"
     inkscape:object-nodes="false"
     inkscape:showpageshadow="false"
     showguides="true"
     inkscape:lockguides="false"
     inkscape:guide-bbox="true"
     inkscape:pagecheckerboard="0"
     inkscape:deskcolor="#d1d1d1"><inkscape:grid
       type="xygrid"
       id="grid8070" /><sodipodi:guide
       position="0,0"
       orientation="0,7937.0079"
       id="guide840"
       inkscape:locked="false" /><sodipodi:guide
       position="7937.0081,0"
       orientation="-7937.0079,0"
       id="guide842"
       inkscape:locked="false" /><sodipodi:guide
       position="7937.0081,7937.0081"
       orientation="0,-7937.0079"
       id="guide844"
       inkscape:locked="false" /><sodipodi:guide
       position="0,7937.0081"
       orientation="7937.0079,0"
       id="guide846"
       inkscape:locked="false" /><sodipodi:guide
       position="7937.0082,7937.008"
       orientation="-0.70710678,0.70710678"
       id="guide848"
       inkscape:locked="false" /><sodipodi:guide
       position="0,7937.008"
       orientation="0.70710678,0.70710678"
       id="guide850"
       inkscape:locked="false" /></sodipodi:namedview><g
     id="g4"
     transform="translate(0,7799.508)"><g
       id="g838"
       transform="translate(-17.619374,41.605537)"
       style="fill:none;fill-opacity:1;stroke:#ff0000;stroke-opacity:1"><path
         inkscape:connector-curvature="0"
         style="opacity:1;fill:none;fill-opacity:1;stroke-width:0.99953115;paint-order:stroke fill markers;stroke:#ff0000;stroke-opacity:1"
         id="path10"
         d="M 86.965612,18.334471 H 22.777111 c -2.350778,0 -4.257111,1.917891 -4.257111,4.28192 v 64.581697 c 0,2.363026 1.906333,4.278912 4.257111,4.278912 h 64.188501 c 2.352771,0 4.258107,-1.914883 4.258107,-4.278912 V 22.616391 c 9.97e-4,-2.364029 -1.905336,-4.28192 -4.258107,-4.28192 z m -32.092756,60.83414 c -13.321408,0 -24.115656,-10.862702 -24.115656,-24.261873 0,-13.39917 10.794248,-24.263878 24.115656,-24.263878 13.317423,0 24.115656,10.864708 24.115656,24.263878 0,13.399171 -10.798233,24.261873 -24.115656,24.261873 z" /><path
         inkscape:connector-curvature="0"
         style="opacity:1;fill:none;fill-opacity:1;stroke:#ff0000;stroke-width:113.33266449;stroke-miterlimit:0;stroke-dasharray:none;stroke-opacity:1;paint-order:stroke fill markers"
         id="path14"
         d="M 7162.9884,-116.25807 H 799.05004 c -291.05666,0 -527.80798,-238.3527 -527.80798,-531.17401 V -7049.9559 c 0,-292.9043 236.75132,-531.0082 527.80798,-531.0082 H 7162.9884 c 291.0565,0 527.9727,238.1867 527.9727,531.0082 v 6402.44097 c 0.083,292.90416 -236.8338,531.25686 -527.9727,531.25686 z M 799.05004,-7226.9587 c -97.1561,0 -175.93602,79.3404 -175.93602,177.0028 v 6402.44097 c 0,97.74526 78.77992,177.16849 175.93602,177.16849 H 7162.9884 c 97.1562,0 176.1008,-79.42323 176.1008,-177.16849 V -7049.9559 c 0,-97.7454 -78.9446,-177.0028 -176.1008,-177.0028 z" /><rect
         y="-6920.3818"
         x="956.71863"
         height="6095.5449"
         width="6058.8096"
         id="rect835"
         style="fill:none;fill-opacity:1;stroke:#ff0000;stroke-width:113.33266449;stroke-miterlimit:0;stroke-dasharray:none;stroke-opacity:1" /></g><path
       style="fill:none;stroke:#ff0000;stroke-width:0;stroke-linecap:butt;stroke-linejoin:miter;stroke-opacity:1;fill-opacity:1;stroke-dasharray:none"
       d="m 3937.7009,-3828.6615 64.0815,-2.2097"
       id="path5712" /></g></svg>
