<?xml version="1.0" encoding="UTF-8" standalone="no"?>
<svg
   xmlns:osb="http://www.openswatchbook.org/uri/2009/osb"
   xmlns:dc="http://purl.org/dc/elements/1.1/"
   xmlns:cc="http://creativecommons.org/ns#"
   xmlns:rdf="http://www.w3.org/1999/02/22-rdf-syntax-ns#"
   xmlns:svg="http://www.w3.org/2000/svg"
   xmlns="http://www.w3.org/2000/svg"
   xmlns:xlink="http://www.w3.org/1999/xlink"
   xmlns:sodipodi="http://sodipodi.sourceforge.net/DTD/sodipodi-0.dtd"
   xmlns:inkscape="http://www.inkscape.org/namespaces/inkscape"
   version="1.1"
   x="0px"
   y="0px"
   viewBox="0 0 5845.5306 12222.5"
   id="svg2"
   inkscape:version="0.92.4 (5da689c313, 2019-01-14)"
   sodipodi:docname="smdev=projecteur.svg"
   width="154.66299cm"
   height="323.38699cm">
  <metadata
     id="metadata16">
    <rdf:RDF>
      <cc:Work
         rdf:about="">
        <dc:format>image/svg+xml</dc:format>
        <dc:type
           rdf:resource="http://purl.org/dc/dcmitype/StillImage" />
        <dc:title></dc:title>
      </cc:Work>
    </rdf:RDF>
  </metadata>
  <defs
     id="defs14">
    <linearGradient
       id="linearGradient5102"
       osb:paint="solid">
      <stop
         style="stop-color:#000000;stop-opacity:1;"
         offset="0"
         id="stop5100" />
    </linearGradient>
    <inkscape:path-effect
       effect="spiro"
       id="path-effect5098"
       is_visible="true" />
    <linearGradient
       id="linearGradient5092"
       osb:paint="solid">
      <stop
         style="stop-color:#000000;stop-opacity:1;"
         offset="0"
         id="stop5090" />
    </linearGradient>
    <inkscape:path-effect
       effect="spiro"
       id="path-effect5088"
       is_visible="true" />
    <linearGradient
       id="linearGradient4927"
       osb:paint="solid">
      <stop
         style="stop-color:#000000;stop-opacity:1;"
         offset="0"
         id="stop4925" />
    </linearGradient>
    <inkscape:path-effect
       effect="spiro"
       id="path-effect4923"
       is_visible="true" />
    <inkscape:path-effect
       effect="spiro"
       id="path-effect4919"
       is_visible="true" />
    <inkscape:path-effect
       effect="spiro"
       id="path-effect4915"
       is_visible="true" />
    <linearGradient
       id="linearGradient4909"
       osb:paint="solid">
      <stop
         style="stop-color:#000000;stop-opacity:1;"
         offset="0"
         id="stop4907" />
    </linearGradient>
    <inkscape:path-effect
       effect="spiro"
       id="path-effect4905"
       is_visible="true" />
    <linearGradient
       id="linearGradient4899"
       osb:paint="solid">
      <stop
         style="stop-color:#000000;stop-opacity:1;"
         offset="0"
         id="stop4897" />
    </linearGradient>
    <inkscape:path-effect
       effect="spiro"
       id="path-effect4895"
       is_visible="true" />
    <linearGradient
       id="linearGradient4889"
       osb:paint="solid">
      <stop
         style="stop-color:#000000;stop-opacity:1;"
         offset="0"
         id="stop4887" />
    </linearGradient>
    <inkscape:path-effect
       effect="spiro"
       id="path-effect4885"
       is_visible="true" />
    <inkscape:path-effect
       effect="spiro"
       id="path-effect4881"
       is_visible="true" />
    <linearGradient
       id="linearGradient4875"
       osb:paint="solid">
      <stop
         style="stop-color:#000000;stop-opacity:1;"
         offset="0"
         id="stop4873" />
    </linearGradient>
    <inkscape:path-effect
       effect="spiro"
       id="path-effect4871"
       is_visible="true" />
    <linearGradient
       id="linearGradient4865"
       osb:paint="solid">
      <stop
         style="stop-color:#000000;stop-opacity:1;"
         offset="0"
         id="stop4863" />
    </linearGradient>
    <linearGradient
       id="linearGradient4857"
       osb:paint="solid">
      <stop
         style="stop-color:#000000;stop-opacity:1;"
         offset="0"
         id="stop4855" />
    </linearGradient>
    <linearGradient
       id="linearGradient4849"
       osb:paint="solid">
      <stop
         style="stop-color:#000000;stop-opacity:1;"
         offset="0"
         id="stop4847" />
    </linearGradient>
    <linearGradient
       id="linearGradient4841"
       osb:paint="solid">
      <stop
         style="stop-color:#000000;stop-opacity:1;"
         offset="0"
         id="stop4839" />
    </linearGradient>
    <linearGradient
       id="linearGradient4829"
       osb:paint="solid">
      <stop
         style="stop-color:#000000;stop-opacity:1;"
         offset="0"
         id="stop4827" />
    </linearGradient>
    <linearGradient
       id="linearGradient4823"
       osb:paint="solid">
      <stop
         style="stop-color:#000000;stop-opacity:1;"
         offset="0"
         id="stop4821" />
    </linearGradient>
    <linearGradient
       id="linearGradient4809"
       osb:paint="solid">
      <stop
         style="stop-color:#000000;stop-opacity:1;"
         offset="0"
         id="stop4807" />
    </linearGradient>
    <inkscape:path-effect
       effect="spiro"
       id="path-effect4787"
       is_visible="true" />
    <linearGradient
       id="linearGradient4781"
       osb:paint="solid">
      <stop
         style="stop-color:#000000;stop-opacity:1;"
         offset="0"
         id="stop4779" />
    </linearGradient>
    <inkscape:path-effect
       effect="spiro"
       id="path-effect4777"
       is_visible="true" />
    <linearGradient
       id="linearGradient4777"
       osb:paint="solid">
      <stop
         style="stop-color:#000000;stop-opacity:1;"
         offset="0"
         id="stop4775" />
    </linearGradient>
    <linearGradient
       id="linearGradient8113"
       osb:paint="solid">
      <stop
         style="stop-color:#000000;stop-opacity:1;"
         offset="0"
         id="stop8115" />
    </linearGradient>
    <inkscape:path-effect
       effect="spiro"
       id="path-effect8121"
       is_visible="true" />
    <inkscape:path-effect
       effect="spiro"
       id="path-effect8117"
       is_visible="true" />
    <inkscape:path-effect
       effect="spiro"
       id="path-effect8113"
       is_visible="true" />
    <inkscape:path-effect
       effect="spiro"
       id="path-effect8109"
       is_visible="true" />
    <inkscape:path-effect
       effect="spiro"
       id="path-effect8100"
       is_visible="true" />
    <inkscape:path-effect
       effect="spiro"
       id="path-effect8096"
       is_visible="true" />
    <inkscape:path-effect
       effect="spiro"
       id="path-effect8098"
       is_visible="true" />
    <inkscape:path-effect
       effect="spiro"
       id="path-effect8146"
       is_visible="true" />
    <inkscape:path-effect
       effect="spiro"
       id="path-effect8142"
       is_visible="true" />
    <inkscape:path-effect
       effect="spiro"
       id="path-effect8138"
       is_visible="true" />
    <inkscape:path-effect
       effect="spiro"
       id="path-effect8134"
       is_visible="true" />
    <linearGradient
       id="linearGradient8108"
       osb:paint="solid">
      <stop
         style="stop-color:#000000;stop-opacity:1;"
         offset="0"
         id="stop8110" />
    </linearGradient>
    <linearGradient
       id="linearGradient8098"
       osb:paint="solid">
      <stop
         style="stop-color:#000000;stop-opacity:1;"
         offset="0"
         id="stop8100" />
    </linearGradient>
    <linearGradient
       id="linearGradient8092"
       osb:paint="solid">
      <stop
         style="stop-color:#000000;stop-opacity:1;"
         offset="0"
         id="stop8094" />
    </linearGradient>
    <linearGradient
       id="linearGradient8086"
       osb:paint="solid">
      <stop
         style="stop-color:#000007;stop-opacity:1;"
         offset="0"
         id="stop8088" />
    </linearGradient>
    <linearGradient
       id="linearGradient8080"
       osb:paint="solid">
      <stop
         style="stop-color:#000000;stop-opacity:1;"
         offset="0"
         id="stop8082" />
    </linearGradient>
    <inkscape:path-effect
       effect="spiro"
       id="path-effect8098-0"
       is_visible="true" />
    <inkscape:path-effect
       effect="spiro"
       id="path-effect8098-2"
       is_visible="true" />
    <inkscape:path-effect
       effect="spiro"
       id="path-effect8098-2-2"
       is_visible="true" />
    <linearGradient
       inkscape:collect="always"
       xlink:href="#linearGradient4781"
       id="linearGradient4783"
       x1="959.49994"
       y1="2597.7952"
       x2="960.49994"
       y2="2597.7952"
       gradientUnits="userSpaceOnUse" />
    <linearGradient
       inkscape:collect="always"
       xlink:href="#linearGradient4899"
       id="linearGradient4901"
       x1="479.82303"
       y1="1157.7952"
       x2="6400.1768"
       y2="1157.7952"
       gradientUnits="userSpaceOnUse"
       gradientTransform="translate(-8.5142837e-5)" />
    <linearGradient
       inkscape:collect="always"
       xlink:href="#linearGradient4909"
       id="linearGradient4911"
       x1="2799.8889"
       y1="3157.7952"
       x2="6320.1104"
       y2="3157.7952"
       gradientUnits="userSpaceOnUse" />
    <linearGradient
       inkscape:collect="always"
       xlink:href="#linearGradient4927"
       id="linearGradient4929"
       x1="2541.073"
       y1="4157.7949"
       x2="6418.9263"
       y2="4157.7949"
       gradientUnits="userSpaceOnUse" />
    <linearGradient
       inkscape:collect="always"
       xlink:href="#linearGradient4927"
       id="linearGradient4929-8"
       x1="2541.073"
       y1="4157.7949"
       x2="6418.9263"
       y2="4157.7949"
       gradientUnits="userSpaceOnUse" />
    <inkscape:path-effect
       effect="spiro"
       id="path-effect4923-0"
       is_visible="true" />
    <inkscape:path-effect
       effect="spiro"
       id="path-effect4919-1"
       is_visible="true" />
    <inkscape:path-effect
       effect="spiro"
       id="path-effect4915-9"
       is_visible="true" />
    <linearGradient
       inkscape:collect="always"
       xlink:href="#linearGradient4927"
       id="linearGradient4911-2"
       x1="2799.8889"
       y1="3157.7952"
       x2="6320.1104"
       y2="3157.7952"
       gradientUnits="userSpaceOnUse" />
    <inkscape:path-effect
       effect="spiro"
       id="path-effect4905-5"
       is_visible="true" />
    <inkscape:path-effect
       effect="spiro"
       id="path-effect4881-8"
       is_visible="true" />
    <inkscape:path-effect
       is_visible="true"
       id="path-effect5098-7"
       effect="spiro" />
    <inkscape:path-effect
       is_visible="true"
       id="path-effect5088-6"
       effect="spiro" />
    <inkscape:path-effect
       is_visible="true"
       id="path-effect4923-7"
       effect="spiro" />
    <inkscape:path-effect
       is_visible="true"
       id="path-effect4919-18"
       effect="spiro" />
    <inkscape:path-effect
       is_visible="true"
       id="path-effect4915-0"
       effect="spiro" />
    <inkscape:path-effect
       is_visible="true"
       id="path-effect4905-4"
       effect="spiro" />
    <inkscape:path-effect
       is_visible="true"
       id="path-effect4895-4"
       effect="spiro" />
    <inkscape:path-effect
       is_visible="true"
       id="path-effect4885-6"
       effect="spiro" />
    <inkscape:path-effect
       is_visible="true"
       id="path-effect4881-2"
       effect="spiro" />
    <inkscape:path-effect
       is_visible="true"
       id="path-effect4871-0"
       effect="spiro" />
    <inkscape:path-effect
       is_visible="true"
       id="path-effect4787-3"
       effect="spiro" />
    <inkscape:path-effect
       is_visible="true"
       id="path-effect4777-7"
       effect="spiro" />
    <inkscape:path-effect
       is_visible="true"
       id="path-effect8121-3"
       effect="spiro" />
    <inkscape:path-effect
       is_visible="true"
       id="path-effect8117-2"
       effect="spiro" />
    <inkscape:path-effect
       is_visible="true"
       id="path-effect8113-8"
       effect="spiro" />
    <inkscape:path-effect
       is_visible="true"
       id="path-effect8109-5"
       effect="spiro" />
    <inkscape:path-effect
       is_visible="true"
       id="path-effect8100-8"
       effect="spiro" />
    <inkscape:path-effect
       is_visible="true"
       id="path-effect8096-3"
       effect="spiro" />
    <inkscape:path-effect
       is_visible="true"
       id="path-effect8098-1"
       effect="spiro" />
    <inkscape:path-effect
       is_visible="true"
       id="path-effect8146-3"
       effect="spiro" />
    <inkscape:path-effect
       is_visible="true"
       id="path-effect8142-2"
       effect="spiro" />
    <inkscape:path-effect
       is_visible="true"
       id="path-effect8138-0"
       effect="spiro" />
    <inkscape:path-effect
       is_visible="true"
       id="path-effect8134-7"
       effect="spiro" />
    <inkscape:path-effect
       is_visible="true"
       id="path-effect8098-0-8"
       effect="spiro" />
    <inkscape:path-effect
       is_visible="true"
       id="path-effect8098-2-7"
       effect="spiro" />
    <inkscape:path-effect
       is_visible="true"
       id="path-effect8098-2-2-6"
       effect="spiro" />
    <inkscape:path-effect
       is_visible="true"
       id="path-effect4923-0-1"
       effect="spiro" />
    <inkscape:path-effect
       is_visible="true"
       id="path-effect4919-1-2"
       effect="spiro" />
    <inkscape:path-effect
       is_visible="true"
       id="path-effect4915-9-6"
       effect="spiro" />
    <inkscape:path-effect
       is_visible="true"
       id="path-effect4905-5-4"
       effect="spiro" />
    <inkscape:path-effect
       is_visible="true"
       id="path-effect4881-8-4"
       effect="spiro" />
  </defs>
  <sodipodi:namedview
     pagecolor="#ffffff"
     bordercolor="#666666"
     borderopacity="1"
     objecttolerance="10"
     gridtolerance="10"
     guidetolerance="10"
     inkscape:pageopacity="0"
     inkscape:pageshadow="2"
     inkscape:window-width="1024"
     inkscape:window-height="705"
     id="namedview12"
     showgrid="true"
     inkscape:zoom="0.024905638"
     inkscape:cx="-3607.7381"
     inkscape:cy="6455.0293"
     inkscape:window-x="-8"
     inkscape:window-y="-8"
     inkscape:window-maximized="1"
     inkscape:current-layer="svg2"
     inkscape:snap-bbox="true"
     showguides="true"
     inkscape:document-units="cm"
     units="cm"
     inkscape:snap-object-midpoints="true"
     inkscape:object-nodes="true"
     inkscape:snap-page="false"
     inkscape:snap-center="true"
     inkscape:snap-midpoints="true"
     inkscape:snap-others="true"
     inkscape:snap-nodes="true"
     inkscape:object-paths="true"
     inkscape:snap-grids="false"
     inkscape:snap-intersection-paths="true"
     inkscape:snap-to-guides="false"
     inkscape:measure-start="12480,-640"
     inkscape:measure-end="12480,4480"
     inkscape:bbox-paths="true"
     inkscape:bbox-nodes="true"
     inkscape:snap-bbox-edge-midpoints="true"
     inkscape:snap-bbox-midpoints="true"
     inkscape:snap-smooth-nodes="true">
    <inkscape:grid
       type="xygrid"
       id="grid8076" />
  </sodipodi:namedview>
  <ellipse
     style="opacity:1;fill:none;fill-opacity:1;fill-rule:nonzero;stroke:none;stroke-width:5.31496048;stroke-linecap:butt;stroke-linejoin:bevel;stroke-miterlimit:4;stroke-dasharray:none;stroke-dashoffset:0;stroke-opacity:1"
     id="path8104"
     cx="-5062.3604"
     cy="5421.5381"
     rx="7.5"
     ry="2.5"
     transform="rotate(-90)" />
  <path
     style="fill:none;fill-rule:evenodd;stroke:url(#linearGradient4783);stroke-width:0.9826771;stroke-linecap:butt;stroke-linejoin:miter;stroke-miterlimit:4;stroke-dasharray:none;stroke-opacity:1"
     d="M 8429.5811,4373.0324 V 1813.0329"
     id="path4775"
     inkscape:connector-curvature="0"
     inkscape:path-effect="#path-effect4777"
     inkscape:original-d="M 8429.5811,4373.0324 V 1813.0329"
     transform="rotate(-90,6372.5866,6208.8287)" />
  <path
     style="opacity:1;fill:none;fill-opacity:1;fill-rule:nonzero;stroke:none;stroke-width:113.38582611;stroke-linecap:butt;stroke-linejoin:miter;stroke-miterlimit:4;stroke-dasharray:none;stroke-dashoffset:90.65753174;stroke-opacity:1;paint-order:stroke fill markers"
     id="path4813"
     sodipodi:type="arc"
     sodipodi:cx="-2682.426"
     sodipodi:cy="1924.9794"
     sodipodi:rx="916.52716"
     sodipodi:ry="162.0448"
     sodipodi:start="0"
     sodipodi:end="0.74488035"
     d="m -1765.8989,1924.9794 a 916.52716,162.0448 0 0 1 -242.7248,109.8475 l -673.8023,-109.8475 z"
     transform="rotate(-90)" />
  <ellipse
     style="opacity:1;fill:none;fill-opacity:1;fill-rule:nonzero;stroke:none;stroke-width:113.38582611;stroke-linecap:butt;stroke-linejoin:miter;stroke-miterlimit:4;stroke-dasharray:none;stroke-dashoffset:90.65753174;stroke-opacity:1;paint-order:stroke fill markers"
     id="path4833"
     cx="-2478.8411"
     cy="2077.6619"
     rx="257.51727"
     ry="32.833805"
     transform="rotate(-90)" />
  <path
     style="opacity:1;fill:none;fill-opacity:1;fill-rule:nonzero;stroke:none;stroke-width:113.38582611;stroke-linecap:butt;stroke-linejoin:miter;stroke-miterlimit:4;stroke-dasharray:none;stroke-dashoffset:90.65753174;stroke-opacity:1;paint-order:stroke fill markers"
     id="path4835"
     sodipodi:type="arc"
     sodipodi:cx="-3101.8958"
     sodipodi:cy="2080.782"
     sodipodi:rx="497.05704"
     sodipodi:ry="6.2416244"
     sodipodi:start="4.7131701"
     sodipodi:end="5.0007056"
     d="m -3101.5075,2074.5404 a 497.05704,6.2416244 0 0 1 140.9443,0.2576 l -141.3326,5.984 z"
     transform="rotate(-90)" />
  <path
     style="opacity:1;fill:#ffc951;fill-opacity:0.98823529;fill-rule:nonzero;stroke:#000000;stroke-width:188.97637939;stroke-linecap:butt;stroke-linejoin:miter;stroke-miterlimit:4;stroke-dasharray:none;stroke-dashoffset:90.65753174;stroke-opacity:1;paint-order:stroke fill markers"
     id="path4861"
     transform="matrix(0,-1,-1,0,0,0)"
     sodipodi:type="arc"
     sodipodi:cx="-6046.0713"
     sodipodi:cy="-3198.4851"
     sodipodi:rx="2250.9685"
     sodipodi:ry="1830.0399"
     sodipodi:start="4.7168479"
     sodipodi:end="1.5701209"
     d="m -6036.0344,-5028.5068 a 2250.9685,1830.0399 0 0 1 2240.9276,1833.4837 2250.9685,1830.0399 0 0 1 -2249.4441,1826.5775 l -1.5204,-1830.0395 z" />
  <path
     style="fill:none;fill-rule:evenodd;stroke:#000000;stroke-width:1px;stroke-linecap:butt;stroke-linejoin:miter;stroke-opacity:1"
     d="m 12518.915,5116.2414 v 0"
     id="path4879"
     inkscape:connector-curvature="0"
     inkscape:path-effect="#path-effect4881"
     inkscape:original-d="m 12518.915,5116.2414 c 31.847,-95.071 31.847,-95.071 0,0"
     transform="rotate(-90,6372.5866,6208.8287)" />
  <path
     style="fill:none;fill-rule:evenodd;stroke:url(#linearGradient4911);stroke-width:113.38581848;stroke-linecap:butt;stroke-linejoin:miter;stroke-miterlimit:4;stroke-dasharray:none;stroke-opacity:1"
     d="m 8918.7473,3516.2414 3562.7077,800"
     id="path4903"
     inkscape:connector-curvature="0"
     inkscape:path-effect="#path-effect4905"
     inkscape:original-d="m 8918.7473,3516.2414 3562.7077,800"
     transform="rotate(-90,6372.5866,6208.8287)" />
  <path
     style="fill:none;fill-rule:evenodd;stroke:#000000;stroke-width:1px;stroke-linecap:butt;stroke-linejoin:miter;stroke-opacity:1"
     d="m 12518.915,5596.2414 -880,-400"
     id="path4913"
     inkscape:connector-curvature="0"
     inkscape:path-effect="#path-effect4915"
     inkscape:original-d="m 12518.915,5596.2414 c -200.367,-269.782 -570.022,-304.586 -880,-400"
     transform="rotate(-90,6372.5866,6208.8287)" />
  <path
     style="fill:none;fill-rule:evenodd;stroke:#000000;stroke-width:1px;stroke-linecap:butt;stroke-linejoin:miter;stroke-opacity:1"
     d="m 12518.915,5596.2414 -80,-80"
     id="path4917"
     inkscape:connector-curvature="0"
     inkscape:path-effect="#path-effect4919"
     inkscape:original-d="m 12518.915,5596.2414 c -17.136,-33.595 -53.334,-53.333 -80,-80"
     transform="rotate(-90,6372.5866,6208.8287)" />
  <path
     style="fill:none;fill-rule:evenodd;stroke:url(#linearGradient4929);stroke-width:113.38581848;stroke-linecap:butt;stroke-linejoin:miter;stroke-miterlimit:4;stroke-dasharray:none;stroke-opacity:1"
     d="m 8678.9148,4236.2414 3840.0002,1360"
     id="path4921"
     inkscape:connector-curvature="0"
     inkscape:path-effect="#path-effect4923"
     inkscape:original-d="m 8678.9148,4236.2414 3840.0002,1360"
     transform="rotate(-90,6372.5866,6208.8287)" />
  <path
     style="fill:none;fill-rule:evenodd;stroke:#000000;stroke-width:1px;stroke-linecap:butt;stroke-linejoin:miter;stroke-opacity:1"
     d="m 12511.796,958.77329 v 0"
     id="path4879-4"
     inkscape:connector-curvature="0"
     inkscape:path-effect="#path-effect4881-8"
     inkscape:original-d="m 12511.796,958.77329 c 31.847,95.07161 31.847,95.07161 0,0"
     transform="rotate(-90,6372.5866,6208.8287)" />
  <path
     style="fill:none;fill-rule:evenodd;stroke:url(#linearGradient4911-2);stroke-width:113.38581848;stroke-linecap:butt;stroke-linejoin:miter;stroke-miterlimit:4;stroke-dasharray:none;stroke-opacity:1"
     d="M 8911.6288,2558.7732 12474.336,1758.7733"
     id="path4903-9"
     inkscape:connector-curvature="0"
     inkscape:path-effect="#path-effect4905-5"
     inkscape:original-d="M 8911.6288,2558.7732 12474.336,1758.7733"
     transform="rotate(-90,6372.5866,6208.8287)" />
  <path
     style="fill:none;fill-rule:evenodd;stroke:#000000;stroke-width:1px;stroke-linecap:butt;stroke-linejoin:miter;stroke-opacity:1"
     d="m 12511.796,478.77349 -880,399.9998"
     id="path4913-9"
     inkscape:connector-curvature="0"
     inkscape:path-effect="#path-effect4915-9"
     inkscape:original-d="m 12511.796,478.77349 c -200.367,269.7818 -570.022,304.5862 -880,399.9998"
     transform="rotate(-90,6372.5866,6208.8287)" />
  <path
     style="fill:none;fill-rule:evenodd;stroke:#000000;stroke-width:1px;stroke-linecap:butt;stroke-linejoin:miter;stroke-opacity:1"
     d="m 12511.796,478.77349 -80,80"
     id="path4917-4"
     inkscape:connector-curvature="0"
     inkscape:path-effect="#path-effect4919-1"
     inkscape:original-d="m 12511.796,478.77349 c -17.135,33.5947 -53.333,53.3334 -80,80"
     transform="rotate(-90,6372.5866,6208.8287)" />
  <path
     style="fill:none;fill-rule:evenodd;stroke:url(#linearGradient4929-8);stroke-width:113.38581848;stroke-linecap:butt;stroke-linejoin:miter;stroke-miterlimit:4;stroke-dasharray:none;stroke-opacity:1"
     d="M 8671.7963,1838.7733 12511.796,478.77349"
     id="path4921-2"
     inkscape:connector-curvature="0"
     inkscape:path-effect="#path-effect4923-0"
     inkscape:original-d="M 8671.7963,1838.7733 12511.796,478.77349"
     transform="rotate(-90,6372.5866,6208.8287)" />
  <ellipse
     style="opacity:1;fill:none;fill-opacity:1;fill-rule:nonzero;stroke:none;stroke-width:113.38582611;stroke-linecap:butt;stroke-linejoin:miter;stroke-miterlimit:4;stroke-dasharray:none;stroke-dashoffset:90.65753174;stroke-opacity:1;paint-order:stroke fill markers"
     id="path5106"
     cx="-12142.5"
     cy="1599.9999"
     rx="79.999992"
     ry="1599.9999"
     transform="rotate(-90)" />
  <ellipse
     style="opacity:1;fill:none;fill-opacity:1;fill-rule:nonzero;stroke:none;stroke-width:113.38582611;stroke-linecap:butt;stroke-linejoin:miter;stroke-miterlimit:4;stroke-dasharray:none;stroke-dashoffset:90.65753174;stroke-opacity:1;paint-order:stroke fill markers"
     id="path5108"
     cx="-12102.5"
     cy="3119.9998"
     rx="39.999996"
     ry="79.999992"
     transform="rotate(-90)" />
  <path
     style="opacity:1;fill:none;fill-opacity:0.98820759;fill-rule:nonzero;stroke:#4d4d4d;stroke-width:9.44881916;stroke-linecap:butt;stroke-linejoin:miter;stroke-miterlimit:4;stroke-dasharray:none;stroke-dashoffset:90.65753174;stroke-opacity:1;paint-order:markers fill stroke"
     id="path6678"
     sodipodi:type="arc"
     sodipodi:cx="-12062.5"
     sodipodi:cy="3199.9998"
     sodipodi:rx="9.999999"
     sodipodi:ry="9.999999"
     sodipodi:start="0"
     sodipodi:end="6.2817367"
     sodipodi:open="true"
     d="m -12052.5,3199.9998 a 9.999999,9.999999 0 0 1 -9.996,10 9.999999,9.999999 0 0 1 -10.004,-9.9928 9.999999,9.999999 0 0 1 9.989,-10.0072 9.999999,9.999999 0 0 1 10.011,9.9855"
     transform="rotate(-90)" />
  <path
     style="opacity:1;fill:none;fill-opacity:1;fill-rule:nonzero;stroke:none;stroke-width:113.38582611;stroke-linecap:butt;stroke-linejoin:miter;stroke-miterlimit:4;stroke-dasharray:none;stroke-dashoffset:90.65753174;stroke-opacity:1;paint-order:stroke fill markers"
     d="M 4189.866,5962.1498 C 3792.2179,5970.8674 2997.8686,5978 2424.6451,5978 H 1382.4205 l 15.6309,-185.7654 c 54.0808,-642.7204 373.6307,-1270.9694 815.3518,-1603.0172 310.2402,-233.2118 585.9635,-328.0547 949.6692,-326.6659 837.5629,3.1983 1560.0686,750.8101 1714.2742,1773.8431 19.3781,128.5579 35.2964,250.8784 35.374,271.8234 0.1199,33.6084 -84.7873,39.9436 -722.8546,53.9318 z"
     id="path5137"
     inkscape:connector-curvature="0" />
  <path
     inkscape:connector-curvature="0"
     style="opacity:1;fill:#ffc951;fill-opacity:0.98823529;fill-rule:nonzero;stroke:#000000;stroke-width:75.59055328;stroke-linecap:butt;stroke-linejoin:miter;stroke-miterlimit:4;stroke-dasharray:none;stroke-dashoffset:90.65753174;stroke-opacity:1;paint-order:markers stroke fill"
     d="m 619.45453,89.6593 c -0.5914,46.738 1311.81397,3783.3901 1338.23247,3809.8087 6.232,6.232 27.9287,4.9603 48.2148,-2.8242 31.3536,-12.0315 23.1035,-52.9055 -55.0293,-272.6191 C 1900.3198,3481.8679 1596.495,2623.9933 1275.7065,1717.6383 918.49515,708.3743 680.66439,69.7203 662.03266,69.7203 c -16.73195,0 -35.86133,8.8 -42.50977,19.558 -0.0429,0.07 -0.066,0.198 -0.0684,0.381 z m 1258.65627,34.969 c -3.6098,3.609 776.1917,3501.4483 790.1758,3544.3729 2.3411,7.1862 16.9315,6.3309 54.834,-3.2168 40.4079,-10.1788 50.7562,-15.996 47.5703,-26.7402 -4.0415,-13.6292 -781.6642,-3476.6199 -790.1524,-3518.7889 l -4.4297,-22.006 -46.6543,10.844 c -25.6601,5.965 -48.7645,12.955 -51.3437,15.535 z"
     id="path4883" />
  <path
     style="opacity:1;fill:#ffc951;fill-opacity:0.98823529;fill-rule:nonzero;stroke:#000000;stroke-width:75.59055328;stroke-linecap:round;stroke-linejoin:miter;stroke-miterlimit:4;stroke-dasharray:none;stroke-dashoffset:90.65753174;stroke-opacity:1;paint-order:stroke fill markers"
     d="m 4129.5267,1904.9733 c -218.4106,969.4912 -397.2161,1763.321 -397.3454,1764.0658 -0.4653,2.6792 -94.3247,-20.585 -98.0401,-24.3004 -4.4576,-4.4576 788.0585,-3538.7764 795.093,-3545.8104 2.6167,-2.617 26.0346,-0.341 52.0398,5.058 35.49,7.367 47.0429,13.364 46.3227,24.045 -0.5278,7.826 -179.6593,807.45 -398.07,1776.942 z"
     id="path4888"
     inkscape:connector-curvature="0" />
  <path
     style="opacity:1;fill:#ffc951;fill-opacity:0.98823529;fill-rule:nonzero;stroke:#000000;stroke-width:75.59055328;stroke-linecap:round;stroke-linejoin:miter;stroke-miterlimit:2;stroke-dasharray:none;stroke-dashoffset:90.65753174;stroke-opacity:1;paint-order:stroke fill markers"
     d="M 5159.6873,1917.6853 C 4803.6039,2922.134 4498.4772,3782.6968 4481.6279,3830.0465 l -30.6352,86.0905 -49.8287,-16.8274 -49.8288,-16.8275 37.8424,-107.3986 c 20.8132,-59.0693 326.2472,-921.803 678.7421,-1917.1862 l 640.8998,-1809.787 49.6989,17.41 c 27.3344,9.576 49.4502,19.32 49.1461,21.652 -0.3041,2.333 -291.8938,826.063 -647.9772,1830.513 z"
     id="path4890"
     inkscape:connector-curvature="0" />
</svg>
