<?xml version="1.0" encoding="UTF-8" standalone="no"?>
<!-- DOCTYPE svg PUBLIC "-//W3C//DTD SVG 1.1//EN" "http://www.w3.org/Graphics/SVG/1.1/DTD/svg11.dtd" -->

<svg
   viewBox="0 0 529.13383 529.13383"
   preserveAspectRatio="xMidYMid"
   zoomAndPan="magnify"
   version="1.1"
   id="svg889"
   sodipodi:docname="ambi-exr2.svg"
   inkscape:version="1.2.2 (732a01da63, 2022-12-09)"
   width="140mm"
   height="140mm"
   xmlns:inkscape="http://www.inkscape.org/namespaces/inkscape"
   xmlns:sodipodi="http://sodipodi.sourceforge.net/DTD/sodipodi-0.dtd"
   xmlns="http://www.w3.org/2000/svg"
   xmlns:svg="http://www.w3.org/2000/svg">
  <defs
     id="defs893" />
  <sodipodi:namedview
     id="namedview891"
     pagecolor="#ffffff"
     bordercolor="#666666"
     borderopacity="1.0"
     inkscape:showpageshadow="2"
     inkscape:pageopacity="0.0"
     inkscape:pagecheckerboard="0"
     inkscape:deskcolor="#d1d1d1"
     showgrid="false"
     inkscape:zoom="0.921875"
     inkscape:cx="32"
     inkscape:cy="127.45763"
     inkscape:window-width="1920"
     inkscape:window-height="1000"
     inkscape:window-x="-11"
     inkscape:window-y="-11"
     inkscape:window-maximized="1"
     inkscape:current-layer="svg889"
     inkscape:document-units="mm" />
  <circle
     cx="269.01694"
     cy="269.01694"
     r="256"
     fill="none"
     stroke="#c3c300"
     stroke-width="0.50"
     id="circle885"
     style="stroke-width:37.79527415;stroke-dasharray:none;stroke:#00ff00;stroke-opacity:1" />
  <circle
     cx="270.71494"
     cy="270.35397"
     r="100.9785"
     fill="none"
     stroke="#c3c300"
     stroke-width="0.50"
     id="circle887"
     style="stroke-width:37.79527415;stroke-dasharray:none;stroke:#00ff00;stroke-opacity:1" />
  <path
     style="fill:none;stroke:#00ff00;stroke-width:37.79527415;stroke-linecap:butt;stroke-linejoin:miter;stroke-opacity:1;stroke-dasharray:none"
     d="m 270.71494,169.37547 -1.698,-156.358532"
     id="path1171" />
  <path
     style="fill:none;stroke:#00ff00;stroke-width:37.79527415;stroke-linecap:butt;stroke-linejoin:miter;stroke-opacity:1;stroke-dasharray:none"
     d="m 371.69344,270.35397 153.3235,-1.33703"
     id="path1899" />
  <path
     style="fill:none;stroke:#00ff00;stroke-width:37.79527415;stroke-linecap:butt;stroke-linejoin:miter;stroke-opacity:1;stroke-dasharray:none"
     d="m 269.01694,525.01694 1.698,-153.68446"
     id="path2627" />
  <path
     style="fill:none;stroke:#00ff00;stroke-width:37.79527415;stroke-linecap:butt;stroke-linejoin:miter;stroke-opacity:1;stroke-dasharray:none"
     d="M 169.73643,270.35397 13.016938,269.01694"
     id="path3355" />
</svg>
