<?xml version="1.0" encoding="UTF-8" standalone="no"?>
<!-- Created with Inkscape (http://www.inkscape.org/) -->

<svg
   width="170cm"
   height="45cm"
   version="1.1"
   viewBox="0 0 1700 450"
   id="svg20"
   sodipodi:docname="sde=boitier_differentiel.svg"
   inkscape:version="1.2.2 (732a01da63, 2022-12-09)"
   xmlns:inkscape="http://www.inkscape.org/namespaces/inkscape"
   xmlns:sodipodi="http://sodipodi.sourceforge.net/DTD/sodipodi-0.dtd"
   xmlns="http://www.w3.org/2000/svg"
   xmlns:svg="http://www.w3.org/2000/svg"
   xmlns:rdf="http://www.w3.org/1999/02/22-rdf-syntax-ns#"
   xmlns:cc="http://creativecommons.org/ns#"
   xmlns:dc="http://purl.org/dc/elements/1.1/">
  <defs
     id="defs24">
    <linearGradient
       id="linearGradient4780"
       inkscape:swatch="solid">
      <stop
         style="stop-color:#000000;stop-opacity:1"
         offset="0"
         id="stop4778" />
    </linearGradient>
  </defs>
  <sodipodi:namedview
     pagecolor="#ffffff"
     bordercolor="#666666"
     borderopacity="1"
     objecttolerance="10"
     gridtolerance="10"
     guidetolerance="10"
     inkscape:pageopacity="0"
     inkscape:pageshadow="2"
     inkscape:window-width="2048"
     inkscape:window-height="1072"
     id="namedview22"
     showgrid="true"
     units="cm"
     inkscape:document-units="cm"
     inkscape:zoom="0.1766117"
     inkscape:cx="3088.6968"
     inkscape:cy="2151.6128"
     inkscape:window-x="-11"
     inkscape:window-y="-11"
     inkscape:window-maximized="1"
     inkscape:current-layer="svg20"
     inkscape:snap-grids="false"
     inkscape:snap-bbox="true"
     inkscape:bbox-paths="true"
     inkscape:bbox-nodes="true"
     inkscape:snap-bbox-edge-midpoints="true"
     inkscape:snap-bbox-midpoints="true"
     inkscape:object-paths="true"
     inkscape:snap-intersection-paths="true"
     inkscape:snap-smooth-nodes="true"
     inkscape:snap-midpoints="true"
     inkscape:snap-object-midpoints="true"
     inkscape:snap-center="true"
     inkscape:snap-page="true"
     showguides="false"
     inkscape:showpageshadow="2"
     inkscape:pagecheckerboard="0"
     inkscape:deskcolor="#d1d1d1">
    <inkscape:grid
       type="xygrid"
       id="grid4766"
       originx="0"
       originy="0" />
  </sodipodi:namedview>
  <metadata
     id="metadata2">
    <rdf:RDF>
      <cc:Work
         rdf:about="">
        <dc:format>image/svg+xml</dc:format>
        <dc:type
           rdf:resource="http://purl.org/dc/dcmitype/StillImage" />
        <cc:license
           rdf:resource="http://creativecommons.org/licenses/by-nc-sa/4.0/" />
        <dc:creator>
          <cc:Agent>
            <dc:title>jma</dc:title>
          </cc:Agent>
        </dc:creator>
        <dc:publisher>
          <cc:Agent>
            <dc:title>Azimut</dc:title>
          </cc:Agent>
        </dc:publisher>
        <dc:rights>
          <cc:Agent>
            <dc:title>(c)Azimut</dc:title>
          </cc:Agent>
        </dc:rights>
      </cc:Work>
      <cc:License
         rdf:about="http://creativecommons.org/licenses/by-nc-sa/4.0/">
        <cc:permits
           rdf:resource="http://creativecommons.org/ns#Reproduction" />
        <cc:permits
           rdf:resource="http://creativecommons.org/ns#Distribution" />
        <cc:requires
           rdf:resource="http://creativecommons.org/ns#Notice" />
        <cc:requires
           rdf:resource="http://creativecommons.org/ns#Attribution" />
        <cc:prohibits
           rdf:resource="http://creativecommons.org/ns#CommercialUse" />
        <cc:permits
           rdf:resource="http://creativecommons.org/ns#DerivativeWorks" />
        <cc:requires
           rdf:resource="http://creativecommons.org/ns#ShareAlike" />
      </cc:License>
    </rdf:RDF>
  </metadata>
  <g
     id="g830"
     transform="matrix(0,1.0036055,-0.99529076,0,1740.3996,-141.62061)"
     style="stroke:#000000;stroke-width:50.2151;stroke-dasharray:none;stroke-opacity:1">
    <path
       style="fill:none;fill-opacity:1;stroke:#000000;stroke-width:50.2151;stroke-miterlimit:4;stroke-dasharray:none;stroke-opacity:1"
       inkscape:connector-curvature="0"
       id="path6"
       d="M 406.66241,1743.7176 V 928.67937 L 300.89125,504.18029" />
    <path
       style="fill:none;fill-opacity:1;stroke:#000000;stroke-width:50.2151;stroke-miterlimit:4;stroke-dasharray:none;stroke-opacity:1"
       inkscape:connector-curvature="0"
       id="path8"
       d="M 406.66241,504.18029 V 45.72129" />
    <path
       d="m 408.17343,1200.3588 a 158.65673,84.899815 0 0 1 -138.25802,-42.1103 158.65673,84.899815 0 0 1 -0.17603,-85.2394 158.65673,84.899815 0 0 1 138.25801,-42.2802"
       id="path12"
       inkscape:connector-curvature="0"
       style="fill:none;fill-opacity:1;stroke:#000000;stroke-width:50.2151;stroke-miterlimit:4;stroke-dasharray:none;stroke-opacity:1" />
    <path
       d="m 406.66241,1200.3588 a 158.65673,84.899815 0 0 0 138.25801,-42.1103 158.65673,84.899815 0 0 0 0.17604,-85.2394 158.65673,84.899815 0 0 0 -138.25802,-42.2802"
       id="path14"
       inkscape:connector-curvature="0"
       style="fill:none;fill-opacity:1;stroke:#000000;stroke-width:50.2151;stroke-miterlimit:4;stroke-dasharray:none;stroke-opacity:1" />
    <path
       d="M 248.00568,1115.459 H 164.89977 V 656.99996 h 173.7669"
       id="path16"
       inkscape:connector-curvature="0"
       style="fill:none;fill-opacity:1;stroke:#000000;stroke-width:50.2151;stroke-miterlimit:4;stroke-dasharray:none;stroke-opacity:1" />
  </g>
  <g
     id="g830-2"
     transform="matrix(0,0.99614386,-0.99529076,0,1740.6821,-139.54776)"
     style="display:inline">
    <path
       style="fill:none;fill-opacity:1;stroke:#f49d00;stroke-width:20;stroke-miterlimit:4;stroke-dasharray:none;stroke-opacity:1"
       inkscape:connector-curvature="0"
       id="path6-9"
       d="M 406.66241,1743.7176 V 928.67937 L 300.89125,504.18029" />
    <path
       style="fill:none;fill-opacity:1;stroke:#f49d00;stroke-width:20;stroke-miterlimit:4;stroke-dasharray:none;stroke-opacity:1"
       inkscape:connector-curvature="0"
       id="path8-3"
       d="M 406.66241,504.18029 V 45.72129" />
    <path
       d="m 408.17343,1200.3588 a 158.65673,84.899815 0 0 1 -138.25802,-42.1103 158.65673,84.899815 0 0 1 -0.17603,-85.2394 158.65673,84.899815 0 0 1 138.25801,-42.2802"
       id="path12-6"
       inkscape:connector-curvature="0"
       style="fill:none;fill-opacity:1;stroke:#f49d00;stroke-width:20;stroke-miterlimit:4;stroke-dasharray:none;stroke-opacity:1" />
    <path
       d="m 406.66241,1200.3588 a 158.65673,84.899815 0 0 0 138.25801,-42.1103 158.65673,84.899815 0 0 0 0.17604,-85.2394 158.65673,84.899815 0 0 0 -138.25802,-42.2802"
       id="path14-0"
       inkscape:connector-curvature="0"
       style="fill:none;fill-opacity:1;stroke:#f49d00;stroke-width:20;stroke-miterlimit:4;stroke-dasharray:none;stroke-opacity:1" />
    <path
       d="M 248.00568,1115.459 H 164.89977 V 656.99996 h 173.7669"
       id="path16-8"
       inkscape:connector-curvature="0"
       style="fill:none;fill-opacity:1;stroke:#f49d00;stroke-width:20;stroke-miterlimit:4;stroke-dasharray:none;stroke-opacity:1" />
  </g>
</svg>
