<?xml version="1.0" encoding="UTF-8" standalone="no"?>
<!-- DOCTYPE svg PUBLIC "-//W3C//DTD SVG 1.1//EN" "http://www.w3.org/Graphics/SVG/1.1/DTD/svg11.dtd" -->

<svg
   viewBox="0 0 529.13383 529.13383"
   preserveAspectRatio="xMidYMid"
   zoomAndPan="magnify"
   version="1.1"
   id="svg889"
   sodipodi:docname="fonc-ap1.svg"
   inkscape:version="1.2.2 (732a01da63, 2022-12-09)"
   width="140mm"
   height="140mm"
   xmlns:inkscape="http://www.inkscape.org/namespaces/inkscape"
   xmlns:sodipodi="http://sodipodi.sourceforge.net/DTD/sodipodi-0.dtd"
   xmlns="http://www.w3.org/2000/svg"
   xmlns:svg="http://www.w3.org/2000/svg">
  <defs
     id="defs893" />
  <sodipodi:namedview
     id="namedview891"
     pagecolor="#ffffff"
     bordercolor="#666666"
     borderopacity="1.0"
     inkscape:showpageshadow="2"
     inkscape:pageopacity="0.0"
     inkscape:pagecheckerboard="0"
     inkscape:deskcolor="#d1d1d1"
     showgrid="false"
     inkscape:zoom="0.921875"
     inkscape:cx="32"
     inkscape:cy="137.76271"
     inkscape:window-width="1920"
     inkscape:window-height="1000"
     inkscape:window-x="-11"
     inkscape:window-y="-11"
     inkscape:window-maximized="1"
     inkscape:current-layer="svg889"
     inkscape:document-units="mm" />
  <circle
     cx="269.01694"
     cy="269.01694"
     r="256"
     fill="none"
     stroke="#c3c300"
     stroke-width="0.50"
     id="circle885"
     style="stroke-width:37.79527415;stroke-dasharray:none;stroke:#ffc000;stroke-opacity:1" />
  <path
     style="fill:none;stroke:#ffc000;stroke-width:37.7953;stroke-linecap:butt;stroke-linejoin:miter;stroke-dasharray:none;stroke-opacity:1"
     d="M 87.864404,444.52367 453.20164,85.694912"
     id="path7794"
     sodipodi:nodetypes="cc" />
</svg>
