-------------------------------------------------------------------------------
Test set: com.spring.useraccount.demo.controller.UserControllerTest
-------------------------------------------------------------------------------
Tests run: 2, Failures: 0, Errors: 0, Skipped: 0, Time elapsed: 25.589 s - in com.spring.useraccount.demo.controller.UserControllerTest
