Name,Equipment,Sex,BirthDate,Age,Division,BodyweightKg,WeightClassKg,Squat1Kg,Squat2Kg,Squat3Kg,Best3SquatKg,Squat4Kg,Bench1Kg,Bench2Kg,Bench3Kg,Best3BenchKg,Bench4Kg,Deadlift1Kg,Deadlift2Kg,Deadlift3Kg,Best3DeadliftKg,Deadlift4Kg,TotalKg,Event,Place
Camila Chioca,Wraps,F,2000-05-05,22,Jun,43.8,44,65,75.5,77.5,77.5,80,27.5,33,-35,33,,80.5,87.5,95,95,100,205.5,SBD,1
Gabriela Milenao,Wraps,F,1991-11-21,30,Open,43.85,44,90,95,-100,95,,40,42.5,44,44,-46,107.5,110,116,116,,255,SBD,1
Valentina Marchesotti,Wraps,F,2003-03-03,19,Tn 18-19,54.25,56,-95,95,100.5,100.5,,37.5,42.5,-45,42.5,,100,105,110,110,-115.5,253,SBD,1
Agustina Lulich,Wraps,F,1997-05-06,25,Open,51.65,52,130,-145,150,150,,60,-65,65,65,,135,147.5,-152.5,147.5,,362.5,SBD,2
Maria Luz Martinez Puchi,Wraps,F,1992-08-24,29,Open,46.95,48,95,-100,100,100,,37.5,-40,40,40,,95,100,-105,100,,240,SBD,1
Yasmin Fierro,Wraps,F,1997-11-11,24,Open,50.6,52,102.5,110,117.5,117.5,,-65,65,72.5,72.5,,110,117.5,125,125,,315,SBD,3
Carolina González De León,Wraps,F,1985-05-08,37,Open,51.7,52,165,172,177.5,177.5,,75,77.5,-81,77.5,,150,160,-170,160,,415,SBD,1
Maria Costoyas,Wraps,F,1981-07-14,41,M 40-44,51.3,52,117.5,127.5,-135,127.5,,55,62.5,-70,62.5,,117.5,125,-137.5,125,,315,SBD,1
Lorena Qintoman,Wraps,F,2000-01-24,22,Jun,56.85,60,110,-115,117.5,117.5,,57.5,60,-65,60,,122.5,127.5,132.5,132.5,,310,SBD,1
Mónica Schapsis,Wraps,F,1964-07-07,58,M 55-59,54.2,56,65,70,-80,70,,40,45,47.5,47.5,-50,95,105,110,110,,227.5,SBD,1
Lourdes Britez,Wraps,F,2004-06-19,18,Tn 18-19,59.95,60,105,-115,120,120,,50,-55,-57.5,50,,125,135,142.5,142.5,,312.5,SBD,1
Solange A. Viñas,Wraps,F,1993-02-22,29,Open,56.35,60,120,130,-137.5,130,,60,65,70,70,,110,122.5,135,135,,335,SBD,3
Jazmin Faivisovich,Wraps,F,1993-11-19,28,Open,54.55,56,90,97.5,105,105,,42.5,47.5,-50,47.5,,105,115,-122.5,115,,267.5,SBD,5
Romina Hernandez,Wraps,F,1986-12-17,35,Open,54.3,56,112.5,122.5,-130,122.5,,52.5,-57.5,-57.5,52.5,,120,130,140,140,,315,SBD,3
Romina Daniela Coñuel,Wraps,F,1995-05-28,27,Open,57.55,60,120,-125,125,125,,55,60,-62.5,60,,125,135,140,140,,325,SBD,5
Sabrina Romero,Wraps,F,1990-04-24,32,Open,52.05,56,90,95,102.5,102.5,,50,55,-57.5,55,,132.5,-140,140,140,,297.5,SBD,4
Mariana Miguez,Wraps,F,1983-08-29,38,Open,55.55,56,130,-137.5,140,140,,65,-70,70,70,,140,150,-155,150,,360,SBD,2
Daiana M J Aviles,Wraps,F,1995-05-08,27,Open,52.4,56,82.5,85,-87.5,85,,50,52.5,55,55,,105,107.5,-110,107.5,,247.5,SBD,6
Ivana C Abrigo,Wraps,F,1988-11-28,33,Open,58.15,60,105,115,-120,115,,42.5,47.5,-52.5,47.5,,115,127.5,-137.5,127.5,,290,SBD,6
Eliana Ocampo,Wraps,F,1986-10-13,35,Open,56,56,155,-165,165,165,,77.5,82.5,-85,82.5,,152.5,160,165,165,,412.5,SBD,1
Solana Chasampi,Wraps,F,1998-02-28,24,Open,59.7,60,150,160,170,170,,72.5,77.5,80,80,,180,195,201,201,,451,SBD,1
Lucia Presentado,Wraps,F,1994-06-28,28,Open,59.15,60,120,-127.5,-127.5,120,,65,-70,-70,65,,140,150,-155,150,,335,SBD,4
Adriana Arce,Wraps,F,1995-02-05,27,Open,60,60,155,162.5,167.5,167.5,,75,80,-87.5,80,,-145,145,-160,145,,392.5,SBD,2
Sheila Sepulveda,Wraps,F,2000-03-20,22,Jun,62.2,67.5,-95,95,100,100,,57.5,-60,60,60,,120,125,130,130,,290,SBD,1
Millie Adriana Beynon,Wraps,F,2003-04-23,19,Tn 18-19,63.65,67.5,-120,120,125,125,,65,70,71,71,72.5,145,152.5,160,160,-162.5,356,SBD,1
Dayra Drake,Wraps,F,2003-06-18,19,Tn 18-19,67.8,75,110,120,-130,120,,55,-60,60,60,-60.5,110,120,127.5,127.5,,307.5,SBD,1
Julieta E Rojas,Wraps,F,1998-12-12,23,Jun,65.55,67.5,105,115,120,120,,50,-55,-57.5,50,,105,115,-120,115,,285,SBD,2
Micaela Petrigliano,Wraps,F,1993-11-30,28,Open,66.95,67.5,142.5,155,167.5,167.5,,75,82.5,90,90,,155,-165,177.5,177.5,,435,SBD,2
Gabriela V. Andino,Wraps,F,1988-04-12,34,Open,64.35,67.5,115,120,127.5,127.5,,55,60,62.5,62.5,,-125,130,137.5,137.5,,327.5,SBD,4
Ana Castro,Wraps,F,1994-01-20,28,Open,65.95,67.5,-145,152.5,-162.5,152.5,,80,85,-87.5,85,,142.5,155,162.5,162.5,,400,SBD,3
Victoria Gomez,Wraps,F,1997-08-05,25,Open,63.2,67.5,-122.5,122.5,-137.5,122.5,,47.5,52.5,-57.5,52.5,,125,-132.5,-132.5,125,,300,SBD,5
Andrea Sequeira,Wraps,F,1980-08-29,41,M 40-44,65.15,67.5,162.5,172.5,177.5,177.5,,-67.5,72.5,-80.5,72.5,,165,175.5,185,185,,435,SBD,1
Andrea Sequeira,Wraps,F,1980-08-29,41,Open,65.15,67.5,162.5,172.5,177.5,177.5,,-67.5,72.5,-80.5,72.5,,165,175.5,185,185,,435,SBD,1
Micaela Salvi,Wraps,F,1981-01-15,41,M 40-44,64.85,67.5,120,-130,130,130,,55,60,65,65,,125,130,-135,130,,325,SBD,3
Marta Vega,Wraps,F,1981-07-09,41,M 40-44,65.65,67.5,-160,162.5,-172.5,162.5,,75,80,82.5,82.5,-85,145,150,155,155,,400,SBD,2
Yamila Caceres Matiauda,Wraps,F,1992-12-04,29,Open,68,75,145,150,-160,150,,60,65,70,70,,150,160,170,170,,390,SBD,2
Florencia Branca,Wraps,F,1999-02-08,23,Jun,74.6,75,125,-137.5,137.5,137.5,,60,65,-70,65,,125,137.5,150,150,,352.5,SBD,1
Sofía Sangronis,Wraps,F,1999-02-09,23,Jun,73.55,75,125,-135,-135,125,,57.5,60,-62.5,60,,140,150,-160,150,,335,SBD,2
Ornela Toledo,Wraps,F,1986-08-24,35,Open,79.15,82.5,135,145,152.5,152.5,,40,-50,50,50,,130,140,150,150,,352.5,SBD,2
Paula Candela Firpo,Wraps,F,1996-04-11,26,Open,74.75,75,-185,190,-197.5,190,,70,75,77.5,77.5,,180,187.5,,187.5,,455,SBD,1
Maria Laura Moreno,Wraps,F,1976-01-24,46,M 45-49,81.85,82.5,80,90,95,95,100,50,52.5,-55,52.5,,115,125,135,135,140,282.5,SBD,1
Aixa Tebaldi,Wraps,F,1993-09-28,28,Open,80.05,82.5,200,210,-220,210,,95,101,105,105,-107.5,200,210,220,220,,535,SBD,1
Vanessa Leones,Wraps,F,1979-04-24,43,M 40-44,90.5,90+,180,190,200,200,,85,92.5,100,100,,170,190,200,200,,500,SBD,1
Paula Stancati,Wraps,F,1998-09-29,23,Jun,83.25,90,-170,-170,-170,,,-72.5,,,,,,,,,,,SBD,DQ
Maria Fernanda Godoy Cruz,Wraps,F,1979-12-11,42,M 40-44,89.3,90,190,-205,-205,190,,70,80,85.5,85.5,,150,170,-180.5,170,,445.5,SBD,1
Ezequiel Moschen,Wraps,M,2008-03-04,14,Tn 13-15,54.6,56,55,60,-65,60,,35,40,42.5,42.5,,60,67.5,72.5,72.5,,175,SBD,1
Joaquin Perez Barroso,Wraps,M,2006-06-17,16,Tn 16-17,55,56,105,115,125,125,-132.5,55,60,65,65,-67.5,120,130,140,140,-145,330,SBD,1
Eduardo Cardoso Silva,Wraps,M,2003-04-03,19,Tn 18-19,63.8,67.5,130,145,160,160,,90,97.5,-102.5,97.5,,140,155,-180,155,,412.5,SBD,2
Ernesto Llul,Wraps,M,2003-11-04,18,Tn 18-19,66.5,67.5,160,-172.5,-180,160,,92.5,100,,100,,175,187.5,-200,187.5,,447.5,SBD,1
Ramiro Beltrame,Wraps,M,1998-12-24,23,Jun,66.95,67.5,185,195,205,205,,95,100,105,105,,225,-232.5,,225,,535,SBD,1
Tomás Aguirre,Wraps,M,2000-09-28,21,Jun,64.6,67.5,160,-170,175,175,,100,105,-110,105,,200,210,-215,210,,490,SBD,3
Bruno A Dalonze,Wraps,M,2001-05-02,21,Jun,64.7,67.5,-185,192.5,205,205,,102.5,105,-107.5,105,,195,-205,,195,,505,SBD,2
Ulises Casco,Wraps,M,1998-01-22,24,Open,66.35,67.5,-170,170,-195,170,,110,117.5,122.5,122.5,,175,187.5,-195,187.5,,480,SBD,2
Carlos Martinez,Wraps,M,1992-05-11,30,Open,66.75,67.5,170,180,-190,180,,95,100,105,105,,190,200,210,210,,495,SBD,1
Jose Mata,Wraps,M,1941-04-29,81,M 80-84,62.35,67.5,110,125,-140,125,,60,-65,,60,,130,145,160,160,,345,SBD,1
Tobias Caltabiano,Wraps,M,2005-07-11,17,Tn 16-17,71.9,75,192.5,200,-210.5,200,,90,95,-100.5,95,,200,210,220,220,233,515,SBD,1
Lautaro Luque Zec,Wraps,M,2003-06-16,19,Tn 18-19,75,75,140,155,-180,155,,80,-87.5,92.5,92.5,,170,185,-190,185,,432.5,SBD,1
Sergio Goldschmidt,Wraps,M,2005-07-07,17,Tn 16-17,73.5,75,150,160,-167.5,160,,80,85,87.5,87.5,,145,157.5,-167.5,157.5,,405,SBD,3
Matías Gonzalez,Wraps,M,1995-12-20,26,Open,71.2,75,215,225,230,230,,130,137.5,-140,137.5,,-220,220,-227.5,220,,587.5,SBD,4
Manuel Lazcano,Wraps,M,1999-06-21,23,Jun,73.8,75,160,170,177.5,177.5,,-80,80,87.5,87.5,,175,-187.5,-187.5,175,,440,SBD,2
Ignacio Bogado Manera,Wraps,M,2000-08-24,21,Jun,72.6,75,157.5,165,-170,165,,90,95,100,100,,180,195,205,205,,470,SBD,1
Luciano Escolano,Wraps,M,1997-01-22,25,Open,72.85,75,235,245,-255,245,,135,140,-142.5,140,,240,-252.5,-255.5,240,,625,SBD,1
Mario Elias Castillo,Wraps,M,1994-04-08,28,Open,72.5,75,165,170,180,180,,-125,-125,-125,,,210,,,210,,,SBD,DQ
Santiago Caio,Wraps,M,1997-03-31,25,Open,70.25,75,230,242.5,-255,242.5,,110,120,-125,120,,230,-242.5,-242.5,230,,592.5,SBD,3
Matias Villalba,Wraps,M,1983-10-27,38,Open,74.1,75,185,192.5,-200,192.5,,95,-100,100,100,,195,-202.5,-202.5,195,,487.5,SBD,6
Hernan Helmholt,Wraps,M,1994-11-11,27,Open,72.8,75,180,190,200,200,,107.5,115,-122.5,115,,235,245,-250,245,,560,SBD,5
Enzo Escobar,Wraps,M,1997-10-09,24,Open,71.8,75,150,,,150,,102.5,110,-115,110,,170,,,170,,430,SBD,8
Rodrigo Benitez,Wraps,M,1992-04-23,30,Open,73.65,75,170,-190,200,200,,90,97.5,-102.5,97.5,,175,-192.5,-195,175,,472.5,SBD,7
Leonardo Moreno,Wraps,M,1988-07-31,34,Open,73.65,75,230,-247.5,252.5,252.5,,130,140,-147.5,140,,210,220,230,230,,622.5,SBD,2
Francisco Milesi,Wraps,M,2005-10-27,16,Tn 16-17,73.5,75,-140,147.5,-155,147.5,,87.5,-92.5,-97.5,87.5,,162.5,172.5,180,180,,415,SBD,2
Juan F. Frede,Wraps,M,2004-04-21,18,Tn 18-19,80.3,82.5,190,215,225,225,,100,105,107.5,107.5,,-220,220,240,240,,572.5,SBD,1
Lautaro Lambertucci,Wraps,M,2005-03-08,17,Tn 16-17,80.05,82.5,175,185,195,195,,100,105,-110,105,,200,222.5,-227.5,222.5,,522.5,SBD,1
Alejandro Gusmerotti,Wraps,M,1999-08-23,22,Jun,82,82.5,200,210,-215,210,,110,115,-120,115,,250,265,,265,,590,SBD,2
Agustin Liborio,Wraps,M,1999-03-03,23,Jun,81.75,82.5,-140,150,-160,150,,100,110,-115,110,,185,200,210,210,,470,SBD,5
Luca Lantella,Wraps,M,2001-05-02,21,Jun,78.85,82.5,275,290,300,300,,127.5,132.5,137.5,137.5,,200,210,215,215,,652.5,SBD,1
Julian Bueno,Wraps,M,1999-07-11,23,Jun,78.7,82.5,175,185,-190,185,,110,115,-122.5,115,,190,200,-205,200,,500,SBD,3
Iñaki Rey,Wraps,M,1989-07-24,33,Open,80.9,82.5,180,195,210,210,,120,130,-135,130,,220,230,240,240,,580,SBD,4
Leonel Crespo,Wraps,M,1989-03-22,33,Open,80.55,82.5,185,-190,-195,185,,-105,-105,-105,,,205,,,205,,,SBD,DQ
Leandro Fainburg,Wraps,M,1987-06-03,35,Open,75.6,82.5,190,210,217.5,217.5,,155,165,-175.5,165,,227.5,242.5,-250,242.5,,625,SBD,2
Lautarto Allassia,Wraps,M,1997-09-16,24,Open,80.5,82.5,-232.5,232.5,240,240,,115,122.5,125,125,,242.5,252.5,260,260,,625,SBD,3
Julio Travaglia,Wraps,M,1980-09-21,41,M 40-44,80.4,82.5,210,225,240,240,,-130,135,145.5,145.5,-150,220,230,240,240,,625.5,SBD,1
Gabriel Porfiri,Wraps,M,1968-08-10,54,M 50-54,80.7,82.5,160,175,-190,175,,110,120,-130,120,,190,202.5,-207.5,202.5,,497.5,SBD,1
Nicolas E Santos,Wraps,M,2001-11-16,20,Jun,75.2,82.5,180,190,-200,190,,90,-95,,90,,190,200,210,210,,490,SBD,4
Facundo Orfo,Wraps,M,1987-07-01,35,Open,81.75,82.5,240,252.5,-260,252.5,,130,142.5,-147.5,142.5,,225,237.5,250,250,,645,SBD,1
Joaquin de Vita,Wraps,M,2004-05-27,18,Tn 18-19,89.3,90,160,170,180,180,,90,95,100,100,,175,187.5,-200,187.5,,467.5,SBD,2
Ramiro Marengo,Wraps,M,2007-03-28,15,Tn 13-15,85.5,90,160,172.5,177.5,177.5,183,80,87.5,90,90,,150,165,170.5,170.5,,438,SBD,1
Tomás Sertic,Wraps,M,2002-09-23,19,Tn 18-19,89.8,90,170,-180,180,180,,95,-105,-105,95,,200,205,-210,205,,480,SBD,1
Agustin Ercolano,Wraps,M,2001-05-28,21,Jun,90,90,-202.5,212.5,-220,212.5,,105,112.5,-117.5,112.5,,200,212.5,222.5,222.5,,547.5,SBD,4
Francisco Sosa,Wraps,M,2000-07-19,22,Jun,87.4,90,-210,210,225,225,,120,130,140,140,,240,255,260,260,,625,SBD,1
Bruno Franco,Wraps,M,1999-11-01,22,Jun,84.9,90,205,215,-225,215,,125,137.5,142.5,142.5,,202.5,220,-230,220,,577.5,SBD,3
Alan Garofalo,Wraps,M,2000-05-26,22,Jun,89.6,90,200,215,225,225,,115,-130,130,130,,200,220,230,230,,585,SBD,2
Sergio Kimmel,Wraps,M,1979-01-02,43,M 40-44,88.85,90,230,250,-262.5,250,,120,130,-137.5,130,,230,250,-260.5,250,,630,SBD,1
Nicolas Mallo,Wraps,M,1972-11-27,49,M 45-49,89.4,90,225,235,-245,235,,107.5,117.5,125,125,,235,247.5,-255,247.5,,607.5,SBD,1
Juan Ales,Wraps,M,1957-03-09,65,M 65-69,87.2,90,170,180,190,190,,110,120,127.5,127.5,,170,180,200,200,,517.5,SBD,1
Juan Parga,Wraps,M,1969-06-24,53,M 50-54,87.4,90,-200,200,210,210,,120,125,130,130,135,190,201,210,210,215,550,SBD,1
Facundo Bruno,Wraps,M,1997-08-05,25,Open,88,90,265,280,290,290,,130,137.5,142.5,142.5,,-245,255,270,270,,702.5,SBD,1
Luciano Gonzalez,Wraps,M,1997-10-04,24,Open,87.75,90,205,217.5,225,225,,-112.5,117.5,125,125,,217.5,230,242.5,242.5,,592.5,SBD,7
Lucas Ortiz Nardinelli,Wraps,M,1996-11-19,25,Open,87.2,90,210,-237.5,237.5,237.5,,135,147.5,-157.5,147.5,,215,232.5,-242.5,232.5,,617.5,SBD,5
Ignacio Gonzalez Mottola,Wraps,M,1989-05-02,33,Open,87.8,90,150,155,162.5,162.5,,80,85,87.5,87.5,,185,195,200,200,,450,SBD,10
Maximo Ogasawara,Wraps,M,1983-11-17,38,Open,87.6,90,220,-232.5,-232.5,220,,140,150,-155,150,,220,235,242.5,242.5,,612.5,SBD,6
Leandro Zanette,Wraps,M,1989-10-24,32,Open,89.5,90,235,245,-250,245,,130,140,-142.5,140,,260,275,-280,275,,660,SBD,2
Federico G Galassi,Wraps,M,1986-10-03,35,Open,84.6,90,190,200,210,210,,110,115,120,120,,240,250,260,260,,590,SBD,8
Emanuel Cascallar,Wraps,M,1995-03-02,27,Open,86.9,90,230,240,250,250,,127.5,132.5,135,135,,230,240,-250,240,,625,SBD,4
Damian Dominicheli,Wraps,M,1987-02-13,35,Open,86.3,90,175,-182.5,182.5,182.5,,100,107.5,-115,107.5,,165,175,-180,175,,465,SBD,9
Mauricio Messara,Wraps,M,1990-12-08,31,Open,89.1,90,245,255,-262.5,255,,122.5,132.5,-142.5,132.5,,255,-265,265,265,,652.5,SBD,3
Federico Kloster,Wraps,M,2006-03-20,16,Tn 16-17,100,100,80,92.5,100,100,,60,72.5,77.5,77.5,,105,120,127.5,127.5,,305,SBD,2
Alan T Lopez Acosta,Wraps,M,2006-02-05,16,Tn 16-17,95,100,200,210,215,215,220.5,97.5,102.5,107.5,107.5,,200,210,220,220,,542.5,SBD,1
Alejandro Perez,Wraps,M,1971-08-16,50,M 50-54,92.7,100,190,200,210,210,,-100,100,,100,,-210,215,225,225,,535,SBD,2
Martin Casanova,Wraps,M,2001-07-17,21,Jun,98.7,100,-240,-240,240,240,,120,125,-127.5,125,,250,257.5,265,265,,630,SBD,1
Federico E. Rodriguez,Wraps,M,2000-04-09,22,Jun,98.9,100,170,180,190,190,,87.5,92.5,-97.5,92.5,,180,190,-200,190,,472.5,SBD,2
Nazareno Papaleo,Wraps,M,1982-12-01,39,Open,94.8,100,205,-217.5,217.5,217.5,,110,117.5,125,125,,190,205,217.5,217.5,,560,SBD,15
Mario Guanciarrosa,Wraps,M,,50,M 50-54,92.5,100,-180,180,200,200,,140,147.5,152.5,152.5,,190,205,215,215,,567.5,SBD,1
Guido Villella,Wraps,M,1990-02-26,32,Open,94.8,100,170,-177.5,-180,170,,-90,90,95,95,,190,197.5,205,205,,470,SBD,17
Ramiro Colonna,Wraps,M,1991-07-02,31,Open,98.2,100,-190,-200,200,200,,110,120,-127.5,120,,225,237.5,-250,237.5,,557.5,SBD,16
Jeremías Olmedo,Wraps,M,1995-12-01,26,Open,94.7,100,215,222.5,230,230,,125,130,-135,130,,240,247.5,-250,247.5,,607.5,SBD,11
Orlando Gavilan,Wraps,M,2003-04-02,19,Tn 18-19,96.3,100,200,212.5,-225,212.5,,125,132.5,-140,132.5,,230,-242.5,242.5,242.5,,587.5,SBD,1
Manuel Amelong,Wraps,M,1991-07-04,31,Open,96.8,100,215,230,245,245,,140,147.5,150,150,,245,260,275,275,,670,SBD,9
Joel Bustos,Wraps,M,1996-07-13,26,Open,98.9,100,245,260,,260,,130,-142.5,142.5,142.5,,260,275,285,285,,687.5,SBD,8
Leandro Baez,Wraps,M,1985-11-08,36,Open,98.9,100,-320,-320,320,320,-345,175,-185,185,185,,-230,230,-250,230,,735,SBD,3
Gonzalo Taraborrelli,Wraps,M,1992-02-19,30,Open,96.8,100,232.5,242.5,-250,242.5,,117.5,122.5,-127.5,122.5,,240,-245,-245,240,,605,SBD,12
Nicolas E. Echazarreta,Wraps,M,1983-12-23,38,Open,97.6,100,230,235,240,240,,127.5,-132.5,132.5,132.5,,240,247.5,,247.5,,620,SBD,10
Gustavo Gonzalez,Wraps,M,1993-03-02,29,Open,93,100,-215,220,230,230,,112.5,117.5,-122.5,117.5,,235,250,-265,250,,597.5,SBD,14
Carlos Jesus Oliva,Wraps,M,1996-02-02,26,Open,99.6,100,250,265,280,280,,135,140,145,145,,270,-290,-290,270,,695,SBD,7
Enrique Paz,Wraps,M,1995-10-21,26,Open,97.7,100,270,285,-292.5,285,,140,145,147.5,147.5,,265,280,-287.5,280,,712.5,SBD,5
Juan Pages,Wraps,M,1988-02-18,34,Open,99.7,100,280,292.5,300,300,,155,165,170,170,,260,280,-306,280,,750,SBD,2
Alejandro Lezcano,Wraps,M,1992-01-26,30,Open,98.6,100,-260,260,-280,260,,-152.5,160,165,165,,260,275,-282.5,275,,700,SBD,6
José María Acevedo,Wraps,M,1984-01-18,38,Open,97.3,100,245,257.5,-265,257.5,,160,170,177.5,177.5,,262.5,280,-300,280,,715,SBD,4
Hernan D. Concilo,Wraps,M,1981-06-29,41,M 40-44,99.2,100,210,230,-245,230,,125,130,135,135,,220,230,240,240,,605,SBD,1
Hernan D. Concilo,Wraps,M,1981-06-29,41,Open,99.2,100,210,230,-245,230,,125,130,135,135,,220,230,240,240,,605,SBD,13
Emiliano Barrionuevo,Wraps,M,1991-12-24,30,Open,96.5,100,270,285,,285,,182.5,-187.5,-187.5,182.5,,290,305.5,-310,305.5,,773,SBD,1
Thiago Erdocia,Wraps,M,2001-12-06,20,Jun,108.8,110,250,-265,-275,250,,155,165,180,180,,250,260,270,270,,700,SBD,2
Lautaro Antonuccio,Wraps,M,2002-02-05,20,Jun,108.8,110,290,305,-320,305,,155,162.5,167.5,167.5,,290,300,-310.5,300,,772.5,SBD,1
Lautaro Antonuccio,Wraps,M,2002-02-05,20,Open,108.8,110,290,305,-320,305,,155,162.5,167.5,167.5,,290,300,-310.5,300,,772.5,SBD,1
Oscar Reiñanco,Wraps,M,1987-09-14,34,Open,108.7,110,200,205,-210,205,,130,132.5,135,135,,250,260,270,270,,610,SBD,2
Martin Fraguas,Wraps,M,1981-09-15,40,M 40-44,106.5,110,-212.5,-212.5,212.5,212.5,,100,,,100,,200,,,200,,512.5,SBD,1
Alan Michel Beltrán,Wraps,M,1996-12-09,25,Open,107.3,110,180,195,207.5,207.5,,-127.5,132.5,-140,132.5,,200,210,220,220,,560,SBD,3
Gustavo Aguirre,Wraps,M,1989-02-04,33,Open,109.2,110,180,190,200,200,,112.5,115,120,120,,187.5,205,215,215,,535,SBD,4
Martin Galvan,Wraps,M,2000-10-18,21,Jun,122.8,125,290,-305,320,320,-335,132.5,142.5,152.5,152.5,,240,250,-260,250,,722.5,SBD,1
Luciano M Fuertes Silva,Wraps,M,1999-03-24,23,Jun,126.5,140,135,145,160,160,,-110,110,115,115,,140,150,160,160,,435,SBD,1
Emanuel Mansilla,Wraps,M,1995-05-30,27,Open,116.2,125,270,290,-300,290,,135,145,150,150,,230,250,-265,250,,690,SBD,2
Ivan Lencina,Wraps,M,1985-05-07,37,Open,129.8,140,-260,260,270,270,,140,145,152.5,152.5,,260,275,290,290,,712.5,SBD,3
Nestor Tejada,Wraps,M,1989-02-14,33,Open,121.6,125,-212.5,212.5,-222.5,212.5,,130,140,150,150,,205,215,-225,215,,577.5,SBD,5
Gonzalo Calarco,Wraps,M,1986-07-22,36,Open,122.2,125,235,250,270,270,,130,140,150,150,,245,255,270,270,,690,SBD,3
Mario Martinez,Wraps,M,1979-11-07,42,M 40-44,124.35,125,240,260,-280,260,,145,155,-162.5,155,,240,260,-275,260,,675,SBD,2
Mario Martinez,Wraps,M,1979-11-07,42,Open,124.35,125,240,260,-280,260,,145,155,-162.5,155,,240,260,-275,260,,675,SBD,4
Leonardo Cavaglia,Wraps,M,1976-01-12,46,M 45-49,123,125,300,320.5,-335,320.5,,180,190,200.5,200.5,,285,300,,300,,821,SBD,1
Leonardo Cavaglia,Wraps,M,1976-01-12,46,Open,123,125,300,320.5,-335,320.5,,180,190,200.5,200.5,,285,300,,300,,821,SBD,1
Santiago Marrero,Wraps,M,1984-05-05,38,Open,128.3,140,275,285,295,295,,-170,170,180,180,,240,-250,,240,,715,SBD,2
Adrian Lopez,Wraps,M,1986-08-07,36,Open,137.2,140,310,-317.5,,310,,172,177.5,180,180,,300,312.5,-323,312.5,,802.5,SBD,1
Eduardo Ramirez,Wraps,M,1970-01-17,52,M 50-54,131.8,140,210,230,240,240,250,150,162.5,170,170,-180,200,230,,230,,640,SBD,1
Mariano Marengo,Wraps,M,1974-08-17,47,M 45-49,148,140+,245,260,270,270,,-160,160,170,170,175,260,280,300.5,300.5,,740.5,SBD,1
Juan Manavella,Wraps,M,1977-11-30,44,M 40-44,115.8,125,270,285,300,300,,145,155,160,160,,260,280,-300,280,,740,SBD,1
Soledad Gambarte,Raw,F,1997-01-15,25,Open,64.2,67.5,,,,,,65,72.5,-77.5,72.5,,,,,,,72.5,B,3
Ana Castro,Raw,F,1994-01-20,28,Open,65.3,67.5,,,,,,85,90,92.5,92.5,,,,,,,92.5,B,1
Mariana Amarilla,Raw,F,1996-12-11,25,Open,62.85,67.5,,,,,,80,87.5,90,90,95,,,,,,90,B,2
Damian Bonfilo,Raw,M,1992-01-22,30,Open,67.3,67.5,,,,,,-130,130,140,140,-148,,,,,,140,B,1
Mauro Lejona,Raw,M,1982-03-12,40,M 40-44,74.9,75,,,,,,150,160,-165,160,,,,,,,160,B,1
Maximiliano Odino,Raw,M,1977-01-13,45,M 45-49,81.6,82.5,,,,,,160,-172.5,-172.5,160,,,,,,,160,B,1
Carlos Porta,Raw,M,1933-02-03,89,M 85-89,79.9,82.5,,,,,,65,70,-72.5,70,,,,,,,70,B,1
Mario Garcia,Raw,M,1992-10-20,29,Open,88.9,90,,,,,,100,,,100,,,,,,,100,B,1
Nicolas Godoy,Raw,M,1978-01-25,44,M 40-44,88.35,90,,,,,,135,140,-145,140,,,,,,,140,B,1
Facundo Paz,Raw,M,1974-02-05,48,M 45-49,89.2,90,,,,,,185,-190,-190,185,,,,,,,185,B,1
Sergio Tomassoni,Raw,M,1969-12-27,52,M 50-54,82.95,90,,,,,,150,160,167.5,167.5,172.5,,,,,,167.5,B,1
Pablo Aurellio,Raw,M,1978-12-22,43,M 40-44,98.75,100,,,,,,190,200,-202.5,200,,,,,,,200,B,1
Marcos Azcurra,Raw,M,1976-11-16,45,M 45-49,95.5,100,,,,,,170,180,-190,180,,,,,,,180,B,1
Nestor Gonzalez,Raw,M,1970-03-06,52,M 50-54,97.3,100,,,,,,100,110,115,115,,,,,,,115,B,1
Lisandro Pascuale,Raw,M,1968-01-07,54,M 50-54,97.8,100,,,,,,80,,,80,,,,,,,80,B,2
Ignacio Paz,Raw,M,1979-03-04,43,M 40-44,96.9,100,,,,,,170,180,-187.5,180,,,,,,,180,B,2
Lucas Basualdo,Raw,M,1981-02-20,41,M 40-44,95,100,,,,,,50,70,90,90,,,,,,,90,B,3
Enrique Barrionuevo,Raw,M,1968-11-01,53,M 50-54,109.9,110,,,,,,140,147.5,152.5,152.5,155,,,,,,152.5,B,1
Erik Anzalo,Raw,M,1990-07-18,32,Open,123.65,125,,,,,,215,-225,225,225,,,,,,,225,B,1
Gabriel Lopez,Raw,M,1977-03-06,45,M 45-49,135.2,140,,,,,,165,-172.5,-172.5,165,,,,,,,165,B,1
Yanina Delvalle,Raw,F,1978-08-29,43,M 40-44,52,52,,,,,,55,57.5,-60,57.5,,105,115,120,120,,177.5,BD,1
Yanina Delvalle,Raw,F,1978-08-29,43,Open,52,52,,,,,,55,57.5,-60,57.5,,105,115,120,120,,177.5,BD,1
Patricia Laura Clivio,Raw,F,1979-08-10,43,M 40-44,53.4,56,,,,,,-45,50,-55,50,,-110,110,-120,110,,160,BD,1
Celina Reymundo,Raw,F,1983-08-10,39,Open,56,56,,,,,,,,,,,,,,,,,BD,DQ
Pablo Raccanello,Raw,M,1986-02-15,36,Open,82.15,82.5,,,,,,120,-130,135,135,,175,185,195,195,,330,BD,2
Fabián Rivero,Raw,M,1990-07-29,32,Open,79.4,82.5,,,,,,135,-140,140,140,,240,255,260.5,260.5,265,400.5,BD,1
Andrés Elvira,Raw,M,1979-04-25,43,M 40-44,75.95,82.5,,,,,,112.5,120,-125,120,,185,195,-205.5,195,,315,BD,1
Adriano Ceccone,Raw,M,2004-01-10,18,Tn 18-19,86.65,90,,,,,,100,110.5,-112.5,110.5,,200,210,215,215,,325.5,BD,1
Mario Garcia,Raw,M,1992-10-20,29,Open,88.9,90,,,,,,155,165,-170,165,,220,-240,240,240,,405,BD,1
Damián Brankovic,Raw,M,1980-05-28,42,M 40-44,86.55,90,,,,,,150,155,157.5,157.5,,230,240,245,245,,402.5,BD,1
Lisandro Pascuale,Raw,M,1968-01-07,54,M 50-54,97.8,100,,,,,,95,105,107.5,107.5,,170,190,200,200,,307.5,BD,1
Mateo Llanos,Raw,M,2000-07-22,22,Jun,107.4,110,,,,,,135,145,160,160,,225,240,260,260,,420,BD,1
Martin Marquez,Raw,M,1998-11-06,23,Jun,110.5,125,,,,,,115,127.5,-132.5,127.5,,160,170,-182.5,170,,297.5,BD,1
German Orpianessi,Raw,M,1980-11-11,41,M 40-44,105.65,110,,,,,,140,152.5,-160,152.5,,240,255,270,270,,422.5,BD,1
Maria Carolina Sciangula,Raw,F,1998-09-29,23,Jun,63.15,67.5,,,,,,,,,,,80,90,95,95,100,95,D,1
Maria Fernanda Godoy Cruz,Raw,F,1979-12-11,42,M 40-44,90.5,90+,,,,,,,,,,,130,150,175,175,,175,D,1
Jose Luis Rodriguez,Raw,M,1989-12-13,32,Open,81.55,82.5,,,,,,,,,,,225,235,245,245,,245,D,1
Damian Dominicheli,Raw,M,1987-02-13,35,Open,87.1,90,,,,,,,,,,,160,170,180,180,,180,D,1
