Place,Sex,Name,Event,Division,WeightClassKg,Equipment,State,BodyweightKg,Squat1Kg,Squat2Kg,Squat3Kg,Best3SquatKg,Bench1Kg,Bench2Kg,Bench3Kg,Best3BenchKg,Deadlift1Kg,Deadlift2Kg,Deadlift3Kg,Best3DeadliftKg,TotalKg,BirthYear
1,M,Miles Priefer,SBD,M-O,59,Single-ply,WI,56.9,-125,125,135,135,65,67.5,-72.5,67.5,135,,,135,337.5,1999
1,M,Gerald Lindas,B,MR-M,74,Raw,WI,71.4,,,,,97.5,102.5,105,105,,,,,105,1936
1,M,Scott Benson,B,MR-M,83,Raw,WI,83,,,,,145,150,157.5,157.5,,,,,157.5,1963
1,M,Lenny Austin,B,MR-M,105,Raw,WI,103.7,,,,,155,165,170,170,,,,,170,1969
2,M,Thomas Mollan,B,MR-M,105,Raw,WI,101.5,,,,,120,130,135,135,,,,,135,1946
1,M,David Johnson,B,MR-O,120,Raw,WI,116.4,,,,,190,195,-200,195,,,,,195,1990
1,M,Chad Richards,SBD,MR-O,74,Raw,WI,67.9,115,125,-137.5,125,105,-120,-120,105,160,,,160,390,1987
2,M,Gerald Lindas,B,MR-O,74,Raw,WI,71.4,,,,,97.5,102.5,105,105,,,,,105,1936
1,M,Scott Benson,B,MR-O,83,Raw,WI,83,,,,,145,150,157.5,157.5,,,,,157.5,1963
2,M,Jordan Rank,B,MR-O,83,Raw,WI,80.6,,,,,130,142.5,-150,142.5,,,,,142.5,1969
1,M,Lenny Austin,B,MR-O,105,Raw,WI,103.7,,,,,155,165,170,170,,,,,170,1969
2,M,Thomas Mollan,B,MR-O,105,Raw,WI,101.5,,,,,120,130,135,135,,,,,135,1946
1,M,David Johnson,B,MR-O,120,Raw,WI,116.4,,,,,190,195,-200,195,,,,,195,1990
1,M,Miles Priefer,SBD,MR-T,59,Raw,WI,56.9,-125,125,135,135,65,67.5,-72.5,67.5,135,,,135,337.5,1999
1,F,Paige Bartelt,SBD,FR-C,52,Raw,WI,49.7,75,90,-97.5,90,60,65,70,70,82.5,,,82.5,242.5,1993
1,F,Brianna Levenson,B,FR-C,63,Raw,IN,62,,,,,47.5,52.5,55,55,,,,,55,1996
1,F,Brianna Levenson,B,FR-O,63,Raw,IN,62,,,,,47.5,52.5,55,55,,,,,55,1996
1,M,Kenny Johnson,SBD,M-C,59,Single-ply,WI,54,170,180,185,185,80,87.5,92.5,92.5,187.5,200,210,210,487.5,1997
1,M,Bobby Teel,SBD,M-C,66,Single-ply,WI,65,182.5,192.5,197.5,197.5,92.5,-97.5,-97.5,92.5,180,-192.5,197.5,197.5,487.5,1996
DQ,M,Neil Ypil,SBD,M-C,66,Single-ply,IL,63.8,-145,-155,-165,,92.5,97.5,-105,97.5,162.5,167.5,-172.5,167.5,,1994
DQ,M,Stuart Coogan,SBD,M-M,83,Single-ply,WI,78.6,-182.5,-182.5,-182.5,,-67.5,-67.5,,,,,,,,1956
1,M,Dennis Smits,SBD,M-M,105,Single-ply,WI,93.3,-240,-240,245,245,145,-150,-150,145,215,230,-240,230,620,1959
DQ,M,James Rickert,SBD,M-M,120,Single-ply,WI,108.6,-175,-175,-175,,-152.5,-152.5,-152.5,,-175,-175,-175,,,1952
1,M,Kenny Johnson,SBD,M-O,59,Single-ply,WI,54,170,180,185,185,80,87.5,92.5,92.5,187.5,200,210,210,487.5,1997
2,M,Miles Priefer,SBD,M-O,59,Single-ply,WI,56.9,-125,125,135,135,65,67.5,-72.5,67.5,135,147.5,150,150,352.5,1999
1,M,Bobby Teel,SBD,M-O,66,Single-ply,WI,65,182.5,192.5,197.5,197.5,92.5,-97.5,-97.5,92.5,180,-192.5,197.5,197.5,487.5,1996
DQ,M,Neil Ypil,SBD,M-O,66,Single-ply,IL,63.8,-145,-155,-165,,92.5,97.5,-105,97.5,162.5,167.5,-172.5,167.5,,1994
1,M,David Haselton,SBD,M-O,83,Single-ply,WI,78.4,-202.5,-215,215,215,127.5,132.5,-137.5,132.5,-202.5,-217.5,217.5,217.5,565,1991
2,M,Michael Schuelke,SBD,M-O,83,Single-ply,WI,79.9,175,-185,-190,175,97.5,-102.5,-102.5,97.5,182.5,190,195,195,467.5,1969
DQ,M,Stuart Coogan,SBD,M-O,83,Single-ply,WI,78.6,-182.5,-182.5,-182.5,,-67.5,-67.5,,,,,,,,1956
DQ,M,Matt Teske,SBD,M-O,93,Single-ply,WI,90.7,-227.5,-237.5,-237.5,,152.5,-160,-160,152.5,247.5,-260,-280,247.5,,1978
1,M,Dennis Smits,SBD,M-O,105,Single-ply,WI,93.3,-240,-240,245,245,145,-150,-150,145,215,230,-240,230,620,1959
DQ,M,James Rickert,SBD,M-O,120,Single-ply,WI,108.6,-175,-175,-175,,-152.5,-152.5,-152.5,,-175,-175,-175,,,1952
1,M,Cooper Wage,SBD,M-O,120+,Single-ply,WI,161.7,400,-422.5,432.5,432.5,315,325,332.5,332.5,307.5,325,-332.5,325,1090,1987
2,M,Kenneth Brashears,SBD,M-O,120+,Single-ply,WI,132.4,250,275,295,295,182.5,192.5,202.5,202.5,250,275,287.5,287.5,785,1987
1,M,Jacob Kari,SBD,MR-C,66,Raw,MI,62.4,132.5,142.5,-150,142.5,82.5,87.5,90,90,182.5,-195,200,200,432.5,1995
1,M,Ryan Lepkowski,SBD,MR-C,74,Raw,WI,71.6,142.5,155,167.5,167.5,120,127.5,132.5,132.5,170,182.5,195,195,495,1992
2,M,Joseph Lim,SBD,MR-C,74,Raw,NY,73,160,-177.5,-177.5,160,92.5,97.5,-100,97.5,185,-200,,185,442.5,1996
3,M,Zachary Smith,SBD,MR-C,74,Raw,IN,67.6,127.5,137.5,140,140,80,85,-87.5,85,140,147.5,155,155,380,1978
1,M,Donald Greengrass,SBD,MR-C,83,Raw,WI,81.7,-175,175,-182.5,175,-125,-125,125,125,207.5,220,227.5,227.5,527.5,1991
1,M,Aaron King #4,SBD,MR-C,93,Raw,WI,90.8,227.5,-240,-240,227.5,152.5,-162.5,-162.5,152.5,230,240,-255,240,620,1991
2,M,Alex Owens,SBD,MR-C,93,Raw,WI,87.9,222.5,235,240,240,132.5,140,-145,140,220,230,-235,230,610,1995
3,M,Brandon Danowski,SBD,MR-C,93,Raw,WI,92.1,200,-217.5,217.5,217.5,130,-140,-140,130,202.5,215,232.5,232.5,580,1994
4,M,Harry Lipke,SBD,MR-C,93,Raw,WI,89.2,172,190,-202.5,190,135,150,160,160,-175,190,212.5,212.5,562.5,1995
5,M,Alex Wasechek,SBD,MR-C,93,Raw,WI,90.2,167.5,177.5,-185,177.5,112.5,120,-125,120,202.5,215,225,225,522.5,1996
1,M,Michael Kaschner,SBD,MR-C,105,Raw,WI,102.2,212.5,225,-237.5,225,-182.5,182.5,-197.5,182.5,265,280,297.5,297.5,705,1993
2,M,Joe Allen,SBD,MR-C,105,Raw,WI,102.5,227.5,240,250,250,150,157.5,-165,157.5,250,267.5,280,280,687.5,1996
3,M,Ben Pedersen,SBD,MR-C,105,Raw,IL,98.5,185,207.5,212.5,212.5,145,157.5,-165,157.5,230,245,260,260,630,1994
4,M,Anthony Wolf,SBD,MR-C,105,Raw,WI,100.2,207.5,217.5,227.5,227.5,137.5,142.5,150,150,215,230,245,245,622.5,1995
5,M,Joseph Mobley,SBD,MR-C,105,Raw,OH,97.8,175,182.5,-187.5,182.5,147.5,155,162.5,162.5,-180,180,200,200,545,1996
6,M,Aaron Kelling,SBD,MR-C,105,Raw,WI,101.1,167.5,180,190,190,110,117.5,122.5,122.5,190,202.5,210,210,522.5,1994
7,M,David Bosch,SBD,MR-C,105,Raw,WI,102.9,125,140,150,150,102.5,107.5,-115,107.5,167.5,180,197.5,197.5,455,1994
8,M,Nicholas Nordin,SBD,MR-C,105,Raw,WI,94.5,142.5,150,-157.5,150,117.5,-122.5,-122.5,117.5,177.5,-185,-185,177.5,445,1995
1,M,Tyler Lecher,SBD,MR-C,120,Raw,WI,116.5,227.5,235,242.5,242.5,142.5,147.5,-155,147.5,235,-245,-245,235,625,1992
2,M,Jake Schoen,SBD,MR-C,120,Raw,WI,119.3,215,-230,230,230,130,142.5,145,145,215,230,240,240,615,1995
3,M,Joseph Nordin,SBD,MR-C,120,Raw,WI,116.3,177.5,187.5,-190,187.5,135,140,-145,140,212.5,-227.5,-227.5,212.5,540,1992
1,M,Andy Askow,SBD,MR-C,120+,Raw,WI,170.8,325,347.5,362.5,362.5,207.5,220,230,230,297.5,317.5,-330,317.5,910,1994
1,M,Scott Grade,SBD,MR-M,83,Raw,WI,78.9,165,175,-182.5,175,125,132.5,140,140,205,215,227.5,227.5,542.5,1971
2,M,Anthoiny Williams,SBD,MR-M,83,Raw,WI,80.1,-165,-165,165,165,-110,-112.5,112.5,112.5,227.5,-235,235,235,512.5,1963
1,M,Jason Stamm,SBD,MR-M,93,Raw,WI,92.4,192.5,-205,-205,192.5,110,115,-117.5,115,205,215,-227.5,215,522.5,1972
2,M,Bob Poetzel,SBD,MR-M,93,Raw,WI,83.1,120,130,140,140,92.5,97.5,102.5,102.5,125,140,147.5,147.5,390,1964
1,M,Jason Johnson #1,SBD,MR-M,105,Raw,WI,103.3,-225,225,-237.5,225,190,-197.5,-197.5,190,252.5,267.5,275,275,690,1971
2,M,Chris Eastman,SBD,MR-M,105,Raw,WI,97.5,147.5,157.5,-167.5,157.5,132.5,140,-145,140,182.5,200,-217.5,200,497.5,1969
3,M,Andrew Randall,SBD,MR-M,105,Raw,WI,96.7,135,147.5,-162.5,147.5,102.5,107.5,110,110,195,-210,220,220,477.5,1966
1,M,Scott Lade,SBD,MR-M,120,Raw,WI,119.8,250,-260,-260,250,170,182.5,190,190,240,255,-275,255,695,1968
1,M,Greg Frounfelter,SBD,MR-M,120+,Raw,WI,133,205,-220,220,220,112.5,115,122.5,122.5,227.5,237.5,242.5,242.5,585,1971
1,M,Matthew Mauk,SBD,MR-O,59,Raw,WI,57.4,77.5,87.5,97.5,97.5,50,57.5,62.5,62.5,117.5,130,137.5,137.5,297.5,1988
1,M,Jacob Kari,SBD,MR-O,66,Raw,MI,62.4,132.5,142.5,-150,142.5,82.5,87.5,90,90,182.5,-195,200,200,432.5,1995
1,M,Scott Sullivan #1,SBD,MR-O,74,Raw,MN,73.8,200,217.5,230,230,142.5,152.5,157.5,157.5,237.5,-260,265,265,652.5,1986
2,M,Daniel Thiel,SBD,MR-O,74,Raw,IL,71.3,200,-212.5,-212.5,200,112.5,-117.5,-117.5,112.5,227.5,-242.5,242.5,242.5,555,1986
3,M,Ryan Lepkowski,SBD,MR-O,74,Raw,WI,71.6,142.5,155,167.5,167.5,120,127.5,132.5,132.5,170,182.5,195,195,495,1992
4,M,Joseph Lim,SBD,MR-O,74,Raw,NY,73,160,-177.5,-177.5,160,92.5,97.5,-100,97.5,185,-200,,185,442.5,1996
5,M,Chad Mara,SBD,MR-O,74,Raw,WI,72.6,122.5,132.5,142.5,142.5,95,102.5,-110,102.5,167.5,182.5,192.5,192.5,437.5,1997
6,M,Chad Richards,SBD,MR-O,74,Raw,WI,67.9,115,125,-137.5,125,105,-120,-120,105,160,172.5,-185,172.5,402.5,1987
7,M,Zachary Smith,SBD,MR-O,74,Raw,IN,67.6,127.5,137.5,140,140,80,85,-87.5,85,140,147.5,155,155,380,1978
1,M,Leo Kim,SBD,MR-O,83,Raw,IL,82,195,-215,-215,195,130,142.5,-150,142.5,225,240,250,250,587.5,1990
2,M,Eric Lohman,SBD,MR-O,83,Raw,MN,82.3,195,207.5,210,210,127.5,135,-140,135,222.5,232.5,-242.5,232.5,577.5,1989
3,M,Eric Hess,SBD,MR-O,83,Raw,WI,77.2,190,-200,200,200,125,135,142.5,142.5,190,200,-210,200,542.5,1989
4,M,Scott Grade,SBD,MR-O,83,Raw,WI,78.9,165,175,-182.5,175,125,132.5,140,140,205,215,227.5,227.5,542.5,1971
5,M,Gunnar Denhart,SBD,MR-O,83,Raw,WI,80.4,162.5,175,182.5,182.5,127.5,135,-140,135,205,217.5,-227.5,217.5,535,1996
6,M,Donald Greengrass,SBD,MR-O,83,Raw,WI,81.7,-175,175,-182.5,175,-125,-125,125,125,207.5,220,227.5,227.5,527.5,1991
7,M,Tyler Brandt,SBD,MR-O,83,Raw,WI,74.2,147.5,-165,170,170,100,110,117.5,117.5,192.5,205,227.5,227.5,515,1992
8,M,Anthoiny Williams,SBD,MR-O,83,Raw,WI,80.1,-165,-165,165,165,-110,-112.5,112.5,112.5,227.5,-235,235,235,512.5,1963
9,M,Trevor Fuller,SBD,MR-O,83,Raw,WI,79.9,162.5,-177.5,187.5,187.5,97.5,107.5,-115,107.5,175,187.5,205,205,500,1996
10,M,Ryan Norton,SBD,MR-O,83,Raw,WI,82.8,155,-167.5,-170,155,107.5,-115,-115,107.5,192.5,-200,-200,192.5,455,1989
11,M,Leon DeLeon,SBD,MR-O,83,Raw,WI,75.8,-105,107.5,110,110,70,72.5,75,75,172.5,175,177.5,177.5,362.5,1987
1,M,Caleb Happel,SBD,MR-O,93,Raw,WI,92.3,235,257.5,-267.5,257.5,165,177.5,185,185,-275,-280,285,285,727.5,1995
2,M,Erik Kasabuske,SBD,MR-O,93,Raw,WI,92.8,235,245,252.5,252.5,147.5,157.5,-162.5,157.5,265,287.5,302.5,302.5,712.5,1983
3,M,Nick Gagnon,SBD,MR-O,93,Raw,MN,89.9,235,-250,260,260,165,175,180,180,250,270,-280,270,710,1987
4,M,Tim Wermeling,SBD,MR-O,93,Raw,WI,89.4,205,217.5,-225,217.5,150,157.5,-167.5,157.5,220,242.5,250,250,625,1989
5,M,Karl Hall,SBD,MR-O,93,Raw,WI,92,185,210,-232.5,210,137.5,-145,-145,137.5,-230,255,275,275,622.5,1976
6,M,Aaron King #4,SBD,MR-O,93,Raw,WI,90.8,227.5,-240,-240,227.5,152.5,-162.5,-162.5,152.5,230,240,-255,240,620,1991
7,M,Kyle Pederson,SBD,MR-O,93,Raw,WI,89.9,185,200,210,210,122.5,130,135,135,240,255,270,270,615,1977
8,M,Alex Owens,SBD,MR-O,93,Raw,WI,87.9,222.5,235,240,240,132.5,140,-145,140,220,230,-235,230,610,1995
9,M,Justin Grensing,SBD,MR-O,93,Raw,MN,92.3,192,-205,210,210,-152,155,-167.5,155,205,225,237.5,237.5,602.5,1984
10,M,Richard Hailey,SBD,MR-O,93,Raw,WI,92.9,197.5,-215,215,215,142.5,150,-157.5,150,210,230,235,235,600,1987
11,M,Cadellin Bauer,SBD,MR-O,93,Raw,WI,89.8,197.5,210,-222.5,210,130,-137.5,140,140,242.5,-255,-255,242.5,592.5,1994
12,M,Brandon Danowski,SBD,MR-O,93,Raw,WI,92.1,200,-217.5,217.5,217.5,130,-140,-140,130,202.5,215,232.5,232.5,580,1994
13,M,Sean Cummings,SBD,MR-O,93,Raw,WI,91.3,170,182.5,195,195,125,135,-145,135,210,225,240,240,570,1986
14,M,Tim Cribbin,SBD,MR-O,93,Raw,IL,89,165,182.5,200,200,115,130,-137.5,130,195,215,232.5,232.5,562.5,1991
15,M,Harry Lipke,SBD,MR-O,93,Raw,WI,89.2,172,190,-202.5,190,135,150,160,160,-175,190,212.5,212.5,562.5,1995
16,M,Daniel Lawson,SBD,MR-O,93,Raw,WI,92.3,190,205,-217.5,205,130,,-145,130,215,227.5,-237.5,227.5,562.5,1993
17,M,Matthew Mosiman,SBD,MR-O,93,Raw,WI,90.9,175,185,-190,185,132.5,-137.5,137.5,137.5,227.5,237.5,-247.5,237.5,560,1991
18,M,David Dellanave,SBD,MR-O,93,Raw,MN,91.2,175,-200,-207.5,175,100,-112.5,115,115,215,250,260,260,550,1983
19,M,Ben Willkommen,SBD,MR-O,93,Raw,WI,91.3,180,-197.5,-202.5,180,137.5,147.5,-152.5,147.5,200,212.5,222.5,222.5,550,1986
20,M,Matthew Klein,SBD,MR-O,93,Raw,WI,89.4,185,195,-200,195,132.5,137.5,-140,137.5,197.5,210,215,215,547.5,1988
21,M,Larry Schulte,SBD,MR-O,93,Raw,WI,88,185,192.5,-200,192.5,125,-132.5,-132.5,125,225,-237.5,-237.5,225,542.5,1996
22,M,Jaden Burgess-Eisch,SBD,MR-O,93,Raw,WI,90.8,187.5,-197.5,-197.5,187.5,120,-130,-135,120,-210,210,227.5,227.5,535,1999
23,M,Alex Wasechek,SBD,MR-O,93,Raw,WI,90.2,167.5,177.5,-185,177.5,112.5,120,-125,120,202.5,215,225,225,522.5,1996
24,M,Jason Stamm,SBD,MR-O,93,Raw,WI,92.4,192.5,-205,-205,192.5,110,115,-117.5,115,205,215,-227.5,215,522.5,1972
25,M,Jason Zepnick,SBD,MR-O,93,Raw,WI,89.1,147.5,-165,165,165,110,-127.5,-127.5,110,170,190,-200,190,465,1984
26,M,Bob Poetzel,SBD,MR-O,93,Raw,WI,83.1,120,130,140,140,92.5,97.5,102.5,102.5,125,140,147.5,147.5,390,1964
1,M,Matthew McHugh,SBD,MR-O,105,Raw,MI,104.9,230,242.5,252.5,252.5,172.5,182.5,187.5,187.5,250,267.5,272.5,272.5,712.5,1989
2,M,Michael Kaschner,SBD,MR-O,105,Raw,WI,102.2,212.5,225,-237.5,225,-182.5,182.5,-197.5,182.5,265,280,297.5,297.5,705,1993
3,M,Benjamin Clewien,SBD,MR-O,105,Raw,WI,100.7,232.5,247.5,257.5,257.5,165,175,-185,175,245,260,-270,260,692.5,1989
4,M,Jason Johnson #1,SBD,MR-O,105,Raw,WI,103.3,-225,225,-237.5,225,190,-197.5,-197.5,190,252.5,267.5,275,275,690,1971
5,M,Joe Allen,SBD,MR-O,105,Raw,WI,102.5,227.5,240,250,250,150,157.5,-165,157.5,250,267.5,280,280,687.5,1996
6,M,Nick Viegut,SBD,MR-O,105,Raw,MN,99.3,-212.5,215,222.5,222.5,140,147.5,152.5,152.5,237.5,255,265,265,640,1992
7,M,Anthony Wolf,SBD,MR-O,105,Raw,WI,100.2,207.5,217.5,227.5,227.5,137.5,142.5,150,150,215,230,245,245,622.5,1995
8,M,Garrison Gless,SBD,MR-O,105,Raw,MN,94.4,192.5,202.5,212.5,212.5,132.5,-140,-140,132.5,212.5,225,232.5,232.5,577.5,1990
9,M,Joseph Mobley,SBD,MR-O,105,Raw,OH,97.8,175,182.5,-187.5,182.5,147.5,155,162.5,162.5,-180,180,200,200,545,1996
10,M,Matthew Pickard,SBD,MR-O,105,Raw,WI,93.4,160,182.5,185,185,120,-135,-135,120,202.5,-220,225,225,530,1971
11,M,Aaron Kelling,SBD,MR-O,105,Raw,WI,101.1,167.5,180,190,190,110,117.5,122.5,122.5,190,202.5,210,210,522.5,1994
12,M,Matt Peroutky,SBD,MR-O,105,Raw,WI,93.5,157.5,162.5,-167.5,162.5,120,125,-130,125,202.5,210,217.5,217.5,505,1989
13,M,Chris Eastman,SBD,MR-O,105,Raw,WI,97.5,147.5,157.5,-167.5,157.5,132.5,140,-145,140,182.5,200,-217.5,200,497.5,1969
14,M,Andrew Randall,SBD,MR-O,105,Raw,WI,96.7,135,147.5,-162.5,147.5,102.5,107.5,110,110,195,-210,220,220,477.5,1966
15,M,Jacob Karbula,SBD,MR-O,105,Raw,WI,97.2,-155,155,-175,155,132.5,145,-155,145,175,-200,-207.5,175,475,1992
16,M,David Bosch,SBD,MR-O,105,Raw,WI,102.9,125,140,150,150,102.5,107.5,-115,107.5,167.5,180,197.5,197.5,455,1994
17,M,Nicholas Nordin,SBD,MR-O,105,Raw,WI,94.5,142.5,150,-157.5,150,117.5,-122.5,-122.5,117.5,177.5,-185,-185,177.5,445,1995
1,M,Scott Lade,SBD,MR-O,120,Raw,WI,119.8,250,-260,-260,250,170,182.5,190,190,240,255,-275,255,695,1968
2,M,Ian Barge,SBD,MR-O,120,Raw,WI,119.9,252.5,-275,-275,252.5,152.5,165,-177.5,165,272.5,-290,-290,272.5,690,1993
3,M,Matt Gunville,SBD,MR-O,120,Raw,WI,108.1,185,205,215,215,142.5,150,160,160,227.5,250,257.5,257.5,632.5,1978
4,M,Tyler Lecher,SBD,MR-O,120,Raw,WI,116.5,227.5,235,242.5,242.5,142.5,147.5,-155,147.5,235,-245,-245,235,625,1992
5,M,Jake Schoen,SBD,MR-O,120,Raw,WI,119.3,215,-230,230,230,130,142.5,145,145,215,230,240,240,615,1995
6,M,Kyle Kampschroer,SBD,MR-O,120,Raw,MN,112.4,182.5,192.5,207.5,207.5,135,142.5,-150,142.5,225,240,-245,240,590,1989
7,M,William Thanholt,SBD,MR-O,120,Raw,WI,109.8,195,205,210,210,142.5,147.5,-152.5,147.5,200,210,217.5,217.5,575,1989
8,M,Harrison Speltz,SBD,MR-O,120,Raw,MN,114,185,195,205,205,120,130,137.5,137.5,210,227.5,-247.5,227.5,570,1996
9,M,Brian Naidicz,SBD,MR-O,120,Raw,WI,113.6,-185,185,200,200,125,132.5,142.5,142.5,205,220,-232.5,220,562.5,1987
10,M,Ken Homan,SBD,MR-O,120,Raw,WI,105.2,192.5,202.5,210,210,122.5,-130,-130,122.5,220,227.5,-232.5,227.5,560,1990
11,M,Spencer Marusic,SBD,MR-O,120,Raw,WI,105.2,192.5,200,210,210,112.5,115,117.5,117.5,205,215,227.5,227.5,555,1997
12,M,Joseph Nordin,SBD,MR-O,120,Raw,WI,116.3,177.5,187.5,-190,187.5,135,140,-145,140,212.5,-227.5,-227.5,212.5,540,1992
13,M,Jason Johnson #2,SBD,MR-O,120,Raw,WI,117.5,167.5,177.5,-182.5,177.5,127.5,132.5,-137.5,132.5,195,-210,-210,195,505,1980
14,M,Chris Gutmanis,SBD,MR-O,120,Raw,WI,114.9,175,185,-200,185,95,-105,105,105,185,195,200,200,490,1982
1,M,Andy Askow,SBD,MR-O,120+,Raw,WI,170.8,325,347.5,362.5,362.5,207.5,220,230,230,297.5,317.5,-330,317.5,910,1994
2,M,Caleb Posselt,SBD,MR-O,120+,Raw,WI,132.8,195,210,-230,210,135,147.5,-155,147.5,257.5,267.5,277.5,277.5,635,1994
3,M,Greg Frounfelter,SBD,MR-O,120+,Raw,WI,133,205,-220,220,220,112.5,115,122.5,122.5,227.5,237.5,242.5,242.5,585,1971
4,M,Matt Cullen,SBD,MR-O,120+,Raw,WI,130,162.5,172.5,180,180,140,145,147.5,147.5,232.5,247.5,252.5,252.5,580,1982
5,M,Alex Ramirez,SBD,MR-O,120+,Raw,WI,134.4,185,205,-210,205,-127.5,127.5,-140,127.5,185,210,227.5,227.5,560,1993
6,M,Jason Allen,SBD,MR-O,120+,Raw,WI,130.6,155,-170,175,175,132.5,145,147.5,147.5,205,220,-227.5,220,542.5,1977
1,M,Miles Priefer,SBD,MR-T,59,Raw,WI,56.9,-125,125,135,135,65,67.5,-72.5,67.5,135,147.5,150,150,352.5,1999
1,M,Chad Mara,SBD,MR-T,74,Raw,WI,72.6,122.5,132.5,142.5,142.5,95,102.5,-110,102.5,167.5,182.5,192.5,192.5,437.5,1997
1,M,Jaden Burgess-Eisch,SBD,MR-T,93,Raw,WI,90.8,187.5,-197.5,-197.5,187.5,120,-130,-135,120,-210,210,227.5,227.5,535,1999
1,M,Spencer Marusic,SBD,MR-T,120,Raw,WI,105.2,192.5,200,210,210,112.5,115,117.5,117.5,205,215,227.5,227.5,555,1997
1,F,Kimberly Johnson,SBD,F-C,57,Single-ply,WI,55.6,162.5,172.5,-182.5,172.5,102.5,-110,110,110,162.5,172.5,-182.5,172.5,455,1994
2,F,Alexandra Ziepke,SBD,F-C,57,Single-ply,WI,56.8,140,142.5,-147.5,142.5,77.5,-82.5,-82.5,77.5,130,140,-147.5,140,360,1996
3,F,KC Ketzer,SBD,F-C,57,Single-ply,WI,55.7,-107.5,-107.5,107.5,107.5,57.5,62.5,-67.5,62.5,112.5,122.5,-137.5,122.5,292.5,1997
1,F,Morgan Graham,SBD,F-C,63,Single-ply,WI,62.4,-160,160,-167.5,160,67.5,-70,-70,67.5,135,140,-142.5,140,367.5,1996
DQ,F,Taylor Klemmensen,SBD,F-C,63,Single-ply,WI,59.9,-157.5,-157.5,-157.5,,-77.5,77.5,87.5,87.5,162.5,-172.5,-172.5,162.5,,1997
1,F,Kimberly Johnson,SBD,F-O,57,Single-ply,WI,55.6,162.5,172.5,-182.5,172.5,102.5,-110,110,110,162.5,172.5,-182.5,172.5,455,1994
2,F,Alexandra Ziepke,SBD,F-O,57,Single-ply,WI,56.8,140,142.5,-147.5,142.5,77.5,-82.5,-82.5,77.5,130,140,-147.5,140,360,1996
3,F,KC Ketzer,SBD,F-O,57,Single-ply,WI,55.7,-107.5,-107.5,107.5,107.5,57.5,62.5,-67.5,62.5,112.5,122.5,-137.5,122.5,292.5,1997
1,F,Morgan Graham,SBD,F-O,63,Single-ply,WI,62.4,-160,160,-167.5,160,67.5,-70,-70,67.5,135,140,-142.5,140,367.5,1996
DQ,F,Taylor Klemmensen,SBD,F-O,63,Single-ply,WI,59.9,-157.5,-157.5,-157.5,,-77.5,77.5,87.5,87.5,162.5,-172.5,-172.5,162.5,,1997
1,F,Erin Walterman,SBD,F-O,72,Single-ply,WI,65.7,155,165,170,170,115,120,-125,120,175,-190,-190,175,465,1982
2,F,Brittany Rabe,SBD,F-O,72,Single-ply,WI,67.6,-157.5,-167.5,167.5,167.5,75,80,82.5,82.5,162.5,172.5,-180,172.5,422.5,1998
1,F,Sara Rodock,SBD,F-O,84,Single-ply,WI,83.5,170,177.5,-182.5,177.5,-122.5,122.5,-130,122.5,135,145,152.5,152.5,452.5,1981
1,F,Paige Bartelt,SBD,FR-C,52,Raw,WI,49.7,75,90,-97.5,90,60,65,70,70,82.5,97.5,105,105,265,1993
1,F,Lianna Schwalenberg,SBD,FR-C,57,Raw,WI,54.4,95,100,115,115,60,-67.5,-67.5,60,110,112.5,115,115,290,1995
1,F,Morgan Betrzyk,SBD,FR-C,63,Raw,WI,62.6,122.5,-130,-130,122.5,57.5,62.5,-65,62.5,137.5,147.5,162.5,162.5,347.5,1993
1,F,Mercedes Vandaver,SBD,FR-C,72,Raw,WI,72,112.5,120,-122.5,120,75,-80,80,80,125,140,145,145,345,1994
2,F,Kimberly Buchholz,SBD,FR-C,72,Raw,WI,71.1,82.5,97.5,105,105,65,67.5,72.5,72.5,125,137.5,147.5,147.5,325,1995
3,F,Peen Coles #1,SBD,FR-C,72,Raw,WI,68.2,-92.5,97.5,107.5,107.5,45,-52.5,-55,45,125,-135,135,135,287.5,
1,F,Sara Takacs,SBD,FR-C,84,Raw,OH,80.9,-102.5,102.5,-112.5,102.5,57.5,-60,60,60,115,125,-132.5,125,287.5,1996
2,F,Kaitlyn Sankey,SBD,FR-C,84,Raw,WI,83.9,87.5,-97.5,97.5,97.5,40,-45,-45,40,122.5,132.5,142.5,142.5,280,1996
1,F,Annette Rattunde,SBD,FR-M,52,Raw,WI,50.1,75,-85,85,85,37.5,40,42.5,42.5,95,102.5,105,105,232.5,1966
1,F,Leah Herried,SBD,FR-M,63,Raw,WI,59.7,-77.5,80,85,85,37.5,42.5,45,45,82.5,85,90,90,220,1973
1,F,Candice Feider,SBD,FR-M,72,Raw,WI,70.5,102.5,110,-115,110,55,-60,-62.5,55,102.5,110,115,115,280,1972
2,F,Brenda Trewyn,SBD,FR-M,72,Raw,WI,68.9,85,90,95,95,42.5,45,-50,45,102.5,110,120,120,260,1976
3,F,Sandra Kasabuske,SBD,FR-M,72,Raw,WI,64.4,52.5,60,-65,60,27.5,32.5,37.5,37.5,82.5,90,97.5,97.5,195,1948
1,F,Majorie Staller,SBD,FR-M,84,Raw,WI,73.1,70,77.5,85,85,35,37.5,-42.5,37.5,80,90,100,100,222.5,1961
DQ,F,Majorie Staller,SBD,FR-M,84,Raw,WI,73.1,-70,,,,-35,,,,-80,,,,,1961
1,F,Deanna Reilly,SBD,FR-M,84+,Raw,WI,110.4,95,100,105,105,65,70,-72.5,70,145,155,-165,155,330,1964
2,F,Katherine Klass,SBD,FR-M,84+,Raw,WI,109.8,57.5,70,-80,70,55,-60,60,60,125,137.5,-145,137.5,267.5,1954
3,F,Brenda Knighton,SBD,FR-M,84+,Raw,WI,91.2,-67.5,67.5,77.5,77.5,47.5,-52.5,-52.5,47.5,110,117.5,-122.5,117.5,242.5,1960
DQ,F,Jolene Saunders,SBD,FR-M,84+,Raw,WI,89.8,-85,-85,-90,,42.5,47.5,50,50,102.5,107.5,115,115,,1974
1,F,Paige Bartelt,SBD,FR-O,52,Raw,WI,49.7,75,90,-97.5,90,60,65,70,70,82.5,97.5,105,105,265,1993
2,F,Lisa Feran,SBD,FR-O,52,Raw,WI,51.2,82.5,-90,-92.5,82.5,45,-50,-52.5,45,92.5,97.5,107.5,107.5,235,1981
3,F,Annette Rattunde,SBD,FR-O,52,Raw,WI,50.1,75,-85,85,85,37.5,40,42.5,42.5,95,102.5,105,105,232.5,1966
1,F,Jessica Enriquez,SBD,FR-O,57,Raw,IL,53.9,102.5,110,-115,110,52.5,-57.5,57.5,57.5,137.5,142.5,152.5,152.5,320,1986
2,F,Stephanie Vetter,SBD,FR-O,57,Raw,WI,56.7,102.5,110,-115,110,57.5,60,62.5,62.5,140,147.5,-150,147.5,320,1981
3,F,Lianna Schwalenberg,SBD,FR-O,57,Raw,WI,54.4,95,100,115,115,60,-67.5,-67.5,60,110,112.5,115,115,290,1995
1,F,Autumn Herried,SBD,FR-O,63,Raw,WI,61.7,127.5,135,-137.5,135,67.5,70,72.5,72.5,127.5,140,142.5,142.5,350,1995
2,F,Morgan Betrzyk,SBD,FR-O,63,Raw,WI,62.6,122.5,-130,-130,122.5,57.5,62.5,-65,62.5,137.5,147.5,162.5,162.5,347.5,1993
3,F,Crystale Lind,SBD,FR-O,63,Raw,WI,62.7,-100,-102.5,107.5,107.5,57.5,-62.5,-62.5,57.5,110,120,132.5,132.5,297.5,1979
4,F,Ashley Tietgen,SBD,FR-O,63,Raw,WI,61.7,-92.5,95,-97.5,95,50,55,-62.5,55,120,127.5,135,135,285,1992
5,F,Stephanie School,SBD,FR-O,63,Raw,WI,59.1,77.5,85,-92.5,85,42.5,47.5,55,55,87.5,-105,105,105,245,1991
6,F,Bonnie Miller,SBD,FR-O,63,Raw,IL,61.1,62.5,70,80,80,52.5,-55,55,55,87.5,-105,105,105,240,1983
7,F,Erin Zabel,SBD,FR-O,63,Raw,WI,60.3,70,75,80,80,45,50,-55,50,92.5,97.5,102.5,102.5,232.5,1988
8,F,Leah Herried,SBD,FR-O,63,Raw,WI,59.7,-77.5,80,85,85,37.5,42.5,45,45,82.5,85,90,90,220,1973
DQ,F,Alyshia Fry,SBD,FR-O,63,Raw,WI,62.8,-77.5,-95,-95,,52.5,57.5,62.5,62.5,92.5,107.5,112.5,112.5,,1993
1,F,Frances Marks,SBD,FR-O,72,Raw,IL,70.1,105,-117.5,125,125,65,72.5,-75,72.5,145,-157.5,157.5,157.5,355,1990
2,F,Katie Stewart,SBD,FR-O,72,Raw,WI,66.3,110,125,-130,125,57.5,70,80,80,125,137.5,142.5,142.5,347.5,1992
3,F,Jing Peng,SBD,FR-O,72,Raw,WI,71.1,125,-135,-135,125,70,-75,-75,70,152.5,-162.5,-165,152.5,347.5,1992
4,F,Mercedes Vandaver,SBD,FR-O,72,Raw,WI,72,112.5,120,-122.5,120,75,-80,80,80,125,140,145,145,345,1994
5,F,Melissa De Jesus,SBD,FR-O,72,Raw,WI,69.6,105,112.5,-120,112.5,70,75,77.5,77.5,130,137.5,145,145,335,1981
6,F,Kimberly Buchholz,SBD,FR-O,72,Raw,WI,71.1,82.5,97.5,105,105,65,67.5,72.5,72.5,125,137.5,147.5,147.5,325,1995
7,F,Kate Trautschold,SBD,FR-O,72,Raw,WI,70.7,115,-130,130,130,55,62.5,67.5,67.5,115,122.5,-132.5,122.5,320,1984
8,F,Helen Lewis-Rzeszutek,SBD,FR-O,72,Raw,WI,67.5,112.5,122.5,130,130,57.5,62.5,65,65,105,112.5,122.5,122.5,317.5,1986
9,F,Peen Coles #1,SBD,FR-O,72,Raw,WI,68.2,-92.5,97.5,107.5,107.5,45,-52.5,-55,45,125,-135,135,135,287.5,
10,F,Kelsey Schrand,SBD,FR-O,72,Raw,WI,72,92.5,97.5,-102.5,97.5,52.5,-57.5,-57.5,52.5,102.5,-115,132.5,132.5,282.5,1995
11,F,Candice Feider,SBD,FR-O,72,Raw,WI,70.5,102.5,110,-115,110,55,-60,-62.5,55,102.5,110,115,115,280,1972
12,F,Brenda Trewyn,SBD,FR-O,72,Raw,WI,68.9,85,90,95,95,42.5,45,-50,45,102.5,110,120,120,260,1976
13,F,Paige Bayer,SBD,FR-O,72,Raw,WI,66.9,85,-92.5,-92.5,85,52.5,57.5,-60,57.5,102.5,115,-130,115,257.5,1992
14,F,Alexis Stein,SBD,FR-O,72,Raw,WI,63.3,67.5,75,-82.5,75,40,45,-50,45,82.5,-100,-100,82.5,202.5,2000
15,F,Sandra Kasabuske,SBD,FR-O,72,Raw,WI,64.4,52.5,60,-65,60,27.5,32.5,37.5,37.5,82.5,90,97.5,97.5,195,1948
1,F,Lacey Winters,SBD,FR-O,84,Raw,WI,83,125,130,137.5,137.5,67.5,72.5,77.5,77.5,150,160,-172.5,160,375,1997
2,F,Hannah Brown,SBD,FR-O,84,Raw,WI,83.3,117.5,125,130,130,60,65,-72.5,65,-152.5,160,170,170,365,1990
3,F,Elizabeth Naidicz,SBD,FR-O,84,Raw,WI,80.2,125,132.5,140,140,-62.5,67.5,72.5,72.5,122.5,135,142.5,142.5,355,1988
4,F,Tessie Johnson,SBD,FR-O,84,Raw,WI,75.2,107.5,125,-130,125,57.5,62.5,-72.5,62.5,110,115,130,130,317.5,1981
5,F,Jamie Bauer,SBD,FR-O,84,Raw,WI,79.7,92.5,102.5,110,110,70,77.5,-80,77.5,115,122.5,127.5,127.5,315,1987
6,F,Chelsea Westcott,SBD,FR-O,84,Raw,WI,73.3,105,-110,110,110,60,-67.5,-67.5,60,125,132.5,137.5,137.5,307.5,1989
7,F,Hayley Crossland,SBD,FR-O,84,Raw,WI,77.2,102.5,110,115,115,52.5,57.5,60,60,102.5,107.5,115,115,290,1997
8,F,Sara Takacs,SBD,FR-O,84,Raw,OH,80.9,-102.5,102.5,-112.5,102.5,57.5,-60,60,60,115,125,-132.5,125,287.5,1996
9,F,Katie Nelson,SBD,FR-O,84,Raw,WI,75.7,97.5,102.5,-107.5,102.5,47.5,50,52.5,52.5,112.5,120,127.5,127.5,282.5,1990
10,F,Kaitlyn Sankey,SBD,FR-O,84,Raw,WI,83.9,87.5,-97.5,97.5,97.5,40,-45,-45,40,122.5,132.5,142.5,142.5,280,1996
11,F,Gabriella Jacobsen,SBD,FR-O,84,Raw,WI,75.8,90,-107.5,-110,90,-62.5,65,-67.5,65,-107.5,112.5,122.5,122.5,277.5,1990
12,F,Annie Meidl,SBD,FR-O,84,Raw,WI,72.8,67.5,70,82.5,82.5,47.5,52.5,-60,52.5,135,-147.5,-155,135,270,1987
13,F,Majorie Staller,SBD,FR-O,84,Raw,WI,73.1,70,77.5,85,85,35,37.5,-42.5,37.5,80,90,100,100,222.5,1961
DQ,F,Majorie Staller,SBD,FR-O,84,Raw,WI,73.1,-70,,,,-35,,,,-80,,,,,1961
DQ,F,Gabriella Jacobsen,SBD,FR-O,84,Raw,WI,75.8,-90,,,,,,,,,,,,,1990
1,F,Julia Gengenbach,SBD,FR-O,84+,Raw,WI,91.4,-102.5,110,115,115,-62.5,67.5,70,70,137.5,150,155,155,340,1977
2,F,Deanna Reilly,SBD,FR-O,84+,Raw,WI,110.4,95,100,105,105,65,70,-72.5,70,145,155,-165,155,330,1964
3,F,Yovanka Kienzle,SBD,FR-O,84+,Raw,WI,88,105,107.5,112.5,112.5,65,70,-75,70,130,135,-140,135,317.5,1982
4,F,Katherine Klass,SBD,FR-O,84+,Raw,WI,109.8,57.5,70,-80,70,55,-60,60,60,125,137.5,-145,137.5,267.5,1954
5,F,Brenda Knighton,SBD,FR-O,84+,Raw,WI,91.2,-67.5,67.5,77.5,77.5,47.5,-52.5,-52.5,47.5,110,117.5,-122.5,117.5,242.5,1960
DQ,F,Jolene Saunders,SBD,FR-O,84+,Raw,WI,89.8,-85,-85,-90,,42.5,47.5,50,50,102.5,107.5,115,115,,1974
1,F,Alexis Stein,SBD,FR-T,72,Raw,WI,63.3,67.5,75,-82.5,75,40,45,-50,45,82.5,-100,-100,82.5,202.5,2000
1,F,Lacey Winters,SBD,FR-T,84,Raw,WI,83,125,130,137.5,137.5,67.5,72.5,77.5,77.5,150,160,-172.5,160,375,1997
2,F,Hayley Crossland,SBD,FR-T,84,Raw,WI,77.2,102.5,110,115,115,52.5,57.5,60,60,102.5,107.5,115,115,290,1997
1,F,Brittany Rabe,SBD,F-T,72,Single-ply,WI,67.6,-157.5,-167.5,167.5,167.5,75,80,82.5,82.5,162.5,172.5,-180,172.5,422.5,1998
