Place,Name,Sex,BirthDate,Age,Equipment,Division,BodyweightKg,WeightClassKg,Squat1Kg,Squat2Kg,Squat3Kg,Best3SquatKg,Bench1Kg,Bench2Kg,Bench3Kg,Bench4Kg,Best3BenchKg,Deadlift1Kg,Deadlift2Kg,Deadlift3Kg,Deadlift4Kg,Best3DeadliftKg,TotalKg,Event,Tested
1,Bo Dangerfield,F,,17,Raw,J15-19,51.9,52,82.5,87.5,-90,87.5,47.5,52.5,-60,,52.5,85,90,95,,95,235,SBD,Yes
1,Yana Marks,F,,18,Raw,J15-19,59.1,60,115,125,130,130,65,70,-72.5,,70,135,145,152.5,,152.5,352.5,SBD,Yes
1,Abby Wallis,F,,23,Raw,J20-23,58.9,60,135,142.5,150,150,85,-90,-90,,85,160,170,-180,,170,405,SBD,Yes
1,Lexi Samios,F,,20,Raw,J20-23,65.5,67.5,130,140,147.5,147.5,65,-70,72.5,,72.5,140,150,-157.5,,150,370,SBD,Yes
1,Shal Yi,F,,42,Raw,M40-44,54.2,56,95,100,105,105,50,-52.5,-52.5,,50,110,115,120,,120,275,SBD,Yes
1,Cally Jennings,F,,40,Raw,M40-44,67.2,67.5,135,-142.5,145,145,75,80,-85,,80,150,160,167.5,,167.5,392.5,SBD,Yes
1,Rosie Hunt,F,,45,Raw,M45-49,58.6,60,105,110,115,115,55,60,65,,65,125,135,145,,145,325,SBD,Yes
2,Rowena Flynn,F,,46,Raw,M45-49,57,60,95,-100,100,100,52.5,-55,-57.5,,52.5,125,130,135,,135,287.5,SBD,Yes
1,Sue Harris,F,,57,Raw,M55-59,65.8,67.5,105,112.5,117.5,117.5,52.5,-57.5,-61,,52.5,115,122.5,-130,,122.5,292.5,SBD,Yes
1,Julie Barnett,F,,60,Raw,M60-64,66.6,67.5,90,100,110,110,50,55,57.5,,57.5,110,120,130,,130,297.5,SBD,Yes
2,Julie Coles,F,,61,Raw,M60-64,66,67.5,72.5,77.5,81,81,32.5,37.5,-42.5,,37.5,92.5,102.5,-107.5,,102.5,221,SBD,Yes
1,Di Weick,F,,67,Raw,M65-69,63.9,67.5,65,70,72.5,72.5,42.5,-45,45,,45,95,105,110,,110,227.5,SBD,Yes
1,Gabrielle Bichell,F,,24,Raw,Open,45.8,48,80,85,-90,85,40,-45,-45,,40,100,110,-115,,110,235,SBD,Yes
1,Dori Qu,F,,24,Raw,Open,48.1,52,115,120,125.5,125.5,65,67.5,70,,70,150,156,-160,,156,351.5,SBD,Yes
2,Onica Mmaka,F,,27,Raw,Open,50.2,52,115,-120,120,120,52.5,57.5,-60,,57.5,135,145,-155,,145,322.5,SBD,Yes
3,Bo Dangerfield,F,,17,Raw,Open,51.9,52,82.5,87.5,-90,87.5,47.5,52.5,-60,,52.5,85,90,95,,95,235,SBD,Yes
1,Amy Campbell,F,,35,Raw,Open,54.8,56,-115,120,125,125,50,57.5,-60,,57.5,140,150,-155,,150,332.5,SBD,Yes
2,Rosie Mandala,F,,31,Raw,Open,55.9,56,102.5,107.5,-112.5,107.5,57.5,-62.5,62.5,,62.5,130,137.5,-142.5,,137.5,307.5,SBD,Yes
3,Hollie McConkey,F,,27,Raw,Open,55.1,56,100,110,-112.5,110,55,60,62.5,,62.5,105,115,120,,120,292.5,SBD,Yes
4,Jessica Koczan,F,,32,Raw,Open,55.8,56,95,105,110,110,52.5,57.5,-60,,57.5,100,112.5,-117.5,,112.5,280,SBD,Yes
5,Shal Yi,F,,42,Raw,Open,54.2,56,95,100,105,105,50,-52.5,-52.5,,50,110,115,120,,120,275,SBD,Yes
1,Jessica Kennedy,F,,28,Raw,Open,58.2,60,160,-167.5,167.5,167.5,80,82.5,-85,,82.5,160,167.5,-172.5,,167.5,417.5,SBD,Yes
2,Abby Wallis,F,,23,Raw,Open,58.9,60,135,142.5,150,150,85,-90,-90,,85,160,170,-180,,170,405,SBD,Yes
3,Yana Marks,F,,18,Raw,Open,59.1,60,115,125,130,130,65,70,-72.5,,70,135,145,152.5,,152.5,352.5,SBD,Yes
4,Rebecca Barnett,F,,34,Raw,Open,59.9,60,120,127.5,-132.5,127.5,67.5,72.5,75,,75,140,147.5,-152.5,,147.5,350,SBD,Yes
5,Rosie Hunt,F,,45,Raw,Open,58.6,60,105,110,115,115,55,60,65,,65,125,135,145,,145,325,SBD,Yes
6,Kahlia Beers,F,,31,Raw,Open,59.4,60,115,-122.5,-122.5,115,-62.5,-62.5,62.5,,62.5,115,127.5,137.5,,137.5,315,SBD,Yes
7,Xi Lan,F,,34,Raw,Open,60,60,107.5,115,120,120,50,55,-57.5,,55,110,122.5,132.5,,132.5,307.5,SBD,Yes
8,Rowena Flynn,F,,46,Raw,Open,57,60,95,-100,100,100,52.5,-55,-57.5,,52.5,125,130,135,,135,287.5,SBD,Yes
9,Tegan Fisher,F,,35,Raw,Open,60,60,92.5,100,102.5,102.5,50,55,-57.5,,55,125,-135,-135,,125,282.5,SBD,Yes
1,Ali McLean,F,,25,Raw,Open,66.5,67.5,132.5,142.5,147.5,147.5,92.5,97.5,-100,,97.5,152.5,-162.5,165,,165,410,SBD,Yes
2,Cally Jennings,F,,40,Raw,Open,67.2,67.5,135,-142.5,145,145,75,80,-85,,80,150,160,167.5,,167.5,392.5,SBD,Yes
3,Lexi Samios,F,,20,Raw,Open,65.5,67.5,130,140,147.5,147.5,65,-70,72.5,,72.5,140,150,-157.5,,150,370,SBD,Yes
4,Kertu Roose,F,,27,Raw,Open,66.7,67.5,130,137.5,142.5,142.5,65,67.5,-70,,67.5,140,150,160,,160,370,SBD,Yes
5,Jasmine Tong,F,,31,Raw,Open,66.9,67.5,125,132.5,140,140,60,67.5,72.5,,72.5,150,-162.5,-165,,150,362.5,SBD,Yes
6,Nina Ding,F,,33,Raw,Open,64.8,67.5,115,125,-130,125,62.5,67.5,-70,,67.5,145,157.5,-167.5,,157.5,350,SBD,Yes
7,Krystal Healy,F,,30,Raw,Open,66.9,67.5,120,-130,-130,120,72.5,-77.5,-77.5,,72.5,145,155,-160,,155,347.5,SBD,Yes
8,Nikita Malone,F,,34,Raw,Open,66.8,67.5,110,117.5,-122.5,117.5,77.5,85,87.5,,87.5,127.5,-140,140,,140,345,SBD,Yes
9,Chauntelle Rakebrandt,F,,39,Raw,Open,64.8,67.5,105,-115,115,115,65,70,-72.5,,70,135,145,147.5,,147.5,332.5,SBD,Yes
10,Vanessa Sandoval,F,,25,Raw,Open,65.7,67.5,100,107.5,112.5,112.5,65,70,-75,,70,120,130,-137.5,,130,312.5,SBD,Yes
11,Stevie-Leigh Fuller,F,,31,Raw,Open,66.4,67.5,105,110,-115,110,-65,67.5,-70,,67.5,115,120,125,,125,302.5,SBD,Yes
12,Nikki Bates,F,,26,Raw,Open,67.5,67.5,107.5,112.5,-115,112.5,50,52.5,-55,,52.5,120,127.5,135,,135,300,SBD,Yes
13,Julie Barnett,F,,60,Raw,Open,66.6,67.5,90,100,110,110,50,55,57.5,,57.5,110,120,130,,130,297.5,SBD,Yes
14,Amee McMillan,F,,28,Raw,Open,65.3,67.5,100,107.5,112.5,112.5,52.5,57.5,-62.5,,57.5,115,122.5,-130,,122.5,292.5,SBD,Yes
15,Sue Harris,F,,57,Raw,Open,65.8,67.5,105,112.5,117.5,117.5,52.5,-57.5,-61,,52.5,115,122.5,-130,,122.5,292.5,SBD,Yes
16,Maddi Skinner,F,,25,Raw,Open,67.3,67.5,90,97.5,-100,97.5,72.5,-77.5,-77.5,,72.5,107.5,115,120,,120,290,SBD,Yes
17,Wendy Hamilton,F,,65,Raw,Open,66.4,67.5,75,82.5,86,86,47.5,52.5,55,,55,100,,,,100,241,SBD,Yes
18,Di Weick,F,,67,Raw,Open,63.9,67.5,65,70,72.5,72.5,42.5,-45,45,,45,95,105,110,,110,227.5,SBD,Yes
19,Julie Coles,F,,61,Raw,Open,66,67.5,72.5,77.5,81,81,32.5,37.5,-42.5,,37.5,92.5,102.5,-107.5,,102.5,221,SBD,Yes
DQ,Tiffany Furniss,F,,31,Raw,Open,67.3,67.5,120,125,132.5,132.5,-75,-75,-75,,,157.5,165,170,,170,,SBD,Yes
1,Paris Couzijn,F,,18,Wraps,J15-19,55.4,56,100,107.5,110,110,40,45,47.5,,47.5,120,130,140,,140,297.5,SBD,Yes
1,Claudia Shaw,F,,18,Wraps,J15-19,60,60,120,125,130,130,65,-67.5,-67.5,,65,110,-120,122.5,,122.5,317.5,SBD,Yes
1,Vicky Pollen,F,,47,Wraps,M45-49,56,56,115,125,-130,125,55,60,-62.5,,60,145,152.5,160,,160,345,SBD,Yes
1,Janine Blake,F,,66,Wraps,M65-69,54.1,56,90,100,105,105,50,55,56,,56,122.5,132.5,141,,141,302,SBD,Yes
1,Joelle Boribon,F,,28,Wraps,Open,51.2,52,75,85,90,90,52.5,55,-60,,55,115,130,140,,140,285,SBD,Yes
1,Vicky Pollen,F,,47,Wraps,Open,56,56,115,125,-130,125,55,60,-62.5,,60,145,152.5,160,,160,345,SBD,Yes
2,Lucy Smart,F,,24,Wraps,Open,55.6,56,115,122.5,130,130,65,70,72.5,,72.5,120,130,-137.5,,130,332.5,SBD,Yes
3,Janine Blake,F,,66,Wraps,Open,54.1,56,90,100,105,105,50,55,56,,56,122.5,132.5,141,,141,302,SBD,Yes
4,Paris Couzijn,F,,18,Wraps,Open,55.4,56,100,107.5,110,110,40,45,47.5,,47.5,120,130,140,,140,297.5,SBD,Yes
1,Bianca Dal Ponte,F,,24,Wraps,Open,58.1,60,105,112.5,117.5,117.5,67.5,-72.5,72.5,,72.5,135,142.5,147.5,,147.5,337.5,SBD,Yes
2,Renee Johnson,F,,24,Wraps,Open,57.1,60,115,122.5,-127.5,122.5,50,52.5,55,,55,130,140,-150,,140,317.5,SBD,Yes
3,Claudia Shaw,F,,18,Wraps,Open,60,60,120,125,130,130,65,-67.5,-67.5,,65,110,-120,122.5,,122.5,317.5,SBD,Yes
4,Louisa Della Fortuna,F,,27,Wraps,Open,60,60,100,-105,107.5,107.5,-62.5,62.5,-65,,62.5,117.5,125,132.5,,132.5,302.5,SBD,Yes
5,Kayla McLeish,F,,24,Wraps,Open,58.5,60,95,105,107.5,107.5,47.5,52.5,-55,,52.5,105,110,120,,120,280,SBD,Yes
1,Erin Saunders,F,,34,Wraps,Open,67.2,67.5,170,180,185,185,70,72.5,75,,75,165,175,-182.5,,175,435,SBD,Yes
2,Chloe Kingsford,F,,34,Wraps,Open,66.3,67.5,115,125,130,130,60,-62.5,-62.5,,60,135,145,152.5,,152.5,342.5,SBD,Yes
3,Keira Duffield,F,,19,Wraps,Open,65.6,67.5,90,100,111,111,52.5,56,60,,60,115,130,-140,,130,301,SBD,Yes
1,Rosie Hunt,F,,45,Raw,M45-49,58.6,60,,,,,55,60,65,,65,,,,,,65,B,Yes
1,Rosie Hunt,F,,45,Raw,Open,58.6,60,,,,,55,60,65,,65,,,,,,65,B,Yes
1,Wendy Hamilton,F,,65,Raw,Open,66.4,67.5,,,,,47.5,52.5,55,,55,,,,,,55,B,Yes
1,Rosie Hunt,F,,45,Raw,M45-49,58.6,60,,,,,,,,,,125,135,145,,145,145,D,Yes
1,Rosie Hunt,F,,45,Raw,Open,58.6,60,,,,,,,,,,125,135,145,,145,145,D,Yes
1,Wendy Hamilton,F,,65,Raw,Open,66.4,67.5,,,,,,,,,,100,,,,100,100,D,Yes
1,Andrew Pierides,M,,19,Raw,J15-19,66.4,67.5,185,-195,200,200,140,145,-150,,145,170,185,195,,195,540,SBD,Yes
2,Lucas Tesoriero,M,,16,Raw,J15-19,64.5,67.5,157.5,162.5,-170,162.5,87.5,-95,-95,,87.5,187.5,195,205,,205,455,SBD,Yes
1,Thomas Lane #3,M,,18,Raw,J15-19,74.9,75,-160,-170,170,170,-90,-100,100,,100,200,210,-222.5,,210,480,SBD,Yes
2,Marshall Gardner,M,,17,Raw,J15-19,70.1,75,145,155,-170,155,90,102.5,107.5,,107.5,180,195,210,,210,472.5,SBD,Yes
3,Joshua Campbell,M,,19,Raw,J15-19,68.7,75,140,-150,150,150,90,-100,-100,,90,170,190,-200,,190,430,SBD,Yes
1,Kade Silverthorne,M,,19,Raw,J15-19,81.7,82.5,215,225,235,235,125,132.5,-140,,132.5,250,262.5,275,,275,642.5,SBD,Yes
1,Burt Samson,M,,20,Raw,J20-23,55.8,56,155,165,-175,165,80,85,-90,,85,160,170,180,,180,430,SBD,Yes
1,Jaiden Priestly,M,,22,Raw,J20-23,74,75,185,200,-205,200,130,135,140,,140,200,220,230,,230,570,SBD,Yes
2,Jack Tocknell,M,,20,Raw,J20-23,71.8,75,180,192.5,-200,192.5,110,-120,120,,120,230,245,-250,,245,557.5,SBD,Yes
3,William Scheiwe,M,,22,Raw,J20-23,74.6,75,175,185,-195,185,97.5,105,-110,,105,195,210,-220,,210,500,SBD,Yes
1,Tim McGill,M,,21,Raw,J20-23,81.4,82.5,-210,210,217.5,217.5,122.5,127.5,132.5,,132.5,225,235,-240,,235,585,SBD,Yes
1,Ben Lawler,M,,48,Raw,M45-49,81.9,82.5,182.5,192.5,200,200,95,100,105,,105,205,220,230,,230,535,SBD,Yes
1,Burt Samson,M,,20,Raw,Open,55.8,56,155,165,-175,165,80,85,-90,,85,160,170,180,,180,430,SBD,Yes
1,Damien Callaghan,M,,38,Raw,Open,59.4,60,100,110,-117.5,110,100,107.5,-110.5,,107.5,145,162.5,172.5,,172.5,390,SBD,Yes
1,Andrew Pierides,M,,19,Raw,Open,66.4,67.5,185,-195,200,200,140,145,-150,,145,170,185,195,,195,540,SBD,Yes
2,Lucas Tesoriero,M,,16,Raw,Open,64.5,67.5,157.5,162.5,-170,162.5,87.5,-95,-95,,87.5,187.5,195,205,,205,455,SBD,Yes
3,Rem Abed-Rabbo,M,,38,Raw,Open,65.5,67.5,115,125,-130,125,60,62.5,65,,65,145,155,165,,165,355,SBD,Yes
1,Jaiden Priestly,M,,22,Raw,Open,74,75,185,200,-205,200,130,135,140,,140,200,220,230,,230,570,SBD,Yes
2,Ty Dansie,M,,36,Raw,Open,73.9,75,-180,187.5,-192.5,187.5,117.5,125,-130,,125,232.5,245,255,,255,567.5,SBD,Yes
3,Jack Tocknell,M,,20,Raw,Open,71.8,75,180,192.5,-200,192.5,110,-120,120,,120,230,245,-250,,245,557.5,SBD,Yes
4,William Scheiwe,M,,22,Raw,Open,74.6,75,175,185,-195,185,97.5,105,-110,,105,195,210,-220,,210,500,SBD,Yes
5,Thomas Lane #3,M,,18,Raw,Open,74.9,75,-160,-170,170,170,-90,-100,100,,100,200,210,-222.5,,210,480,SBD,Yes
6,Marshall Gardner,M,,17,Raw,Open,70.1,75,145,155,-170,155,90,102.5,107.5,,107.5,180,195,210,,210,472.5,SBD,Yes
7,Joshua Campbell,M,,19,Raw,Open,68.7,75,140,-150,150,150,90,-100,-100,,90,170,190,-200,,190,430,SBD,Yes
1,Harry Perrin,M,,27,Raw,Open,81.9,82.5,235,-245,-245,235,155,165,-166,,165,235,245,-262.5,,245,645,SBD,Yes
2,Kade Silverthorne,M,,19,Raw,Open,81.7,82.5,215,225,235,235,125,132.5,-140,,132.5,250,262.5,275,,275,642.5,SBD,Yes
3,Tyler Pittaway,M,,24,Raw,Open,81.2,82.5,220,-230,-230,220,140,150,-155,,150,230,245,-255,,245,615,SBD,Yes
4,Matthew Chapman #3,M,,30,Raw,Open,82.3,82.5,195,207.5,212.5,212.5,125,135,-137.5,,135,230,245,-252.5,,245,592.5,SBD,Yes
5,Tim McGill,M,,21,Raw,Open,81.4,82.5,-210,210,217.5,217.5,122.5,127.5,132.5,,132.5,225,235,-240,,235,585,SBD,Yes
6,Jesse Stewart,M,,33,Raw,Open,81.9,82.5,195,202.5,210,210,127.5,135,-140,,135,212.5,227.5,235,,235,580,SBD,Yes
7,Francis Tungcol,M,,29,Raw,Open,81.5,82.5,180,200,210,210,102.5,110,-115,,110,220,-237.5,245,,245,565,SBD,Yes
8,Ben Lawler,M,,48,Raw,Open,81.9,82.5,182.5,192.5,200,200,95,100,105,,105,205,220,230,,230,535,SBD,Yes
9,Sean Raso,M,,32,Raw,Open,80.7,82.5,170,185,200,200,110,122.5,-132.5,,122.5,180,200,-207.5,,200,522.5,SBD,Yes
1,Seth Elderfield,M,,17,Wraps,J15-19,78.7,82.5,185,195,-200,195,107.5,115,117.5,,117.5,195,210,-215,,210,522.5,SBD,Yes
1,Jacob Tapp,M,,22,Wraps,J20-23,78.2,82.5,240,252.5,260,260,145,152.5,-160,,152.5,250,262.5,-270,,262.5,675,SBD,Yes
1,Nouri Groom,M,,40,Wraps,M40-44,81.9,82.5,220,240,-250,240,155,165,-170,,165,220,240,262.5,,262.5,667.5,SBD,Yes
1,Jagdish Chauhan,M,,54,Wraps,M50-54,66.4,67.5,170,172.5,-185,172.5,75,-80,80,,80,185,195,-200,,195,447.5,SBD,Yes
1,Jagdish Chauhan,M,,54,Wraps,Open,66.4,67.5,170,172.5,-185,172.5,75,-80,80,,80,185,195,-200,,195,447.5,SBD,Yes
1,Cooper Stothard,M,,24,Wraps,Open,74.6,75,195,205,212.5,212.5,125,130,-135,,130,220,230,240,,240,582.5,SBD,Yes
2,Nathan Boys,M,,33,Wraps,Open,74.3,75,-185,-195,195,195,105,112.5,-117.5,,112.5,195,205,210,,210,517.5,SBD,Yes
1,Ben Sellars,M,,37,Wraps,Open,81.7,82.5,250,270,275,275,160,165,-167.5,,165,250,265,-275,,265,705,SBD,Yes
2,Jacob Tapp,M,,22,Wraps,Open,78.2,82.5,240,252.5,260,260,145,152.5,-160,,152.5,250,262.5,-270,,262.5,675,SBD,Yes
3,Adam Warnock,M,,35,Wraps,Open,80.7,82.5,240,255,-265,255,127.5,135,-140,,135,260,275,282.5,,282.5,672.5,SBD,Yes
4,Nouri Groom,M,,40,Wraps,Open,81.9,82.5,220,240,-250,240,155,165,-170,,165,220,240,262.5,,262.5,667.5,SBD,Yes
5,Marco Llamas,M,,31,Wraps,Open,82.5,82.5,232.5,242.5,250,250,140,147.5,-152.5,,147.5,235,-250,-250,,235,632.5,SBD,Yes
6,Grant McVey,M,,31,Wraps,Open,82.2,82.5,212.5,222.5,-235,222.5,140,145,-147.5,,145,215,225,232.5,,232.5,600,SBD,Yes
7,Seth Elderfield,M,,17,Wraps,Open,78.7,82.5,185,195,-200,195,107.5,115,117.5,,117.5,195,210,-215,,210,522.5,SBD,Yes
1,Michael Jones #2,M,,26,Raw,Open,77.3,82.5,,,,,137.5,-145,147.5,,147.5,,,,,,147.5,B,Yes
1,Ben Lawler,M,,48,Raw,M45-49,81.9,82.5,,,,,,,,,,205,220,230,,230,230,D,Yes
1,Ben Lawler,M,,48,Raw,Open,81.9,82.5,,,,,,,,,,205,220,230,,230,230,D,Yes
1,Anna Goodman,F,,21,Raw,J20-23,80.7,82.5,117.5,-125,125,125,45,50,55,,55,150,160,170,,170,350,SBD,Yes
1,Joanne Forden,F,,41,Raw,M40-44,78.8,82.5,150,160,-170,160,97.5,102.5,-105,,102.5,155,162.5,-170,,162.5,425,SBD,Yes
2,Sally McBrydie,F,,40,Raw,M40-44,81.3,82.5,125,130,135,135,65,-70,-70,,65,155,160,167.5,,167.5,367.5,SBD,Yes
1,Tasha Page,F,,51,Raw,M50-54,81.5,82.5,115,125,135,135,70,75,-80,,75,160,175,-185,,175,385,SBD,Yes
2,Megan Browne,F,,50,Raw,M50-54,80,82.5,102.5,107.5,110,110,52.5,-57.5,-57.5,,52.5,142.5,-150,-150,,142.5,305,SBD,Yes
1,Joanne Forden,F,,41,Raw,Open,78.8,82.5,150,160,-170,160,97.5,102.5,-105,,102.5,155,162.5,-170,,162.5,425,SBD,Yes
2,Stephanie Catalucci,F,,35,Raw,Open,81.6,82.5,125,132.5,140,140,67.5,72.5,75,,75,162.5,175,185,,185,400,SBD,Yes
3,Tasha Page,F,,51,Raw,Open,81.5,82.5,115,125,135,135,70,75,-80,,75,160,175,-185,,175,385,SBD,Yes
4,Sally McBrydie,F,,40,Raw,Open,81.3,82.5,125,130,135,135,65,-70,-70,,65,155,160,167.5,,167.5,367.5,SBD,Yes
5,Leila Warnes,F,,26,Raw,Open,78.9,82.5,110,120,125,125,65,70,75,,75,140,150,155,,155,355,SBD,Yes
6,Sarah Brown #6,F,,31,Raw,Open,80.4,82.5,120,125,127.5,127.5,70,77.5,-80,,77.5,135,140,145,,145,350,SBD,Yes
7,Anna Goodman,F,,21,Raw,Open,80.7,82.5,117.5,-125,125,125,45,50,55,,55,150,160,170,,170,350,SBD,Yes
8,Maggie Lilburne,F,,24,Raw,Open,82.1,82.5,115,120,130,130,60,62.5,67.5,,67.5,135,145,152.5,,152.5,350,SBD,Yes
9,Megan Browne,F,,50,Raw,Open,80,82.5,102.5,107.5,110,110,52.5,-57.5,-57.5,,52.5,142.5,-150,-150,,142.5,305,SBD,Yes
1,Simone Von Zum Hof,F,,23,Wraps,J20-23,81,82.5,135,145,150,150,65,-70,-70,,65,162.5,172.5,-177.5,,172.5,387.5,SBD,Yes
1,Lee Musgrave,F,,34,Wraps,Open,82.3,82.5,165,175,-185,175,80,85,,,85,175,190,-200,,190,450,SBD,Yes
2,Felicity McCann,F,,35,Wraps,Open,79,82.5,140,145,150,150,77.5,82.5,-85,,82.5,185,200,-205,,200,432.5,SBD,Yes
3,Stevie Templer-Long,F,,34,Wraps,Open,80.2,82.5,145,157.5,-160,157.5,72.5,77.5,-80,,77.5,150,160,165,,165,400,SBD,Yes
4,Simone Von Zum Hof,F,,23,Wraps,Open,81,82.5,135,145,150,150,65,-70,-70,,65,162.5,172.5,-177.5,,172.5,387.5,SBD,Yes
5,Kathy Grant,F,,37,Wraps,Open,77.8,82.5,117.5,-125,125,125,57.5,62.5,65,,65,145,155,162.5,,162.5,352.5,SBD,Yes
1,Felicity McCann,F,,35,Raw,Open,79,82.5,,,,,,,,,,185,200,-205,,200,200,D,Yes
1,Jackson Reimers,M,,19,Raw,J15-19,88.4,90,205,220,-230,220,120,125,-127.5,,125,225,240,255,,255,600,SBD,Yes
2,Alex Lara,M,,17,Raw,J15-19,90,90,205,212.5,-217.5,212.5,120,125,-130,,125,190,200,,,200,537.5,SBD,Yes
1,Aidan Clark,M,,20,Raw,J20-23,89.7,90,235,250,262.5,262.5,127.5,132.5,-137.5,,132.5,245,260,-271,,260,655,SBD,Yes
2,Aidan Roache,M,,21,Raw,J20-23,89.9,90,220,232.5,-237.5,232.5,130,137.5,145,,145,230,245,255,,255,632.5,SBD,Yes
3,Jonathan McAllister,M,,20,Raw,J20-23,87,90,210,-220,220,220,-110,115,120,,120,270,285,-295,,285,625,SBD,Yes
4,Tyson Keating,M,,23,Raw,J20-23,86.2,90,200,215,225,225,125,-135,135,,135,220,235,250,,250,610,SBD,Yes
5,Riley Allsop,M,,20,Raw,J20-23,89.9,90,205,215,-225,215,-125,130,-135,,130,235,245,-255,,245,590,SBD,Yes
6,Thomas Armstrong,M,,23,Raw,J20-23,89.1,90,195,210,-217.5,210,115,120,125,,125,210,-230,230,,230,565,SBD,Yes
1,David Wynn,M,,42,Raw,M40-44,89.2,90,200,215,-220,215,100,107.5,-110,,107.5,240,-255,-255,,240,562.5,SBD,Yes
1,Joey Hizon,M,,45,Raw,M45-49,87.6,90,190,200,-206,200,122.5,130,-132.5,,130,205,220,-230,,220,550,SBD,Yes
1,Romano Gaspardis,M,,64,Raw,M60-64,85.9,90,155,165,172.5,172.5,82.5,85,90,,90,200,212.5,-220,,212.5,475,SBD,Yes
1,Liam Belcher,M,,33,Raw,Open,89.5,90,260,280,-287.5,280,-155,165,175,,175,275,-300,-300,,275,730,SBD,Yes
2,Dean Pagulayan,M,,26,Raw,Open,83.7,90,235,250,-255,250,135,-145,-145,,135,290,-312.5,-315,,290,675,SBD,Yes
3,Aidan Clark,M,,20,Raw,Open,89.7,90,235,250,262.5,262.5,127.5,132.5,-137.5,,132.5,245,260,-271,,260,655,SBD,Yes
4,Joseph Lu #1,M,,30,Raw,Open,85.2,90,210,220,230,230,135,-145,-145,,135,255,270,280,,280,645,SBD,Yes
5,Rohan Rampton,M,,26,Raw,Open,87,90,205,220,230,230,127.5,-137.5,140,,140,240,255,265,,265,635,SBD,Yes
6,Aidan Roache,M,,21,Raw,Open,89.9,90,220,232.5,-237.5,232.5,130,137.5,145,,145,230,245,255,,255,632.5,SBD,Yes
7,Andrew Cherry,M,,34,Raw,Open,85.8,90,230,240,-247.5,240,127.5,130,-135,,130,237.5,252.5,260,,260,630,SBD,Yes
8,Jonathan McAllister,M,,20,Raw,Open,87,90,210,-220,220,220,-110,115,120,,120,270,285,-295,,285,625,SBD,Yes
9,Lachlan Rampton,M,,26,Raw,Open,87.5,90,200,217.5,230,230,127.5,137.5,145,,145,200,220,240,,240,615,SBD,Yes
10,Tyson Keating,M,,23,Raw,Open,86.2,90,200,215,225,225,125,-135,135,,135,220,235,250,,250,610,SBD,Yes
11,Jackson Reimers,M,,19,Raw,Open,88.4,90,205,220,-230,220,120,125,-127.5,,125,225,240,255,,255,600,SBD,Yes
12,Travis Castagna,M,,32,Raw,Open,88.7,90,200,217.5,230,230,-120,125,-127.5,,125,230,245,-255,,245,600,SBD,Yes
13,Jeremy Pearce,M,,25,Raw,Open,83.9,90,202.5,-217.5,227.5,227.5,122.5,130,-135,,130,210,225,240,,240,597.5,SBD,Yes
14,Nathan Ham,M,,30,Raw,Open,88.9,90,212.5,227.5,232.5,232.5,115,120,-125,,120,230,245,-252.5,,245,597.5,SBD,Yes
15,Riley Allsop,M,,20,Raw,Open,89.9,90,205,215,-225,215,-125,130,-135,,130,235,245,-255,,245,590,SBD,Yes
16,Thomas Armstrong,M,,23,Raw,Open,89.1,90,195,210,-217.5,210,115,120,125,,125,210,-230,230,,230,565,SBD,Yes
17,David Wynn,M,,42,Raw,Open,89.2,90,200,215,-220,215,100,107.5,-110,,107.5,240,-255,-255,,240,562.5,SBD,Yes
18,Joey Hizon,M,,45,Raw,Open,87.6,90,190,200,-206,200,122.5,130,-132.5,,130,205,220,-230,,220,550,SBD,Yes
19,Alex Lara,M,,17,Raw,Open,90,90,205,212.5,-217.5,212.5,120,125,-130,,125,190,200,,,200,537.5,SBD,Yes
20,Romano Gaspardis,M,,64,Raw,Open,85.9,90,155,165,172.5,172.5,82.5,85,90,,90,200,212.5,-220,,212.5,475,SBD,Yes
1,Max Peters,M,,18,Wraps,J15-19,85.3,90,195,-210,-210,195,125,130,-135,,130,225,237.5,-245,,237.5,562.5,SBD,Yes
1,Tuvaru Toki,M,,23,Wraps,J20-23,89.2,90,235,250,260,260,155,163,-167.5,,163,245,260,270,,270,693,SBD,Yes
1,Matthew Rodwell,M,,24,Wraps,Open,87.3,90,265,280,-292.5,280,165,172.5,175,,175,270,287.5,-292.5,,287.5,742.5,SBD,Yes
2,Tuvaru Toki,M,,23,Wraps,Open,89.2,90,235,250,260,260,155,163,-167.5,,163,245,260,270,,270,693,SBD,Yes
3,Andrew Olm,M,,35,Wraps,Open,89.8,90,255,-265,-267.5,255,165,-170,-170,,165,235,245,-252.5,,245,665,SBD,Yes
4,Denis Sovacki,M,,29,Wraps,Open,89.4,90,240,255,-260,255,120,125,130,,130,250,260,-277.5,,260,645,SBD,Yes
5,David Rumsley,M,,32,Wraps,Open,88.6,90,210,222.5,232.5,232.5,105,115,117.5,,117.5,237.5,250,255,,255,605,SBD,Yes
6,Max Peters,M,,18,Wraps,Open,85.3,90,195,-210,-210,195,125,130,-135,,130,225,237.5,-245,,237.5,562.5,SBD,Yes
DQ,Simon Higham,M,,29,Wraps,Open,89.8,90,220,-230,-230,220,-150,,,,,,,,,,,SBD,Yes
1,David Wynn,M,,42,Raw,M40-44,89.2,90,,,,,,,,,,240,-255,-255,,240,240,D,Yes
1,David Wynn,M,,42,Raw,Open,89.2,90,,,,,,,,,,240,-255,-255,,240,240,D,Yes
1,Isobel McLeod,F,,17,Raw,J15-19,70.5,75,97.5,105,-110,105,55,-60,-60,,55,110,117.5,125,,125,285,SBD,Yes
1,Lucy Gray,F,,22,Raw,J20-23,74,75,135,147.5,150,150,70,-75,75,,75,150,162.5,170,,170,395,SBD,Yes
2,Jeanette Genis,F,,23,Raw,J20-23,75,75,115,127.5,132.5,132.5,90,-97.5,100,,100,145,155,162.5,,162.5,395,SBD,Yes
3,Zari Mynard,F,,21,Raw,J20-23,72.1,75,132.5,140,150,150,67.5,70,72.5,,72.5,130,140,150,,150,372.5,SBD,Yes
4,Emily Brabazon,F,,22,Raw,J20-23,70.9,75,125,130,135,135,67.5,-72.5,-72.5,,67.5,130,142.5,150,,150,352.5,SBD,Yes
5,Ashleigh Heath,F,,22,Raw,J20-23,72.1,75,110,120,125,125,60,67.5,-70,,67.5,122.5,135,-142.5,,135,327.5,SBD,Yes
1,Kylie Noonan,F,,46,Raw,M45-49,70.2,75,110,115,117.5,117.5,55,60,-65,,60,-145,145,152.5,,152.5,330,SBD,Yes
1,Bethany Glenn,F,,24,Raw,Open,68.5,75,135,145,152.5,152.5,-80,82.5,-85,,82.5,152.5,162.5,165,,165,400,SBD,Yes
2,Amy Clair,F,,35,Raw,Open,73.5,75,120,135,-142.5,135,80,90,-92.5,,90,135,152.5,167.5,,167.5,392.5,SBD,Yes
3,Sapphire Vaega,F,,33,Raw,Open,73.1,75,122.5,132.5,-137.5,132.5,75,-80,80,,80,167.5,177.5,-187.5,,177.5,390,SBD,Yes
4,Erica Bocchino,F,,28,Raw,Open,73.3,75,120,127.5,132.5,132.5,72.5,77.5,80,,80,150,162.5,170,,170,382.5,SBD,Yes
5,Kelly Batterham,F,,24,Raw,Open,72.1,75,120,130,135,135,65,70,72.5,,72.5,145,160,172.5,,172.5,380,SBD,Yes
6,Trixie Maddick,F,,30,Raw,Open,73.4,75,125,135,140,140,65,67.5,70,,70,135,145,150,,150,360,SBD,Yes
7,Sophia Fisher,F,,36,Raw,Open,68.1,75,115,120,125,125,70,75,-80,,75,150,157.5,-160,,157.5,357.5,SBD,Yes
1,Erica Patane,F,,22,Wraps,J20-23,72.6,75,110,120,-127.5,120,65,70,-77.5,,70,120,140,-145,,140,330,SBD,Yes
1,Sharee Eugster,F,,40,Wraps,M40-44,72,75,147.5,-157.5,-157.5,147.5,87.5,90,-92.5,,90,150,-160,160,,160,397.5,SBD,Yes
2,Mel Newton,F,,43,Wraps,M40-44,73.3,75,112.5,117.5,122.5,122.5,57.5,60,-62.5,,60,145,152.5,157.5,,157.5,340,SBD,Yes
1,Yolanda Fourie,F,,49,Wraps,M45-49,73.9,75,115,125,-135,125,65,67.5,-70,,67.5,140,150,-157.5,,150,342.5,SBD,Yes
1,Billie-Jane Frost,F,,28,Wraps,Open,73.6,75,167.5,180,-185,180,72.5,-77.5,-77.5,,72.5,150,162.5,-165,,162.5,415,SBD,Yes
2,Brittany Williams,F,,31,Wraps,Open,74.7,75,152.5,165,-170,165,72.5,-77.5,-77.5,,72.5,150,157.5,162.5,,162.5,400,SBD,Yes
3,Laura McLennan,F,,24,Wraps,Open,72.7,75,145,-157.5,-157.5,145,-72.5,72.5,-75,,72.5,-145,150,157.5,,157.5,375,SBD,Yes
DQ,Justine Baxter,F,,36,Wraps,Open,72.6,75,-210,-220,-220,,-90,90,-97.5,,90,195,205,210,,210,,SBD,Yes
1,Shanae Spry,F,,23,Single-ply,J20-23,68.7,75,135,145,152.5,152.5,75,80,82.5,,82.5,115,125,135,,135,370,SBD,Yes
1,Jamie-Lee Griffiths,F,,23,Raw,J20-23,74.3,75,,,,,75,80,82.5,,82.5,,,,,,82.5,B,Yes
1,Andrew Johnson #15,M,,23,Raw,J20-23,99.2,100,255,270,275,275,170,180,,,180,240,250,-260,,250,705,SBD,Yes
2,Nick Whiteside,M,,23,Raw,J20-23,96.7,100,230,240,-247.5,240,142.5,150,-155,,150,280,300,-310,,300,690,SBD,Yes
3,Aaron Urbani,M,,22,Raw,J20-23,92.4,100,230,245,260,260,150,160,165,,165,235,245,255,,255,680,SBD,Yes
4,Zachary Sultana,M,,22,Raw,J20-23,93.3,100,195,210,217.5,217.5,130,140,-145,,140,240,260,267.5,,267.5,625,SBD,Yes
5,Zayne Jensen,M,,20,Raw,J20-23,98,100,200,210,-220,210,115,125,130,,130,220,240,260,,260,600,SBD,Yes
DQ,Callum Maclean,M,,21,Raw,J20-23,97.1,100,195,210,-220,210,,,,,,,,,,,,SBD,Yes
1,Alan Muston,M,,67,Raw,M65-69,97.4,100,190,197.5,202.5,202.5,117.5,-122.5,122.5,,122.5,230,245,252.5,,252.5,577.5,SBD,Yes
1,Cale Rowston,M,,32,Raw,Open,99.3,100,245,265,-275,265,170,-180,180,,180,300,325,-340,,325,770,SBD,Yes
2,Chris Thomas,M,,32,Raw,Open,97.4,100,230,250,260,260,155,165,170,,170,280,310,320,,320,750,SBD,Yes
3,Tom Hill,M,,26,Raw,Open,99.5,100,225,245,260,260,140,150,155,,155,270,287.5,295,,295,710,SBD,Yes
4,Dalton Pike,M,,30,Raw,Open,98.9,100,230,240,252.5,252.5,160,165,172.5,,172.5,245,260,270,,270,695,SBD,Yes
5,Stefan Chinotto,M,,31,Raw,Open,99,100,240,260,-272.5,260,152.5,157.5,-162.5,,157.5,240,260,277.5,,277.5,695,SBD,Yes
6,Ben Nolan,M,,38,Raw,Open,98.5,100,220,240,250,250,150,160,-170,,160,240,260,275,,275,685,SBD,Yes
7,Josh Brown #13,M,,25,Raw,Open,98,100,225,240,245,245,130,140,-150,,140,260,275,280,,280,665,SBD,Yes
8,Gabriel Lattouf,M,,30,Raw,Open,99.1,100,212.5,222.5,232.5,232.5,135,140,-145,,140,270,-285,-285,,270,642.5,SBD,Yes
9,Harrison Mayall,M,,24,Raw,Open,97.9,100,205,220,227.5,227.5,130,140,-145,,140,225,235,-245,,235,602.5,SBD,Yes
1,Conor Reilly,M,,29,Wraps,Open,98.4,100,270,285,-300,285,145,155,165,,165,270,285,-295,,285,735,SBD,Yes
2,Yasar Chowdhury,M,,29,Wraps,Open,97.9,100,240,250,-255,250,127.5,132.5,135,,135,255,-262.5,262.5,,262.5,647.5,SBD,Yes
3,Travis Reid,M,,24,Wraps,Open,97.7,100,220,230,235,235,130,-135,-135,,130,240,260,-270,,260,625,SBD,Yes
1,Dalton Pike,M,,30,Raw,Open,98.9,100,,,,,160,165,172.5,,172.5,245,260,270,,270,442.5,BD,Yes
1,Andrew Johnson #15,M,,23,Raw,J20-23,99.2,100,,,,,170,180,,,180,,,,,,180,B,Yes
1,Colin Mynard,M,,51,Raw,M50-54,98.9,100,,,,,152.5,160,-162.5,,160,,,,,,160,B,Yes
1,Andrew Johnson #15,M,,23,Raw,J20-23,99.2,100,,,,,,,,,,240,250,-260,,250,250,D,Yes
1,Corinne Kennedy,F,,23,Raw,J20-23,87.9,90,145,157.5,165,165,72.5,-77.5,-77.5,,72.5,155,165,-177.5,,165,402.5,SBD,Yes
2,Jessica Hall,F,,20,Raw,J20-23,84.3,90,110,120,-130,120,65,70,72.5,,72.5,165,175,-185,,175,367.5,SBD,Yes
1,Jane Millers,F,,49,Raw,M45-49,85.9,90,125,130,-135,130,50,55,-60,,55,125,130,140,,140,325,SBD,Yes
1,Pat O'Connell,F,,55,Raw,M55-59,87.2,90,105,112.5,-118,112.5,50,52.5,-55,,52.5,140,152.5,-160,,152.5,317.5,SBD,Yes
2,Jayne Coppins,F,,58,Raw,M55-59,88.3,90,85,95,102.5,102.5,45,50,-55,,50,120,130,-142.5,,130,282.5,SBD,Yes
1,Margaret Pukallus,F,,72,Raw,M70-74,89.9,90,90,95,100,100,37.5,40,42.5,,42.5,115,125,130.5,,130.5,273,SBD,Yes
1,Romina Poluschkin,F,,26,Raw,Open,89.7,90,157.5,162.5,167.5,167.5,85,-87.5,-87.5,,85,172.5,177.5,-182.5,,177.5,430,SBD,Yes
2,Megan Surkitt,F,,28,Raw,Open,89.6,90,140,150,160,160,67.5,72.5,-77.5,,72.5,170,180,190,,190,422.5,SBD,Yes
3,Corinne Kennedy,F,,23,Raw,Open,87.9,90,145,157.5,165,165,72.5,-77.5,-77.5,,72.5,155,165,-177.5,,165,402.5,SBD,Yes
4,Laura Jones #1,F,,36,Raw,Open,84.2,90,130,137.5,145,145,75,80,-82.5,,80,160,172.5,-177.5,,172.5,397.5,SBD,Yes
5,Isabella Caddy,F,,25,Raw,Open,87.4,90,135,142.5,147.5,147.5,65,-70,-70,,65,165,172.5,-182.5,,172.5,385,SBD,Yes
6,Jessica Hall,F,,20,Raw,Open,84.3,90,110,120,-130,120,65,70,72.5,,72.5,165,175,-185,,175,367.5,SBD,Yes
7,Lee Thompson,F,,34,Raw,Open,88.4,90,125,135,142.5,142.5,65,67.5,-70,,67.5,140,155,-160,,155,365,SBD,Yes
8,Dennise Bacolas,F,,24,Raw,Open,90,90,110,120,130,130,57.5,62.5,67.5,,67.5,125,135,142.5,,142.5,340,SBD,Yes
9,Jane Millers,F,,49,Raw,Open,85.9,90,125,130,-135,130,50,55,-60,,55,125,130,140,,140,325,SBD,Yes
10,Pat O'Connell,F,,55,Raw,Open,87.2,90,105,112.5,-118,112.5,50,52.5,-55,,52.5,140,152.5,-160,,152.5,317.5,SBD,Yes
11,Jayne Coppins,F,,58,Raw,Open,88.3,90,85,95,102.5,102.5,45,50,-55,,50,120,130,-142.5,,130,282.5,SBD,Yes
12,Margaret Pukallus,F,,72,Raw,Open,89.9,90,90,95,100,100,37.5,40,42.5,,42.5,115,125,130.5,,130.5,273,SBD,Yes
1,Taylah Robinson,F,,27,Raw,Open,95,100,172.5,182.5,187.5,187.5,87.5,92.5,95,,95,205,220,-227.5,,220,502.5,SBD,Yes
2,Deyana Stuebner,F,,32,Raw,Open,91.7,100,140,150,160,160,80,-85,-85,,80,170,180,-190,190,180,420,SBD,Yes
3,Casey Hornby,F,,31,Raw,Open,97.3,100,140,152.5,-157.5,152.5,80,87.5,-90,,87.5,155,-170,170,,170,410,SBD,Yes
1,Rebecca Hill,F,,48,Wraps,M45-49,89.9,90,140,147.5,155,155,67.5,72.5,75,,75,140,147.5,152.5,,152.5,382.5,SBD,Yes
1,Vanessa Wadsworth,F,,55,Wraps,M55-59,97.8,100,105,110,-117.5,110,55,60,65,,65,130,140,150,,150,325,SBD,Yes
1,Rebecca Hill,F,,48,Wraps,Open,89.9,90,140,147.5,155,155,67.5,72.5,75,,75,140,147.5,152.5,,152.5,382.5,SBD,Yes
2,Katie Beuers,F,,28,Wraps,Open,88.9,90,135,-145,-145,135,-67.5,-72.5,72.5,,72.5,125,137.5,145,,145,352.5,SBD,Yes
1,Claire Packer,F,,36,Wraps,Open,97.5,100,-150,150,170,170,82.5,-90,90,,90,160,175,-182.5,,175,435,SBD,Yes
2,Vanessa Wadsworth,F,,55,Wraps,Open,97.8,100,105,110,-117.5,110,55,60,65,,65,130,140,150,,150,325,SBD,Yes
1,Corinne Kennedy,F,,23,Raw,J20-23,87.9,90,,,,,72.5,-77.5,-77.5,,72.5,,,,,,72.5,B,Yes
1,Corinne Kennedy,F,,23,Raw,Open,87.9,90,,,,,72.5,-77.5,-77.5,,72.5,,,,,,72.5,B,Yes
1,Nicky Burns,F,,45,Single-ply,M45-49,90,90,,,,,92.5,-97.5,-97.5,,92.5,,,,,,92.5,B,Yes
1,Nicky Burns,F,,45,Single-ply,Open,90,90,,,,,92.5,-97.5,-97.5,,92.5,,,,,,92.5,B,Yes
1,Corinne Kennedy,F,,23,Raw,J20-23,87.9,90,,,,,,,,,,155,165,-177.5,,165,165,D,Yes
1,Corinne Kennedy,F,,23,Raw,Open,87.9,90,,,,,,,,,,155,165,-177.5,,165,165,D,Yes
1,Vanessa Wadsworth,F,,55,Raw,M55-59,97.8,100,,,,,,,,,,130,140,150,,150,150,D,Yes
1,Vanessa Wadsworth,F,,55,Raw,Open,97.8,100,,,,,,,,,,130,140,150,,150,150,D,Yes
1,James Forrest,M,,18,Raw,J15-19,107.8,110,210,222.5,232.5,232.5,140,147.5,150,,150,250,261,-275,,261,643.5,SBD,Yes
2,Haydar Ali,M,,18,Raw,J15-19,107.8,110,210,225,235,235,150,160,-167.5,,160,225,-235,-240,,225,620,SBD,Yes
1,Tomas Wright,M,,23,Raw,J20-23,109.7,110,210,225,235,235,140,150,-155,,150,215,230,250,,250,635,SBD,Yes
2,Cooper Morgan,M,,23,Raw,J20-23,108.9,110,200,212.5,220,220,145,152.5,,,152.5,240,260,-270,,260,632.5,SBD,Yes
3,Jayden Rees,M,,23,Raw,J20-23,102.2,110,210,220,227.5,227.5,127.5,-135,135,,135,240,247.5,255,,255,617.5,SBD,Yes
4,Fletcher Meachem,M,,21,Raw,J20-23,106.7,110,-205,212.5,215,215,130,135,140,,140,160,170,175,,175,530,SBD,Yes
1,Peter Kelly,M,,43,Raw,M40-44,108.3,110,220,-232.5,232.5,232.5,130,135,-140,,135,275,292.5,,,292.5,660,SBD,Yes
1,Steve Zeiger,M,,60,Raw,M60-64,107,110,170,185,195,195,-115,122.5,-130,,122.5,195,210,-220,,210,527.5,SBD,Yes
1,Nicholai Cushing,M,,29,Raw,Open,109,110,270,280,285,285,170,180,185,,185,-330,330,-375,,330,800,SBD,Yes
2,Caleb Leupolu,M,,24,Raw,Open,107.4,110,245,260,272.5,272.5,172.5,182.5,-190,,182.5,285,295,-302.5,,295,750,SBD,Yes
3,Daniel Spence,M,,24,Raw,Open,110,110,235,252.5,265,265,152.5,160,165,,165,262.5,282.5,-290,,282.5,712.5,SBD,Yes
4,Brett Jaffrey,M,,39,Raw,Open,108.1,110,230,240,-247.5,240,150,160,165,,165,270,290,300,,300,705,SBD,Yes
5,Reece McLaughlin,M,,32,Raw,Open,107.6,110,255,270,280,280,145,155,-162.5,,155,230,245,260,,260,695,SBD,Yes
6,Ash Walshe,M,,32,Raw,Open,108.8,110,235,250,,250,155,-170,-170,,155,275,-285,285,,285,690,SBD,Yes
7,Peter Kelly,M,,43,Raw,Open,108.3,110,220,-232.5,232.5,232.5,130,135,-140,,135,275,292.5,,,292.5,660,SBD,Yes
8,Angus Roxborough,M,,26,Raw,Open,105,110,220,232.5,242.5,242.5,150,160,167.5,,167.5,230,247.5,-260,,247.5,657.5,SBD,Yes
9,James Forrest,M,,18,Raw,Open,107.8,110,210,222.5,232.5,232.5,140,147.5,150,,150,250,261,-275,,261,643.5,SBD,Yes
10,Michael Bull,M,,31,Raw,Open,106.6,110,205,-215,215,215,130,137.5,-142.5,,137.5,260,277.5,285,,285,637.5,SBD,Yes
11,Tomas Wright,M,,23,Raw,Open,109.7,110,210,225,235,235,140,150,-155,,150,215,230,250,,250,635,SBD,Yes
12,Cooper Morgan,M,,23,Raw,Open,108.9,110,200,212.5,220,220,145,152.5,,,152.5,240,260,-270,,260,632.5,SBD,Yes
13,Haydar Ali,M,,18,Raw,Open,107.8,110,210,225,235,235,150,160,-167.5,,160,225,-235,-240,,225,620,SBD,Yes
14,Jayden Rees,M,,23,Raw,Open,102.2,110,210,220,227.5,227.5,127.5,-135,135,,135,240,247.5,255,,255,617.5,SBD,Yes
15,Joshua Armstrong,M,,26,Raw,Open,109.4,110,195,210,217.5,217.5,-115,115,-120,,115,235,255,267.5,,267.5,600,SBD,Yes
16,Fletcher Meachem,M,,21,Raw,Open,106.7,110,-205,212.5,215,215,130,135,140,,140,160,170,175,,175,530,SBD,Yes
17,Steve Zeiger,M,,60,Raw,Open,107,110,170,185,195,195,-115,122.5,-130,,122.5,195,210,-220,,210,527.5,SBD,Yes
1,Lochlan Horstman,M,,16,Wraps,J15-19,108.6,110,240,255,270,270,165,-180,-180,,165,240,255,-265,,255,690,SBD,Yes
1,Darryl Kelly,M,,60,Wraps,M60-64,107.3,110,230,-242.5,242.5,242.5,100,-110,,,100,200,210,220,,220,562.5,SBD,Yes
1,Nino Laciste,M,,24,Wraps,Open,103.8,110,275,-287.5,287.5,287.5,155,160,-162.5,,160,290,-310,-310,,290,737.5,SBD,Yes
2,Toby Downing,M,,26,Wraps,Open,102.9,110,255,-270,270,270,140,147.5,-152.5,,147.5,280,-300,-300,,280,697.5,SBD,Yes
3,Lochlan Horstman,M,,16,Wraps,Open,108.6,110,240,255,270,270,165,-180,-180,,165,240,255,-265,,255,690,SBD,Yes
4,Chris McGeary,M,,36,Wraps,Open,107,110,235,250,-257.5,250,135,140,-142.5,,140,285,-300,-300,,285,675,SBD,Yes
5,Darryl Kelly,M,,60,Wraps,Open,107.3,110,230,-242.5,242.5,242.5,100,-110,,,100,200,210,220,,220,562.5,SBD,Yes
1,Peter Kelly,M,,43,Raw,M40-44,108.3,110,,,,,,,,,,275,292.5,,,292.5,292.5,D,Yes
1,Peter Kelly,M,,43,Raw,Open,108.3,110,,,,,,,,,,275,292.5,,,292.5,292.5,D,Yes
1,Natalie Quinn,F,,23,Raw,J20-23,105.4,110,145,155,165,165,62.5,67.5,-72.5,,67.5,175,185,192.5,200,192.5,425,SBD,Yes
1,Debbie-Lea Maxwell,F,,40,Raw,M40-44,142.8,110+,130,140,145,145,80,85,87.5,,87.5,130,-140,-140,,130,362.5,SBD,Yes
1,Danielle Cox,F,,38,Raw,Open,108.6,110,180,195,201,201,75,80,,,80,155,165,-170,,165,446,SBD,Yes
2,Natalie Quinn,F,,23,Raw,Open,105.4,110,145,155,165,165,62.5,67.5,-72.5,,67.5,175,185,192.5,200,192.5,425,SBD,Yes
3,Asher Chatterton,F,,25,Raw,Open,109.9,110,137.5,147.5,155,155,77.5,82.5,-87.5,,82.5,160,172.5,-177.5,,172.5,410,SBD,Yes
1,Sophie Watts,F,,24,Raw,Open,119.3,110+,150,162.5,-170,162.5,75,82.5,87.5,,87.5,150,162.5,167.5,,167.5,417.5,SBD,Yes
2,Lauren Gallie,F,,33,Raw,Open,125.6,110+,-132.5,145,150,150,75,82.5,87.5,-93,87.5,145,157.5,167.5,,167.5,405,SBD,Yes
3,Debbie-Lea Maxwell,F,,40,Raw,Open,142.8,110+,130,140,145,145,80,85,87.5,,87.5,130,-140,-140,,130,362.5,SBD,Yes
1,Sinead Houston,F,,43,Wraps,M40-44,108.6,110,140,150,-160,150,75,80,-82.5,,80,140,150,160,,160,390,SBD,Yes
1,Sinead Houston,F,,43,Wraps,Open,108.6,110,140,150,-160,150,75,80,-82.5,,80,140,150,160,,160,390,SBD,Yes
1,Ruby Herbert,F,,27,Wraps,Open,118.5,110+,175,190,195,195,65,70,75,,75,170,185,190.5,,190.5,460.5,SBD,Yes
DQ,Emma James,F,,34,Wraps,Open,128.3,110+,130,140,150,150,85,-90,-90,,85,,,,,,,SBD,Yes
1,Xander Botma,M,,15,Raw,J15-19,117.5,125,175,190,-200,190,140,150,155,,155,220,240,-255,,240,585,SBD,Yes
1,Luke Krigovsky,M,,22,Raw,J20-23,124.7,125,212.5,227.5,235,235,152.5,165,-170,,165,195,212.5,220,,220,620,SBD,Yes
1,Richard Southon,M,,40,Raw,M40-44,119.6,125,280,-300,300,300,180,-190,-190,,180,280,300,-310,,300,780,SBD,Yes
2,Clyde Butler,M,,44,Raw,M40-44,118,125,230,250,,250,160,180,-190,,180,240,260,270,,270,700,SBD,Yes
3,Leslie Harris #2,M,,42,Raw,M40-44,115.1,125,217.5,232.5,235,235,140,150,-155,,150,257.5,270,277.5,,277.5,662.5,SBD,Yes
1,Jason Gillespie,M,,50,Raw,M50-54,137.3,140,230,250,265,265,-160,160,165,,165,255,275,-292.5,,275,705,SBD,Yes
1,Mauro Soto,M,,58,Raw,M55-59,122.5,125,195,-215.5,-215.5,195,132.5,135.5,,,135.5,205,220,-228.5,,220,550.5,SBD,Yes
1,Bronco Deiranauw,M,,32,Raw,Open,123.1,125,315,330,345,345,190,200,205,,205,225,240,252.5,,252.5,802.5,SBD,Yes
2,Richard Southon,M,,40,Raw,Open,119.6,125,280,-300,300,300,180,-190,-190,,180,280,300,-310,,300,780,SBD,Yes
3,Samuel Hall #2,M,,33,Raw,Open,117.3,125,230,250,260,260,190,200,205.5,,205.5,272.5,295,305,,305,770.5,SBD,Yes
4,Federico Pastorelli,M,,37,Raw,Open,116,125,235,247.5,255,255,155,167.5,170,,170,275,-295,295,,295,720,SBD,Yes
5,Charlie Chand,M,,25,Raw,Open,118.9,125,-270,270,-280,270,160,165,167.5,,167.5,270,-285,,,270,707.5,SBD,Yes
6,Clyde Butler,M,,44,Raw,Open,118,125,230,250,,250,160,180,-190,,180,240,260,270,,270,700,SBD,Yes
7,Matthew Theobald,M,,31,Raw,Open,124.1,125,240,250,260,260,145,155,165,,165,240,255,270,,270,695,SBD,Yes
8,Aaron Bell,M,,30,Raw,Open,123.1,125,240,255,265,265,145,155,-160,,155,250,265,,,265,685,SBD,Yes
9,Leslie Harris #2,M,,42,Raw,Open,115.1,125,217.5,232.5,235,235,140,150,-155,,150,257.5,270,277.5,,277.5,662.5,SBD,Yes
10,Luke Krigovsky,M,,22,Raw,Open,124.7,125,212.5,227.5,235,235,152.5,165,-170,,165,195,212.5,220,,220,620,SBD,Yes
11,Xander Botma,M,,15,Raw,Open,117.5,125,175,190,-200,190,140,150,155,,155,220,240,-255,,240,585,SBD,Yes
12,Mauro Soto,M,,58,Raw,Open,122.5,125,195,-215.5,-215.5,195,132.5,135.5,,,135.5,205,220,-228.5,,220,550.5,SBD,Yes
1,Tai Seuga,M,,33,Raw,Open,136.8,140,290,320,-330,320,-180,180,-200,,180,290,-300,-300,,290,790,SBD,Yes
2,Jason Gillespie,M,,50,Raw,Open,137.3,140,230,250,265,265,-160,160,165,,165,255,275,-292.5,,275,705,SBD,Yes
3,Darrell Oneill,M,,29,Raw,Open,137.8,140,240,-250,-250,240,150,160,167.5,,167.5,280,290,-300,,290,697.5,SBD,Yes
4,Jake Daulby,M,,30,Raw,Open,135.4,140,220,240,247.5,247.5,150,160,167.5,,167.5,240,262.5,-275,,262.5,677.5,SBD,Yes
1,Caleb Brown #1,M,,22,Wraps,J20-23,117,125,255,275,285,285,150,160,170,,170,290,310,320,,320,775,SBD,Yes
1,Caleb Brown #1,M,,22,Wraps,Open,117,125,255,275,285,285,150,160,170,,170,290,310,320,,320,775,SBD,Yes
2,Brenden Skrnjug,M,,25,Wraps,Open,113.6,125,265,282.5,-293,282.5,155,162.5,-165.5,,162.5,265,277.5,-282.5,,277.5,722.5,SBD,Yes
3,Daniel Crowder,M,,26,Wraps,Open,118.4,125,265,277.5,285,285,137.5,142.5,-145,,142.5,260,-272.5,-272.5,,260,687.5,SBD,Yes
4,Sean McDonald,M,,24,Wraps,Open,120.1,125,240,262.5,-267.5,262.5,135,142.5,147.5,,147.5,255,265,-280,,265,675,SBD,Yes
1,Leslie Harris #2,M,,42,Raw,M40-44,115.1,125,,,,,140,150,-155,,150,,,,,,150,B,Yes
1,Leslie Harris #2,M,,42,Raw,Open,115.1,125,,,,,140,150,-155,,150,,,,,,150,B,Yes
1,Leslie Harris #2,M,,42,Raw,M40-44,115.1,125,,,,,,,,,,257.5,270,277.5,,277.5,277.5,D,Yes
1,Leslie Harris #2,M,,42,Raw,Open,115.1,125,,,,,,,,,,257.5,270,277.5,,277.5,277.5,D,Yes
2,Will Pan,M,,24,Raw,Open,124.9,125,,,,,,,,,,230,250,-260,,250,250,D,Yes
