Place,Name,Sex,BirthDate,Age,Equipment,Division,BodyweightKg,WeightClassKg,Squat1Kg,Squat2Kg,Squat3Kg,Best3SquatKg,Bench1Kg,Bench2Kg,Bench3Kg,Best3BenchKg,Deadlift1Kg,Deadlift2Kg,Deadlift3Kg,Best3DeadliftKg,TotalKg,Event
1,Christie Pham,F,,,Raw,FR-SJ,51.3,52,65,70,80,80,47.5,52.5,-57.5,52.5,90,107.5,117.5,117.5,250,SBD
1,Shirley Ly,F,,,Raw,FR-Jr,50.9,52,90,100,107.5,107.5,55,60,-62.5,60,117.5,127.5,137.5,137.5,305,SBD
2,Wendy Nguyen,F,,,Raw,FR-Jr,48.8,52,92.5,102.5,110,110,47.5,50,52.5,52.5,125,-137.5,-142.5,125,287.5,SBD
1,Katherine Pham,F,,,Raw,FR-Jr,56.1,57,115,120,122.5,122.5,67.5,70,72.5,72.5,127.5,135,140,140,335,SBD
2,Ellyza Go,F,,,Raw,FR-Jr,57,57,102.5,-112.5,112.5,112.5,60,65,67.5,67.5,120,130,137.5,137.5,317.5,SBD
1,Beatriz Fernandez Perez,F,,,Raw,FR-Jr,74.4,76,142.5,152.5,160,160,80,85,90,90,170,180,-185,180,430,SBD
1,Abbi Bosward-Fielding,F,,,Raw,FR-M1,86,84+,142.5,147.5,152.5,152.5,75,80,82.5,82.5,162.5,177.5,185,185,420,SBD
1,Linda Jensen,F,,,Raw,FR-M2,56.7,57,95,100,105,105,60,65,-67.5,65,125,135,140,140,310,SBD
1,Carole Condon,F,,,Raw,FR-M2,75.6,76,112.5,120,125,125,65,70,72.5,72.5,137.5,147.5,-152.5,147.5,345,SBD
1,Sarah Toohill,F,,,Raw,FR-O,54.7,57,135,142.5,145,145,65,70,72.5,72.5,160,172.5,-182.5,172.5,390,SBD
1,Isabella Browne,F,,,Raw,FR-O,59.6,63,117.5,125,130,130,52.5,57.5,-60,57.5,145,160,167.5,167.5,355,SBD
2,Pavina Phoumavong,F,,,Raw,FR-O,62.3,63,112.5,120,127.5,127.5,52.5,57.5,60,60,135,145,155,155,342.5,SBD
3,Angeline Khoury,F,,,Raw,FR-O,62.3,63,112.5,117.5,122.5,122.5,57.5,60,62.5,62.5,120,-135,135,135,320,SBD
1,Vivienne Nguyen,F,,,Raw,FR-O,68.2,69,160,172.5,182.5,182.5,77.5,85,90,90,150,162.5,-170,162.5,435,SBD
1,Tomas Webster-Arbizu,M,,,Raw,MR-SJ,65.7,66,-150,150,-160,150,95,100,-105,100,165,172.5,180,180,430,SBD
1,Narat Vong,M,,,Raw,MR-SJ,69.4,74,160,175,177.5,177.5,-90,-95,95,95,207.5,225,232.5,232.5,505,SBD
2,Beau Boulton,M,,,Raw,MR-SJ,71.1,74,150,-160,-160,150,80,87.5,-92.5,87.5,180,192.5,-205,192.5,430,SBD
1,Leo Lee,M,,,Raw,MR-Jr,61,66,160,162.5,170,170,100,105,-107.5,105,-170,170,175,175,450,SBD
1,Dinh Sang Sammy Phan,M,,,Raw,MR-Jr,81.8,83,207.5,222.5,-235,222.5,125,132.5,-140,132.5,245,257.5,265,265,620,SBD
2,Michael Lieu,M,,,Raw,MR-Jr,80.3,83,-185,197.5,212.5,212.5,117.5,125,132.5,132.5,220,240,-250,240,585,SBD
3,Joachim Cabanero,M,,,Raw,MR-Jr,77.1,83,155,162.5,167.5,167.5,102.5,110,115,115,210,225,-235,225,507.5,SBD
4,James Clain,M,,,Raw,MR-Jr,74.3,83,170,177.5,185,185,92.5,97.5,100,100,170,190,-200,190,475,SBD
1,Tommy Huynh,M,,,Raw,MR-Jr,91.8,93,205,215,220,220,125,132.5,140,140,222.5,237.5,250,250,610,SBD
2,Minho Kim,M,,,Raw,MR-Jr,89.2,93,180,192.5,205,205,110,117.5,-122.5,117.5,180,195,-205,195,517.5,SBD
1,Marcus Attard,M,,,Raw,MR-Jr,102.6,105,190,-205,205,205,110,117.5,-122.5,117.5,185,200,210,210,532.5,SBD
1,Christopher Smith,M,,,Raw,MR-M1,75.2,83,162.5,175,-185,175,110,115,120,120,172.5,187.5,200,200,495,SBD
1,Martin Jackson,M,,,Raw,MR-M1,100.2,105,75,,,75,-140,140,150,150,100,,,100,325,SBD
1,Sean Minto,M,,,Raw,MR-M2,91.7,93,-192.5,192.5,205,205,-137.5,137.5,140,140,222.5,237.5,250,250,595,SBD
1,Cyrus Dadat,M,,,Raw,MR-O,64.6,66,135,145,150,150,87.5,-92.5,92.5,92.5,-185,185,195,195,437.5,SBD
2,Denzel Navaratnam,M,,,Raw,MR-O,65.7,66,120,-127.5,127.5,127.5,-77.5,77.5,85,85,160,170,-180,170,382.5,SBD
1,Thomas Duong #1,M,,,Raw,MR-O,73.6,74,215,230,245,245,140,147.5,152.5,152.5,237.5,252.5,265,265,662.5,SBD
1,Cana Chambara,M,,,Raw,MR-O,82.4,83,240,250,260,260,140,150,160,160,260,280,290,290,710,SBD
2,Nicholas Van Groesen,M,,,Raw,MR-O,81.6,83,220,232.5,242.5,242.5,125,132.5,137.5,137.5,242.5,257.5,270,270,650,SBD
3,Christian Cajucom,M,,,Raw,MR-O,82,83,185,200,212.5,212.5,120,127.5,132.5,132.5,240,-260,265,265,610,SBD
4,Jackie Chau,M,,,Raw,MR-O,82,83,200,212.5,-222.5,212.5,130,135,137.5,137.5,245,257.5,-272.5,257.5,607.5,SBD
5,Hamish Donovan,M,,,Raw,MR-O,82.3,83,222.5,235,-240,235,115,-122.5,122.5,122.5,225,242.5,-255,242.5,600,SBD
6,Owen Grammeno,M,,,Raw,MR-O,82.6,83,182.5,192.5,-200,192.5,102.5,107.5,112.5,112.5,215,227.5,-240,227.5,532.5,SBD
7,Krishna Budha Chhetri,M,,,Raw,MR-O,79.7,83,170,180,190,190,100,107.5,115,115,200,210,-220,210,515,SBD
8,Leon Esho,M,,,Raw,MR-O,80.3,83,165,175,185,185,95,100,102.5,102.5,195,210,220,220,507.5,SBD
1,Shaun Dwyer,M,,,Raw,MR-O,92.9,93,235,245,250,250,135,142.5,-147.5,142.5,265,-280,-280,265,657.5,SBD
2,Daniel Ly,M,,,Raw,MR-O,89.5,93,202.5,-212.5,212.5,212.5,125,132.5,-137.5,132.5,237.5,252.5,260,260,605,SBD
3,Matthew Howard,M,,,Raw,MR-O,89.8,93,185,197.5,207.5,207.5,115,120,125,125,187.5,200,207.5,207.5,540,SBD
4,Brendan Jackson,M,,,Raw,MR-O,92.4,93,160,170,180,180,120,130,132.5,132.5,180,195,-205,195,507.5,SBD
1,Rob Menon,M,,,Raw,MR-O,103.1,105,177.5,187.5,-200,187.5,135,145,-147.5,145,217.5,227.5,237.5,237.5,570,SBD
1,Luke Cutler,M,,,Raw,MR-O,109.5,120,235,255,275,275,140,147.5,152.5,152.5,225,245,260,260,687.5,SBD
DQ,Michael Cornell,M,,,Raw,MR-Jr,112.4,120,220,,,220,,,,,,,,,,SBD