Equipment,Division,Sex,Event,WeightClassKg,Name,Best3BenchKg,Bench4Kg,Best3DeadliftKg,Deadlift4Kg,TotalKg,State,Country,Place
Single-ply,Elite Open,M,B,67.5,Kerwin Unten,225,,,,225,HI,USA,1
Single-ply,Elite Open,M,B,82.5,Don Linerud,,,,,,ID,USA,DQ
Single-ply,Elite Open,M,B,100,Rick Marrama,,,,,,MA,USA,DQ
Single-ply,Elite Open,M,B,110,James Hunter,332.5,,,,332.5,CA,USA,1
Multi-ply,Open,M,B,75,Jon Cunningham,210.5,,,,210.5,UT,USA,1
Multi-ply,Open,M,B,100,Thomas Reiher,215,,,,215,HI,USA,1
Multi-ply,Open,M,B,110,Kenneth Millrany,318.5,,,,318.5,TN,USA,1
Multi-ply,Open,M,B,110,Antti Kousa,230,,,,230,,Finland,2
Multi-ply,Open,M,B,117.5,Todd Christensen,260,,,,260,WA,USA,1
Multi-ply,Open,M,B,117.5,Phillip Arroyo,205,,,,205,WA,USA,2
Multi-ply,Open,M,B,117.5,Don Miskinis,150,,,,150,OH,USA,3
Multi-ply,Open,M,B,117.5,Harley Timbs,,,,,,TN,USA,DQ
Multi-ply,Open,M,B,140+,Tiny Meeker,345,,,,345,TX,USA,1
Single-ply,Open,M,B,56,Gerardo Merino Jaramillo,140,,,,140,,Ecuador,1
Single-ply,Open,M,B,60,Gary Hunter #1,82.5,,,,82.5,TX,USA,1
Single-ply,Open,M,B,67.5,Dustin Hanson,201,,,,201,MT,USA,1
Single-ply,Open,M,B,67.5,Alfredo Evangelista,185,,,,185,OR,USA,2
Single-ply,Open,M,B,67.5,David R Smith,185,,,,185,TX,USA,3
Single-ply,Open,M,B,67.5,Willis McCoy,147.5,,,,147.5,OH,USA,4
Single-ply,Open,M,B,67.5,Dave Constantineau,132.5,,,,132.5,WI,USA,5
Single-ply,Open,M,B,75,Adolfo Davila,220,,,,220,CA,USA,1
Single-ply,Open,M,B,75,Willard Crossen III,210,,,,210,WA,USA,2
Single-ply,Open,M,B,75,Miguel Ruelan,200,,,,200,MI,USA,3
Single-ply,Open,M,B,75,Dave Wallis,165,,,,165,UT,USA,4
Single-ply,Open,M,B,75,Luis Baerga,127.5,,,,127.5,TX,USA,5
Single-ply,Open,M,B,82.5,Ryan Harris,230,,,,230,OR,USA,1
Single-ply,Open,M,B,82.5,Sakari Selkäinaho,210,,,,210,,Finland,2
Single-ply,Open,M,B,82.5,Robert Wells,185,,,,185,MA,USA,3
Single-ply,Open,M,B,82.5,David Hansen,117.5,,,,117.5,ND,USA,4
Single-ply,Open,M,B,82.5,David Wentworth,,,,,,ME,USA,DQ
Single-ply,Open,M,B,90,Danny Soto,250,,,,250,WA,USA,1
Single-ply,Open,M,B,90,Kim Päivöke,237.5,,,,237.5,,Finland,2
Single-ply,Open,M,B,90,Jason Carson,237.5,,,,237.5,IL,USA,3
Single-ply,Open,M,B,90,Heikki Tyrväinen,220,,,,220,,Finland,4
Single-ply,Open,M,B,90,Coby Washburn,,,,,,TX,USA,DQ
Single-ply,Open,M,B,90,Jeff Woods,,,,,,OH,USA,DQ
Single-ply,Open,M,B,100,Petri Hietamäki,270,,,,270,,Finland,1
Single-ply,Open,M,B,100,Scott Edmondson,265.5,,,,265.5,OR,USA,2
Single-ply,Open,M,B,100,Shahid Shabazz,260,,,,260,IL,USA,3
Single-ply,Open,M,B,100,James Houston,250,,,,250,CA,USA,4
Single-ply,Open,M,B,100,Armando Soto,245,,,,245,TX,USA,5
Single-ply,Open,M,B,100,Joseph Adams,230,,,,230,UT,USA,6
Single-ply,Open,M,B,100,Juha Pukkila,225,,,,225,,Finland,7
Single-ply,Open,M,B,100,Will Beavers,,,,,,CA,USA,DQ
Single-ply,Open,M,B,100,Christopher Gillam,,,,,,AZ,USA,DQ
Single-ply,Open,M,B,110,Rob Golgano,287.5,,,,287.5,ME,USA,1
Single-ply,Open,M,B,110,Brant Bishop,260,,,,260,AL,USA,2
Single-ply,Open,M,B,110,Carlton James,250,,,,250,TX,USA,3
Single-ply,Open,M,B,110,Tony Blas,237.5,,,,237.5,OR,USA,4
Single-ply,Open,M,B,110,Kari Pöntinen,225,,,,225,,Finland,5
Single-ply,Open,M,B,110,Mike Desrosiers,225,,,,225,AZ,USA,6
Single-ply,Open,M,B,110,Bobby Faber,177.5,,,,177.5,MI,USA,7
Single-ply,Open,M,B,110,Brian Birchmeier,155,,,,155,MI,USA,8
Single-ply,Open,M,B,110,Christopher Carson,,,,,,OH,USA,DQ
Single-ply,Open,M,B,117.5,John Erickson,282.5,,,,282.5,OK,USA,1
Single-ply,Open,M,B,117.5,Joey Murphy,275,,,,275,GA,USA,2
Single-ply,Open,M,B,117.5,Bill Welch,275,,,,275,TN,USA,3
Single-ply,Open,M,B,117.5,Tom Emelander,,,,,,TX,USA,DQ
Single-ply,Open,M,B,125,Patrick Holloway,295,,,,295,AZ,USA,1
Single-ply,Open,M,B,125,Jani Toivo Kristian Ihalainen,255,,,,255,,Finland,2
Single-ply,Open,M,B,140,Bill Gillespie,325,,,,325,VA,USA,1
Single-ply,Open,M,B,140,John Dennison,277.5,,,,277.5,UT,USA,2
Single-ply,Open,M,B,140,Joe Mickelson,230,,,,230,WA,USA,3
Single-ply,Open,M,B,140,Brandon Bankston,,,,,,LA,USA,DQ
Single-ply,Open,M,B,140+,Dave Forstner,318,,,,318,MI,USA,1
Single-ply,Open,M,B,140+,Scott Wesley Jordan,295,,,,295,AZ,USA,2
Single-ply,Open,M,B,140+,James Mersberg,280,,,,280,HI,USA,3
Single-ply,Open,M,B,140+,Harjinder Kumar,272.5,,,,272.5,,India,4
Single-ply,Open,M,B,140+,Jerry Pritchett,272.5,,,,272.5,AZ,USA,5
Single-ply,Open,M,B,140+,Paul Paldino,235.5,,,,235.5,MA,USA,6
Single-ply,Class 1,M,B,67.5,Aaron Eliserio,,,,,,AZ,USA,DQ
Single-ply,Class 1,M,B,75,Mathieu Coudriaud,160,,,,160,,France,1
Single-ply,Class 1,M,B,82.5,Aaron Brown,160,,,,160,OR,USA,1
Single-ply,Class 1,M,B,82.5,Chris McGrail,140,,,,140,UT,USA,2
Single-ply,Class 1,M,B,82.5,Mark Reuer,135,,,,135,SD,USA,3
Single-ply,Class 1,M,B,90,Andy Whitaker,202.5,,,,202.5,LA,USA,1
Single-ply,Class 1,M,B,90,Steve Peña #1,185,,,,185,CA,USA,2
Single-ply,Class 1,M,B,90,Shaun Orta,170,,,,170,WA,USA,3
Single-ply,Class 1,M,B,90,Michael Happach,170,,,,170,IL,USA,4
Single-ply,Class 1,M,B,90,Daniel Taylor,155,,,,155,OH,USA,5
Single-ply,Class 1,M,B,100,Joseph Adams,230,,,,230,UT,USA,1
Single-ply,Class 1,M,B,100,Kyle Herzik,155,,,,155,NV,USA,2
Single-ply,Class 1,M,B,100,Doug Amburgey,152.5,,,,152.5,OH,USA,3
Single-ply,Class 1,M,B,110,Kaleb Crafts,227.5,,,,227.5,UT,USA,1
Single-ply,Class 1,M,B,110,Fateh Sihota,195,,,,195,,India,2
Single-ply,Class 1,M,B,110,Jim Parham,182.5,,,,182.5,OK,USA,3
Single-ply,Class 1,M,B,117.5,Timothy Baker,192.5,,,,192.5,OH,USA,1
Single-ply,Class 1,M,B,117.5,Nicholas Raymond,182.5,,,,182.5,OR,USA,2
Single-ply,Class 1,M,B,117.5,Isaac Conde,162.5,,,,162.5,TX,USA,3
Single-ply,Class 1,M,B,125,Harjit Kumar,230,,,,230,,India,1
Single-ply,Class 1,M,B,125,Bradley Butler,182.5,,,,182.5,LA,USA,2
Single-ply,Class 1,M,B,125,Michael Pfabe,175,,,,175,OH,USA,3
Single-ply,Class 1,M,B,140,Roger McMichael,187.5,,,,187.5,TX,USA,1
Single-ply,Class 1,M,B,140+,Marvin Bishop,227.5,,,,227.5,OH,USA,1
Single-ply,Class 1,M,B,140+,Clay Tawzer,195,,,,195,CA,USA,2
Single-ply,Class 1,M,B,140+,Ryan Kimball,185,,,,185,WA,USA,3
Single-ply,Class 1,M,B,140+,Leo Contreras,180,,,,180,CA,USA,4
Single-ply,Class 1,M,B,140+,Keith Sayles,137.5,,,,137.5,TX,USA,5
Single-ply,Class 1,M,B,140+,Edward Jason Woodger,,,,,,UT,USA,DQ
Single-ply,Disabled,M,B,75,Donnie Miskinis,112.5,,,,112.5,OH,USA,1
Single-ply,Disabled,M,B,82.5,Vilmar Oliveira,155,,,,155,,Brazil,1
Single-ply,Disabled,M,B,90,Steve Peña #1,185,,,,185,CA,USA,1
Single-ply,Disabled,M,B,90,Casey Jones,172.5,180,,,172.5,IL,USA,2
Single-ply,Disabled,M,B,90,Nick Sinardi,65,,,,65,FL,USA,3
Single-ply,Disabled,M,B,110,Cody Colchado,195,,,,195,TX,USA,1
Single-ply,Disabled,M,B,140,Luis Campos,220,,,,220,IN,USA,1
Single-ply,Disabled,M,B,140,Roger McMichael,,,,,,TX,USA,DQ
Single-ply,Disabled,M,B,140+,Omar Sanchez,200,,,,200,TX,USA,1
Single-ply,Disabled,M,B,140+,Allen Miluso,72.5,,,,72.5,CA,USA,2
Single-ply,Special Olympian,M,B,52,David Hammond,75,75.5,,,75,WA,USA,1
Single-ply,Special Olympian,M,B,110,Brady Tanner,187.5,,,,187.5,KS,USA,1
Single-ply,Special Olympian,M,B,140+,Jock Mayes,97.5,,,,97.5,CA,USA,1
Single-ply,Teen 12-13,M,B,75,Storm Draayer,59,,,,59,MN,USA,1
Single-ply,Teen 12-13,M,B,44,Trevor Ogden,40,,,,40,HI,USA,1
Single-ply,Teen 14-15,M,B,56,Clayton Watts,89,,,,89,CA,USA,1
Single-ply,Teen 14-15,M,B,60,Josh Carr,50,,,,50,ME,USA,1
Single-ply,Teen 14-15,M,B,75,Jak Nelson,95,,,,95,WI,USA,1
Single-ply,Teen 14-15,M,B,75,Jacob Hill,92.5,,,,92.5,ME,USA,2
Single-ply,Teen 14-15,M,B,82.5,Kevin Perez,75,,,,75,CA,USA,1
Single-ply,Teen 14-15,M,B,100,Jacob Scott,67.5,,,,67.5,ME,USA,1
Single-ply,Teen 14-15,M,B,140+,James Goodfellow,157.5,160,,,157.5,UT,USA,1
Single-ply,Teen 16-17,M,B,60,Ivan Rodriguez,87.5,,,,87.5,CA,USA,1
Single-ply,Teen 16-17,M,B,67.5,James Windham,127.5,,,,127.5,LA,USA,1
Single-ply,Teen 16-17,M,B,67.5,Brandon Jones #10,107.5,,,,107.5,HI,USA,2
Single-ply,Teen 16-17,M,B,67.5,Munkhjin Gantulga,85,,,,85,CA,USA,3
Single-ply,Teen 16-17,M,B,75,Nick Mendizabal,132.5,,,,132.5,CA,USA,1
Single-ply,Teen 16-17,M,B,75,Hugo Pina,117.5,,,,117.5,CA,USA,2
Single-ply,Teen 16-17,M,B,90,Doc Derwin,190,195,,,190,WA,USA,1
Single-ply,Teen 16-17,M,B,110,Jose Perez #4,115,,,,115,CA,USA,1
Single-ply,Teen 16-17,M,B,125,William Bronaugh,107.5,,,,107.5,CA,USA,1
Single-ply,Teen 18-19,M,B,52,Jesus Sanchez,102.5,,,,102.5,TX,USA,1
Single-ply,Teen 18-19,M,B,56,Hunter Hernandez #1,122.5,,,,122.5,NV,USA,1
Single-ply,Teen 18-19,M,B,67.5,Nick Tsangeos,130,,,,130,OH,USA,1
Single-ply,Teen 18-19,M,B,67.5,Manuel Pina,115,,,,115,CA,USA,2
Single-ply,Teen 18-19,M,B,75,Judd Sato III,182.5,,,,182.5,HI,USA,1
Single-ply,Teen 18-19,M,B,75,Donnie Miskinis,137.5,,,,137.5,OH,USA,2
Single-ply,Teen 18-19,M,B,75,Roy Arispe,120,,,,120,TX,USA,3
Single-ply,Teen 18-19,M,B,75,Abel Urdiales,85,,,,85,CA,USA,4
Single-ply,Teen 18-19,M,B,75,Francisco Marquez,,,,,,TX,USA,DQ
Single-ply,Teen 18-19,M,B,82.5,Neil Saurers,190,,,,190,OH,USA,1
Single-ply,Teen 18-19,M,B,82.5,Buster Litton,175.5,,,,175.5,NV,USA,2
Single-ply,Teen 18-19,M,B,82.5,Jesse Lynn Jester,,,,,,KS,USA,DQ
Single-ply,Teen 18-19,M,B,90,Jake Garbush,182.5,,,,182.5,WA,USA,1
Single-ply,Teen 18-19,M,B,90,Brandon Manion,180,,,,180,NV,USA,2
Single-ply,Teen 18-19,M,B,90,Bradley Bennett,170,,,,170,OH,USA,3
Single-ply,Teen 18-19,M,B,90,Jacob Fernandez,147.5,,,,147.5,TX,USA,4
Single-ply,Teen 18-19,M,B,90,Sanford Graves,137.5,,,,137.5,CA,USA,5
Single-ply,Teen 18-19,M,B,100,Dimas Lopez,142.5,,,,142.5,TX,USA,1
Single-ply,Teen 18-19,M,B,100,Easton Stanford,,,,,,AZ,USA,DQ
Single-ply,Teen 18-19,M,B,110,Jaime Villa,170,,,,170,TX,USA,1
Single-ply,Teen 18-19,M,B,117.5,Adam Lindsey,190,,,,190,NV,USA,1
Single-ply,Teen 18-19,M,B,125,Javier Garza,190,,,,190,TX,USA,1
Single-ply,Teen 18-19,M,B,125,Halit Dilber,,,,,,TX,USA,DQ
Single-ply,Teen 18-19,M,B,44,Kyle Henderson,75,77.5,,,75,WA,USA,1
Multi-ply,Juniors 20-25,M,B,48,Jerel Aaron Hulliger,92.5,97.5,,,92.5,CA,USA,1
Single-ply,Juniors 20-25,M,B,56,Andres Cruz,85,,,,85,TX,USA,1
Single-ply,Juniors 20-25,M,B,56,Raymond Rodriguez,67.5,,,,67.5,TX,USA,2
Single-ply,Juniors 20-25,M,B,60,Antonio Moreno,110,,,,110,TX,USA,1
Single-ply,Juniors 20-25,M,B,67.5,Dustin Hanson,201,,,,201,MT,USA,1
Single-ply,Juniors 20-25,M,B,67.5,Nick Lenhart,165,,,,165,UT,USA,2
Single-ply,Juniors 20-25,M,B,67.5,Jonne Fräntilä,162.5,,,,162.5,,Finland,3
Single-ply,Juniors 20-25,M,B,67.5,Nick Buck,150,,,,150,WI,USA,4
Single-ply,Juniors 20-25,M,B,67.5,Luizarthur Nen,102.5,,,,102.5,TX,USA,5
Single-ply,Juniors 20-25,M,B,67.5,Aaron Eliserio,,,,,,AZ,USA,DQ
Single-ply,Juniors 20-25,M,B,75,Mathieu Coudriaud,167.5,,,,167.5,,France,1
Single-ply,Juniors 20-25,M,B,75,Ray Segura,152.5,,,,152.5,WA,USA,2
Single-ply,Juniors 20-25,M,B,75,Jared Hazel,142.5,,,,142.5,FL,USA,3
Single-ply,Juniors 20-25,M,B,75,Ilian Rojas,142.5,,,,142.5,TX,USA,4
Single-ply,Juniors 20-25,M,B,82.5,Zach Miller,190,,,,190,WA,USA,1
Single-ply,Juniors 20-25,M,B,82.5,Robert Wells,185,,,,185,MA,USA,2
Single-ply,Juniors 20-25,M,B,82.5,Carlos Mata,172.5,,,,172.5,TX,USA,3
Single-ply,Juniors 20-25,M,B,82.5,Eric Ximenez,160,,,,160,TX,USA,4
Single-ply,Juniors 20-25,M,B,82.5,Aaron Brown,160,,,,160,OR,USA,5
Single-ply,Juniors 20-25,M,B,82.5,Anthony White #4,155,,,,155,AZ,USA,6
Single-ply,Juniors 20-25,M,B,82.5,Steven Rocha,125,,,,125,TX,USA,7
Single-ply,Juniors 20-25,M,B,82.5,A. J. Mangum,120,,,,120,TX,USA,8
Single-ply,Juniors 20-25,M,B,82.5,Jesus Lozano,,,,,,TX,USA,DQ
Single-ply,Juniors 20-25,M,B,90,Andy Whitaker,202.5,,,,202.5,LA,USA,1
Single-ply,Juniors 20-25,M,B,100,Gerardo Ruiz,177.5,,,,177.5,TX,USA,1
Single-ply,Juniors 20-25,M,B,100,Adam Contreras #1,167.5,,,,167.5,CA,USA,2
Single-ply,Juniors 20-25,M,B,100,Waldo Villarreal,150,,,,150,TX,USA,3
Single-ply,Juniors 20-25,M,B,100,Brian Shekels,,,,,,WI,USA,DQ
Single-ply,Juniors 20-25,M,B,110,Dan Pasholk,227.5,,,,227.5,WI,USA,1
Single-ply,Juniors 20-25,M,B,110,Anthony Rodriguez,172.5,,,,172.5,TX,USA,2
Single-ply,Juniors 20-25,M,B,117.5,Austin Shipley,255.5,,,,255.5,AZ,USA,1
Single-ply,Juniors 20-25,M,B,117.5,David Bergman,200,,,,200,IL,USA,2
Single-ply,Juniors 20-25,M,B,140,Arthur Tupuola,275,,,,275,HI,USA,1
Single-ply,Juniors 20-25,M,B,140,Brian Rizzo,,,,,,OR,USA,DQ
Single-ply,Juniors 20-25,M,B,140+,Serigne Sarr,132.5,,,,132.5,TX,USA,1
Multi-ply,Submasters 33-39,M,B,90,Steven Kaufman,175,,,,175,TX,USA,1
Multi-ply,Submasters 33-39,M,B,100,Thomas Reiher,215,,,,215,HI,USA,1
Multi-ply,Submasters 33-39,M,B,100,Charles Farmer,,,,,,MT,USA,DQ
Multi-ply,Submasters 33-39,M,B,110,Antti Kousa,230,,,,230,,Finland,1
Multi-ply,Submasters 33-39,M,B,125,Jani Toivo Kristian Ihalainen,255,,,,255,,Finland,1
Multi-ply,Submasters 33-39,M,B,140,Silvio Edson Francisco Braga,230,,,,230,,Brazil,1
Multi-ply,Submasters 33-39,M,B,140+,Tiny Meeker,345,,,,345,TX,USA,1
Single-ply,Submasters 33-39,M,B,67.5,David R Smith,185,,,,185,TX,USA,1
Single-ply,Submasters 33-39,M,B,75,Dave Wallis,165,,,,165,UT,USA,1
Single-ply,Submasters 33-39,M,B,82.5,Mark Reuer,135,,,,135,SD,USA,1
Single-ply,Submasters 33-39,M,B,90,Kim Päivöke,237.5,,,,237.5,,Finland,1
Single-ply,Submasters 33-39,M,B,90,Jason Carson,237.5,,,,237.5,IL,USA,2
Single-ply,Submasters 33-39,M,B,90,Coby Washburn,,,,,,TX,USA,DQ
Single-ply,Submasters 33-39,M,B,100,Scott Edmondson,265.5,,,,265.5,OR,USA,1
Single-ply,Submasters 33-39,M,B,100,James Houston,250,,,,250,CA,USA,2
Single-ply,Submasters 33-39,M,B,100,Armando Soto,245,,,,245,TX,USA,3
Single-ply,Submasters 33-39,M,B,100,Christopher Gillam,,,,,,AZ,USA,DQ
Single-ply,Submasters 33-39,M,B,110,WC Carter,250,,,,250,AL,USA,1
Single-ply,Submasters 33-39,M,B,110,Tony Blas,247.5,,,,247.5,OR,USA,2
Single-ply,Submasters 33-39,M,B,110,Daniel Ducharme,237.5,,,,237.5,AZ,USA,3
Single-ply,Submasters 33-39,M,B,110,Keoki Dacuycuy,235,,,,235,HI,USA,4
Single-ply,Submasters 33-39,M,B,110,Kari Pöntinen,225,,,,225,,Finland,5
Single-ply,Submasters 33-39,M,B,110,Mike Desrosiers,225,,,,225,AZ,USA,6
Single-ply,Submasters 33-39,M,B,110,Fateh Sihota,194.5,,,,194.5,,India,7
Single-ply,Submasters 33-39,M,B,110,Bobby Faber,177.5,,,,177.5,MI,USA,8
Single-ply,Submasters 33-39,M,B,110,Joe Martinez,172.5,,,,172.5,CA,USA,9
Single-ply,Submasters 33-39,M,B,125,Sam Aumavae,330,,,,330,OR,USA,1
Single-ply,Submasters 33-39,M,B,125,Ben Rogers,277.5,,,,277.5,WA,USA,2
Single-ply,Submasters 33-39,M,B,125,Harjit Kumar,240,,,,240,,India,3
Single-ply,Submasters 33-39,M,B,125,Frederick Alexander,,,,,,TX,USA,DQ
Single-ply,Submasters 33-39,M,B,140,Brandon Bankston,,,,,,LA,USA,DQ
Single-ply,Submasters 33-39,M,B,140+,Dave Forstner,318,,,,318,MI,USA,1
Single-ply,Submasters 33-39,M,B,140+,Marvin Bishop,227.5,,,,227.5,OH,USA,2
Single-ply,Submasters 33-39,M,B,140+,Edward Jason Woodger,,,,,,UT,USA,DQ
Multi-ply,Masters 40-46,M,B,75,Jon Cunningham,210.5,,,,210.5,UT,USA,1
Multi-ply,Masters 40-46,M,B,82.5,Eric Lumpkin,160,,,,160,OR,USA,1
Multi-ply,Masters 40-46,M,B,100,John Westleigh,192.5,,,,192.5,ME,USA,1
Multi-ply,Masters 40-46,M,B,110,Frank Wakakuwa,250,,,,250,NV,USA,1
Multi-ply,Masters 40-46,M,B,117.5,Patrick Parnell,352.5,,,,352.5,TX,USA,1
Single-ply,Masters 40-46,M,B,67.5,Willis McCoy,147.5,,,,147.5,OH,USA,1
Single-ply,Masters 40-46,M,B,75,Miguel Ruelan,200,,,,200,MI,USA,1
Single-ply,Masters 40-46,M,B,75,Craig Kornwolf,143,,,,143,MN,USA,2
Single-ply,Masters 40-46,M,B,75,George Nabeshima,142.5,,,,142.5,HI,USA,3
Single-ply,Masters 40-46,M,B,82.5,Marchand Fleming,182.5,,,,182.5,OK,USA,1
Single-ply,Masters 40-46,M,B,90,Danny Soto,245,,,,245,WA,USA,1
Single-ply,Masters 40-46,M,B,90,Michael Happach,170,,,,170,IL,USA,2
Single-ply,Masters 40-46,M,B,90,Adam Johnson,162.5,,,,162.5,WA,USA,3
Single-ply,Masters 40-46,M,B,90,Bryan Vandiver,127.5,,,,127.5,OK,USA,4
Single-ply,Masters 40-46,M,B,90,Joe Gardner,,,,,,IL,USA,DQ
Single-ply,Masters 40-46,M,B,100,Juha Pukkila,225,,,,225,,Finland,1
Single-ply,Masters 40-46,M,B,100,David Bradshaw,220,,,,220,CA,USA,2
Single-ply,Masters 40-46,M,B,100,Steven Petersen,182.5,,,,182.5,TX,USA,3
Single-ply,Masters 40-46,M,B,100,Doug Amburgey,152.5,,,,152.5,OH,USA,4
Single-ply,Masters 40-46,M,B,110,James Hunter,332.5,,,,332.5,CA,USA,1
Single-ply,Masters 40-46,M,B,110,Rob Golgano,287.5,,,,287.5,ME,USA,2
Single-ply,Masters 40-46,M,B,110,Brant Bishop,260,,,,260,AL,USA,3
Single-ply,Masters 40-46,M,B,110,Roland Garza,256,,,,256,OR,USA,4
Single-ply,Masters 40-46,M,B,110,Jeff Alvari,245,,,,245,UT,USA,5
Single-ply,Masters 40-46,M,B,117.5,Joey Murphy,275,,,,275,GA,USA,1
Single-ply,Masters 40-46,M,B,117.5,Gary Gulseth,250,,,,250,WI,USA,2
Single-ply,Masters 40-46,M,B,117.5,Jerry Warren,182.5,,,,182.5,OK,USA,3
Single-ply,Masters 40-46,M,B,117.5,Tim Moon,,,,,,GA,USA,DQ
Single-ply,Masters 40-46,M,B,125,Patrick Holloway,295,,,,295,AZ,USA,1
Single-ply,Masters 40-46,M,B,125,John Stewart,,,,,,TX,USA,DQ
Single-ply,Masters 40-46,M,B,140,John Dennison,277.5,,,,277.5,UT,USA,1
Single-ply,Masters 40-46,M,B,140,Guy Powell,260,,,,260,WI,USA,2
Single-ply,Masters 40-46,M,B,140,Warren Orr,230,,,,230,,Canada,3
Single-ply,Masters 40-46,M,B,140,Robert Speno,,,,,,CA,USA,DQ
Single-ply,Masters 40-46,M,B,140+,Harjinder Kumar,272.5,,,,272.5,,India,1
Single-ply,Masters 40-46,M,B,140+,Gary Shim,247.5,,,,247.5,HI,USA,2
Single-ply,Masters 40-46,M,B,140+,Scott Wesley Jordan,,,,,,AZ,USA,DQ
Multi-ply,Masters 47-53,M,B,67.5,Charles Venturella,130,,,,130,PA,USA,1
Multi-ply,Masters 47-53,M,B,75,Julian Kaipo Pereza,143.5,,,,143.5,HI,USA,1
Multi-ply,Masters 47-53,M,B,90,Doug Clayton,177.5,,,,177.5,WY,USA,1
Multi-ply,Masters 47-53,M,B,110,Kenneth Millrany,295,,,,295,TN,USA,1
Multi-ply,Masters 47-53,M,B,117.5,Todd Christensen,260,,,,260,WA,USA,1
Multi-ply,Masters 47-53,M,B,117.5,Phillip Arroyo,205,,,,205,WA,USA,2
Multi-ply,Masters 47-53,M,B,117.5,Don Miskinis,150,,,,150,OH,USA,3
Multi-ply,Masters 47-53,M,B,125,Jim Presley,227.5,,,,227.5,CA,USA,1
Single-ply,Masters 47-53,M,B,56,Gerardo Merino Jaramillo,140,,,,140,,Ecuador,1
Single-ply,Masters 47-53,M,B,56,Doug Warren,110,,,,110,AL,USA,2
Single-ply,Masters 47-53,M,B,60,Chetram Mangra,110,,,,110,NY,USA,1
Single-ply,Masters 47-53,M,B,67.5,Kenny Lyons,142.5,,,,142.5,UT,USA,1
Single-ply,Masters 47-53,M,B,67.5,Dave Constantineau,132.5,,,,132.5,WI,USA,2
Single-ply,Masters 47-53,M,B,67.5,John Lee #10,125,,,,125,CO,USA,3
Single-ply,Masters 47-53,M,B,67.5,Roosevelt Pristell,95,,,,95,WA,USA,4
Single-ply,Masters 47-53,M,B,75,Mark Laurel,142.5,,,,142.5,CA,USA,1
Single-ply,Masters 47-53,M,B,82.5,Deron Agaran,182.5,,,,182.5,HI,USA,1
Single-ply,Masters 47-53,M,B,82.5,Martin Aguirre,177.5,,,,177.5,NV,USA,2
Single-ply,Masters 47-53,M,B,82.5,David Brekke,122.5,,,,122.5,CO,USA,3
Single-ply,Masters 47-53,M,B,90,Doug Noebe,222.5,,,,222.5,OH,USA,1
Single-ply,Masters 47-53,M,B,90,Jeff Woods,222.5,,,,222.5,OH,USA,2
Single-ply,Masters 47-53,M,B,90,Richard Joachim,182.5,,,,182.5,OR,USA,3
Single-ply,Masters 47-53,M,B,90,Robert Harris,160,,,,160,NV,USA,4
Single-ply,Masters 47-53,M,B,100,James Noblit,232.5,,,,232.5,OR,USA,1
Single-ply,Masters 47-53,M,B,100,Brian Reynolds #2,217.5,,,,217.5,WA,USA,2
Single-ply,Masters 47-53,M,B,100,George Phipps,207.5,,,,207.5,NV,USA,3
Single-ply,Masters 47-53,M,B,110,Ed Macauley,250,,,,250,OR,USA,1
Single-ply,Masters 47-53,M,B,110,Kent Doerfler,245,,,,245,OR,USA,2
Single-ply,Masters 47-53,M,B,110,Mike Frizzell,227.5,,,,227.5,IL,USA,3
Single-ply,Masters 47-53,M,B,110,Cody Colchado,195,,,,195,TX,USA,4
Single-ply,Masters 47-53,M,B,110,Brian Birchmeier,155,,,,155,MI,USA,5
Single-ply,Masters 47-53,M,B,117.5,Bill Welch,275,,,,275,TN,USA,1
Single-ply,Masters 47-53,M,B,117.5,Mark Stanford,245,,,,245,AZ,USA,2
Single-ply,Masters 47-53,M,B,125,Bradley Butler,182.5,,,,182.5,LA,USA,1
Single-ply,Masters 47-53,M,B,140,Bill Gillespie,325,,,,325,VA,USA,1
Single-ply,Masters 47-53,M,B,140,Joe Mickelson,217.5,,,,217.5,WA,USA,2
Single-ply,Masters 47-53,M,B,140+,James Mersberg,142.5,,,,142.5,HI,USA,1
Single-ply,Masters 47-53,M,B,140+,Keith Sayles,137.5,,,,137.5,TX,USA,2
Multi-ply,Masters 54-60,M,B,117.5,Ken Tawzer,160,,,,160,CA,USA,1
Single-ply,Masters 54-60,M,B,60,Jean-Michel Moreiro,100,,,,100,,France,1
Single-ply,Masters 54-60,M,B,67.5,Alfredo Evangelista,190,,,,190,OR,USA,1
Single-ply,Masters 54-60,M,B,75,Ken Van Buren,157.5,,,,157.5,AZ,USA,1
Single-ply,Masters 54-60,M,B,75,Gary Miller #2,,,,,,NV,USA,DQ
Single-ply,Masters 54-60,M,B,82.5,Jody Fjelstad,167.5,,,,167.5,MN,USA,1
Single-ply,Masters 54-60,M,B,82.5,Tom Gonnering,162.5,,,,162.5,AL,USA,2
Single-ply,Masters 54-60,M,B,82.5,Flavio Baptista da Costa,145,,,,145,,Brazil,3
Single-ply,Masters 54-60,M,B,82.5,David Wentworth,,,,,,ME,USA,DQ
Single-ply,Masters 54-60,M,B,90,Ernest Reyes,175,,,,175,UT,USA,1
Single-ply,Masters 54-60,M,B,90,Maurice Lowry,172.5,,,,172.5,OK,USA,2
Single-ply,Masters 54-60,M,B,90,Jorge Guardado,117.5,,,,117.5,OK,USA,3
Single-ply,Masters 54-60,M,B,90,John McBroom,107.5,,,,107.5,CA,USA,4
Single-ply,Masters 54-60,M,B,100,Tim Epting,137.5,,,,137.5,TX,USA,1
Single-ply,Masters 54-60,M,B,100,Jim Curley,,,,,,CO,USA,DQ
Single-ply,Masters 54-60,M,B,110,Gary Stevens,192.5,,,,192.5,WY,USA,1
Single-ply,Masters 54-60,M,B,110,William B Caughey,100,,,,100,UT,USA,2
Single-ply,Masters 54-60,M,B,117.5,Willard Crossen Jr,285,,,,285,WA,USA,1
Single-ply,Masters 54-60,M,B,117.5,David Wolf,182.5,,,,182.5,WY,USA,2
Single-ply,Masters 54-60,M,B,125,Austin Webb,192.5,,,,192.5,AR,USA,1
Single-ply,Masters 54-60,M,B,125,Jeff Fahrenbruch,,,,,,AZ,USA,DQ
Single-ply,Masters 54-60,M,B,140+,Leo Contreras,180,,,,180,CA,USA,1
Multi-ply,Masters 61-67,M,B,100,Charles Fayle,160,,,,160,TX,USA,1
Single-ply,Masters 61-67,M,B,56,Homi Shivaie,90,92.5,,,90,CA,USA,1
Single-ply,Masters 61-67,M,B,67.5,Moses Timbal,105,,,,105,HI,USA,1
Single-ply,Masters 61-67,M,B,75,Stefan Lemire,120,,,,120,UT,USA,1
Single-ply,Masters 61-67,M,B,82.5,Daniel Hofeditz,137.5,,,,137.5,AZ,USA,1
Single-ply,Masters 61-67,M,B,82.5,Michel Rioland,127.5,,,,127.5,,France,2
Single-ply,Masters 61-67,M,B,82.5,Jerome Mautner,115,,,,115,CA,USA,3
Single-ply,Masters 61-67,M,B,82.5,Jeffery Thornton,115,,,,115,AZ,USA,4
Single-ply,Masters 61-67,M,B,90,Dan Swift,210,,,,210,IL,USA,1
Single-ply,Masters 61-67,M,B,90,Joe Beteta,178.5,,,,178.5,OR,USA,2
Single-ply,Masters 61-67,M,B,90,Godfrey Holzinger,142.5,,,,142.5,WA,USA,3
Single-ply,Masters 61-67,M,B,90,Ron Jones,140,,,,140,AL,USA,4
Single-ply,Masters 61-67,M,B,100,Al Williamson,145,,,,145,WI,USA,1
Single-ply,Masters 61-67,M,B,100,Julian Leos Jr,127.5,,,,127.5,NV,USA,2
Single-ply,Masters 61-67,M,B,110,Bob Evans #3,195,,,,195,CA,USA,1
Single-ply,Masters 61-67,M,B,110,Jim Parham,182.5,,,,182.5,OK,USA,2
Single-ply,Masters 61-67,M,B,110,Kenney Phillips,157.5,,,,157.5,OK,USA,3
Single-ply,Masters 61-67,M,B,110,Thomas Wright,120,,,,120,KS,USA,4
Single-ply,Masters 61-67,M,B,110,George Weiss,47.5,,,,47.5,CA,USA,5
Single-ply,Masters 61-67,M,B,125,Ron Moormeister,185,,,,185,CA,USA,1
Single-ply,Masters 61-67,M,B,125,Jim Graham,155,,,,155,CA,USA,2
Single-ply,Masters 61-67,M,B,140+,Allen Miluso,72.5,,,,72.5,CA,USA,1
Single-ply,Masters 61-67,M,B,140+,Alan Fraser,,,,,,NV,USA,DQ
Single-ply,Masters 68-74,M,B,82.5,Ed Angstrom,150,,,,150,IA,USA,1
Single-ply,Masters 68-74,M,B,82.5,Earle Conway,107.5,,,,107.5,AZ,USA,2
Single-ply,Masters 68-74,M,B,82.5,Arnold Pereza,100,,,,100,HI,USA,3
Single-ply,Masters 68-74,M,B,82.5,Larry Joiner,92.5,,,,92.5,CA,USA,4
Single-ply,Masters 68-74,M,B,90,Rudy Lozano,176,,,,176,CA,USA,1
Single-ply,Masters 68-74,M,B,90,Michael Minietta,155,,,,155,NV,USA,2
Single-ply,Masters 68-74,M,B,90,James Rouse,150,,,,150,IL,USA,3
Single-ply,Masters 68-74,M,B,90,Steve Bloom,145,,,,145,CA,USA,4
Single-ply,Masters 68-74,M,B,90,Sonny Nummi,122.5,,,,122.5,ID,USA,5
Single-ply,Masters 68-74,M,B,90,John Herbein,110,,,,110,PA,USA,6
Single-ply,Masters 68-74,M,B,90,Dean Baker,47.5,,,,47.5,CA,USA,7
Single-ply,Masters 68-74,M,B,100,Alfred Franke,153.5,,,,153.5,NV,USA,1
Single-ply,Masters 68-74,M,B,100,Robert Urrea,132.5,,,,132.5,CA,USA,2
Single-ply,Masters 68-74,M,B,100,Ronald Ford,66,,,,66,CA,USA,3
Single-ply,Masters 68-74,M,B,110,William Prince,160.5,,,,160.5,NV,USA,1
Single-ply,Masters 68-74,M,B,140,Ed Acey,175,,,,175,UT,USA,1
Single-ply,Masters 75-79,M,B,75,Andre Charbit,102.5,,,,102.5,,France,1
Single-ply,Masters 75-79,M,B,75,Bill Tinkler,90,,,,90,FL,USA,2
Single-ply,Masters 75-79,M,B,75,Charles Vause,87.5,,,,87.5,GA,USA,3
Single-ply,Masters 75-79,M,B,82.5,John McEwen,85,,,,85,CA,USA,1
Single-ply,Masters 75-79,M,B,82.5,David Boyes,57.5,,,,57.5,LA,USA,2
Single-ply,Masters 75-79,M,B,100,Richard Austin,157.5,,,,157.5,ME,USA,1
Single-ply,Masters 80-84,M,B,75,Joseph Cavness,92.5,,,,92.5,CA,USA,1
Single-ply,Masters 80-84,M,B,82.5,Nixon Munly,75,,,,75,OR,USA,1
Single-ply,Masters 80-84,M,B,82.5,George Choi,56,,,,56,CA,USA,2
Single-ply,Masters 85-89,M,B,67.5,Arthur Whinston,32.5,,,,32.5,OR,USA,1
Single-ply,Masters 85-89,M,B,75,Bladen McClelland,65,67.5,,,65,MI,USA,1
Single-ply,Masters 85-89,M,B,90,Rodney Graves,63,,,,63,NV,USA,1
Multi-ply,Law-Fire Open,M,B,140,Tracy Lundin,265,272.5,,,265,OR,USA,1
Single-ply,Law-Fire Open,M,B,82.5,Mike Ryan,215,,,,215,MI,USA,1
Single-ply,Law-Fire Open,M,B,82.5,Dave Claroni,142.5,,,,142.5,ME,USA,2
Single-ply,Law-Fire Open,M,B,90,Nick Berriman,212.5,,,,212.5,OR,USA,1
Single-ply,Law-Fire Open,M,B,90,Brian Pittman,142.5,,,,142.5,OH,USA,2
Single-ply,Law-Fire Open,M,B,110,Gary McFarland,248,,,,248,CA,USA,1
Single-ply,Law-Fire Open,M,B,117.5,Jeffrey Begue,290,,,,290,OH,USA,1
Single-ply,Law-Fire Submasters,M,B,82.5,Dave Claroni,142.5,,,,142.5,ME,USA,1
Single-ply,Law-Fire Submasters,M,B,90,Nick Berriman,212.5,,,,212.5,OR,USA,1
Single-ply,Law-Fire Submasters,M,B,100,Darryl Zuchelli,192.5,,,,192.5,AL,USA,1
Single-ply,Law-Fire Submasters,M,B,100,Anthony Floyd,192.5,,,,192.5,TX,USA,2
Single-ply,Law-Fire Submasters,M,B,117.5,Jeffrey Begue,290,,,,290,OH,USA,1
Multi-ply,Law-Fire 40-47,M,B,82.5,Darren Carr,,,,,,UT,USA,DQ
Multi-ply,Law-Fire 40-47,M,B,110,Frank Wakakuwa,250,,,,250,NV,USA,1
Multi-ply,Law-Fire 40-47,M,B,140,Tracy Lundin,265,272.5,,,265,OR,USA,1
Single-ply,Law-Fire 40-47,M,B,100,Barran Stone,182.5,,,,182.5,TX,USA,1
Single-ply,Law-Fire 40-47,M,B,110,Gary McFarland,235,,,,235,CA,USA,1
Single-ply,Law-Fire 40-47,M,B,117.5,Jerry Warren,182.5,,,,182.5,OK,USA,1
Single-ply,Law-Fire 40-47,M,B,140,Warren Orr,227.5,,,,227.5,,Canada,1
Single-ply,Law-Fire 40-47,M,B,140+,Ken Havlicek,127.5,,,,127.5,AZ,USA,1
Multi-ply,Law-Fire 48-55,M,B,140,Roger Ryan,342.5,,,,342.5,IL,USA,1
Single-ply,Law-Fire 48-55,M,B,90,Luis Fernando Meireles Dias,160,,,,160,,Brazil,1
Single-ply,Law-Fire 48-55,M,B,100,William Denniston,180,,,,180,MI,USA,1
Single-ply,Law-Fire 48-55,M,B,140,Dennis Schultz,280,,,,280,CA,USA,1
Multi-ply,Open,F,B,60,Jill Porter,82.5,,,,82.5,TX,USA,1
Multi-ply,Open,F,B,67.5,Christie Luehrs,87.5,,,,87.5,OR,USA,1
Multi-ply,Open,F,B,67.5,Shawna Sheffield,,,,,,CA,USA,DQ
Multi-ply,Open,F,B,67.5,Rachele Unson,,,,,,WA,USA,DQ
Single-ply,Open,F,B,48,Colleen Loo,57.5,,,,57.5,HI,USA,1
Single-ply,Open,F,B,52,Betty Lafferty,72.5,,,,72.5,AL,USA,1
Single-ply,Open,F,B,52,Amparo Barajas,60,,,,60,TX,USA,2
Single-ply,Open,F,B,56,Siu Whitehead,45,,,,45,HI,USA,3
Single-ply,Open,F,B,56,Amanda Harris,87.5,,,,87.5,TX,USA,1
Single-ply,Open,F,B,56,Jazlynn Bennett,60,,,,60,WA,USA,2
Single-ply,Open,F,B,60,Velma Panlasigui,62.5,,,,62.5,HI,USA,1
Single-ply,Open,F,B,60,Dolores Garcia-Munro,47.5,,,,47.5,CA,USA,2
Single-ply,Open,F,B,67.5,Shauna Perry,115,,,,115,HI,USA,1
Single-ply,Open,F,B,67.5,Virpi Pukkila,,,,,,,Finland,DQ
Single-ply,Open,F,B,75,Ana Catia Portilho Couto,85,,,,85,,Brazil,1
Single-ply,Open,F,B,82.5,Gayle Clawson,90,,,,90,AZ,USA,1
Single-ply,Open,F,B,90,Karen Campbell,182.5,,,,182.5,ME,USA,1
Single-ply,Open,F,B,90,Anna Knapski,65,,,,65,OH,USA,2
Single-ply,Open,F,B,44,Elizabeth Cabe,47.5,,,,47.5,HI,USA,1
Single-ply,Teen 14-15,F,B,60,Alexandra Pecktol,47.5,,,,47.5,OR,USA,1
Single-ply,Teen 14-15,F,B,67.5,Ali Miskinis,68.5,,,,68.5,OH,USA,1
Single-ply,Teen 14-15,F,B,75,Sydney Ruth,35,,,,35,CA,USA,1
Single-ply,Teen 16-17,F,B,52,Cheyenne Tavares,55,,,,55,HI,USA,1
Single-ply,Teen 16-17,F,B,56,Mercedas Castillo,45,,,,45,CA,USA,2
Single-ply,Teen 16-17,F,B,56,Deborah Brown,55,,,,55,WA,USA,1
Single-ply,Teen 16-17,F,B,67.5,Kasey Sauerwein,40,,,,40,CA,USA,2
Single-ply,Teen 16-17,F,B,67.5,Amanda Hesterman,55,,,,55,CA,USA,1
Single-ply,Teen 16-17,F,B,75,Nicole Cartwright,57.5,,,,57.5,CA,USA,1
Single-ply,Teen 16-17,F,B,75,Kaitlin Gomez,50,,,,50,TX,USA,2
Multi-ply,Teen 18-19,F,B,52,Jessica Okimura,70,,,,70,HI,USA,1
Single-ply,Teen 18-19,F,B,48,Angela Rocha,55,,,,55,TX,USA,1
Single-ply,Teen 18-19,F,B,56,Lizzie Carey,45,,,,45,WA,USA,2
Single-ply,Teen 18-19,F,B,56,Amanda Harris,87.5,,,,87.5,TX,USA,1
Single-ply,Teen 18-19,F,B,67.5,Sarah Biddle,72.5,,,,72.5,IN,USA,1
Single-ply,Teen 18-19,F,B,75,Tasha Dotson,45,,,,45,WA,USA,1
Single-ply,Teen 18-19,F,B,90,Anna Knapski,77.5,,,,77.5,OH,USA,1
Single-ply,Teen 18-19,F,B,44,Geri Cunningham,55.5,,,,55.5,UT,USA,1
Single-ply,Teen 18-19,F,B,90+,Rachael Richey,97.5,,,,97.5,TX,USA,1
Single-ply,Teen 18-19,F,B,90+,Tashika Sandoval,80,,,,80,TX,USA,2
Single-ply,Teen 18-19,F,B,90+,Priscilla Ortiz,,,,,,TX,USA,DQ
Single-ply,Teen 18-19,F,B,90+,Sasha Martinez,,,,,,TX,USA,DQ
Single-ply,Juniors 20-25,F,B,48,Colleen Loo,57.5,,,,57.5,HI,USA,1
Single-ply,Juniors 20-25,F,B,67.5,Krystal Miller,90,,,,90,NV,USA,1
Single-ply,Juniors 20-25,F,B,67.5,Linda Okoro,87.5,,,,87.5,TX,USA,2
Single-ply,Juniors 20-25,F,B,67.5,Katie Larsen,,,,,,WA,USA,DQ
Single-ply,Juniors 20-25,F,B,75,Lauren Vaterlaus,70,,,,70,CA,USA,1
Single-ply,Juniors 20-25,F,B,90,Lisa Herrera,107.5,,,,107.5,WA,USA,1
Single-ply,Juniors 20-25,F,B,90,Olga Hernandez,75.5,,,,75.5,TX,USA,2
Multi-ply,Submasters 33-39,F,B,90+,Julie Kimoto,137.5,142.5,,,137.5,HI,USA,1
Single-ply,Submasters 33-39,F,B,75,Marelena Da Silva Hensimg,60,,,,60,,Brazil,1
Single-ply,Submasters 33-39,F,B,75,Allison Crescione,57.5,,,,57.5,CA,USA,2
Single-ply,Submasters 33-39,F,B,82.5,Anetta Replogle,117.5,,,,117.5,NV,USA,1
Single-ply,Submasters 33-39,F,B,82.5,Lori Barlow,70,,,,70,CA,USA,2
Multi-ply,Masters 40-46,F,B,67.5,Rachele Unson,92.5,,,,92.5,WA,USA,1
Single-ply,Masters 40-46,F,B,52,Yu-Xin Hao,85,88,,,85,OH,USA,1
Single-ply,Masters 40-46,F,B,52,Josette Villegas,47.5,,,,47.5,CA,USA,2
Single-ply,Masters 40-46,F,B,56,Siu Whitehead,57.5,,,,57.5,HI,USA,1
Single-ply,Masters 40-46,F,B,60,Velma Panlasigui,62.5,,,,62.5,HI,USA,1
Single-ply,Masters 40-46,F,B,60,Beth Fuchs,52.5,,,,52.5,CA,USA,2
Single-ply,Masters 40-46,F,B,67.5,Virpi Pukkila,117.5,,,,117.5,,Finland,1
Single-ply,Masters 40-46,F,B,75,Lucia Feraud Montenegro,90,,,,90,,Ecuador,1
Single-ply,Masters 40-46,F,B,75,Ana Catia Portilho Couto,85,,,,85,,Brazil,2
Single-ply,Masters 40-46,F,B,75,Stacia Smith,52.5,,,,52.5,CA,USA,3
Single-ply,Masters 40-46,F,B,90,Michonne Berry,147.5,,,,147.5,IL,USA,1
Single-ply,Masters 40-46,F,B,44,Elizabeth Cabe,47.5,,,,47.5,HI,USA,1
Multi-ply,Masters 47-53,F,B,56,Nan Helms,60.5,,,,60.5,OR,USA,1
Multi-ply,Masters 47-53,F,B,60,Janet Montgomery,55,,,,55,OR,USA,1
Multi-ply,Masters 47-53,F,B,60,Diana Sutton,,,,,,OR,USA,DQ
Multi-ply,Masters 47-53,F,B,75,Lisa Staplin,107.5,,,,107.5,MN,USA,1
Single-ply,Masters 47-53,F,B,52,Lisa Nerio,60,,,,60,CO,USA,1
Single-ply,Masters 47-53,F,B,56,Jackie Steele,62.5,,,,62.5,WA,USA,1
Single-ply,Masters 47-53,F,B,56,Sarah Sanford,,,,,,MN,USA,DQ
Single-ply,Masters 47-53,F,B,60,Jan Monson,42.5,,,,42.5,CA,USA,2
Single-ply,Masters 47-53,F,B,60,Dolores Garcia-Munro,47.5,,,,47.5,CA,USA,1
Single-ply,Masters 47-53,F,B,67.5,Beverly Anolin,103,,,,103,CA,USA,1
Single-ply,Masters 47-53,F,B,75,Cyndi Crossland,110,,,,110,OK,USA,1
Single-ply,Masters 47-53,F,B,82.5,Iraci Fatima Fenner,40,,,,40,,Brazil,1
Single-ply,Masters 47-53,F,B,90,Karen Campbell,182.5,,,,182.5,ME,USA,1
Multi-ply,Masters 54-60,F,B,52,Robyn Nelson,52.5,,,,52.5,OR,USA,1
Multi-ply,Masters 54-60,F,B,60,Jill Porter,82.5,,,,82.5,TX,USA,1
Multi-ply,Masters 54-60,F,B,90,Margie Huston,92.5,,,,92.5,WA,USA,1
Single-ply,Masters 54-60,F,B,56,Sherri Rowland,42.5,,,,42.5,CA,USA,2
Single-ply,Masters 54-60,F,B,56,Karon Denniston,60,,,,60,MI,USA,1
Single-ply,Masters 54-60,F,B,67.5,Peach Presley,72.5,73.5,,,72.5,CA,USA,1
Single-ply,Masters 54-60,F,B,67.5,Lisa Flannery,60,,,,60,CA,USA,2
Single-ply,Masters 54-60,F,B,67.5,Marsha Goodman,57.5,,,,57.5,AZ,USA,3
Single-ply,Masters 54-60,F,B,75,Jane Stabile,80,82.5,,,80,MA,USA,1
Single-ply,Masters 54-60,F,B,75,Virginia Emond,67.5,,,,67.5,NV,USA,2
Single-ply,Masters 54-60,F,B,82.5,Wilma Lee Cadavona,87.5,,,,87.5,ID,USA,1
Single-ply,Masters 54-60,F,B,90+,Sue Vaterlaus,107.5,,,,107.5,CA,USA,1
Single-ply,Masters 61-67,F,B,67.5,Dawn Cole,40,,,,40,CA,USA,1
Single-ply,Masters 61-67,F,B,82.5,Gayle Clawson,97.5,,,,97.5,AZ,USA,1
Single-ply,Masters 61-67,F,B,90,Julia Aaron-Boliver,60,,,,60,TX,USA,1
Single-ply,Masters 68-74,F,B,52,Jacqueline Templer,42.5,,,,42.5,AZ,USA,2
Single-ply,Masters 68-74,F,B,52,Betty Lafferty,70,,,,70,AL,USA,1
Single-ply,Masters 68-74,F,B,60,Sue Clark,52.5,,,,52.5,TX,USA,1
Single-ply,Masters 68-74,F,B,67.5,Lynn Ford,27.5,,,,27.5,CA,USA,1
Single-ply,Masters 68-74,F,B,82.5,Barbara Meraz,35,,,,35,CA,USA,1
Single-ply,Masters 68-74,F,B,90,Winifred Pristell,75,,,,75,WA,USA,1
Single-ply,Masters 80-84,F,B,67.5,Melicent Whinston,35,,,,35,OR,USA,1
Single-ply,Law-Fire Open,F,B,75,Sarah Biddle,70,,,,70,IN,USA,1
Multi-ply,Law-Fire Submasters,F,B,90+,Julie Kimoto,,,,,,HI,USA,DQ
Single-ply,Law-Fire 40-47,F,B,60,Simone Fulginiti Pfutzenreuter,40,,,,40,,Brazil,1
Single-ply,Law-Fire 56+,F,B,90,Julia Aaron-Boliver,60,,,,60,TX,USA,1
Single-ply,Open,F,D,48,Colleen Loo,,,132.5,,132.5,HI,USA,1
Single-ply,Open,F,D,52,Amparo Barajas,,,105,,105,TX,USA,1
Single-ply,Open,F,D,56,Siu Whitehead,,,137.5,,137.5,HI,USA,1
Single-ply,Open,F,D,60,Velma Panlasigui,,,137.5,,137.5,HI,USA,1
Single-ply,Open,F,D,60,Jill Porter,,,120.5,,120.5,TX,USA,2
Single-ply,Open,F,D,60,Dolores Garcia-Munro,,,120,,120,CA,USA,3
Single-ply,Open,F,D,60,Angie Robertson,,,,,,AZ,USA,DQ
Single-ply,Open,F,D,67.5,Jane McCubbin,,,182.5,,182.5,WI,USA,1
Single-ply,Open,F,D,67.5,Darnell Criste,,,165,,165,HI,USA,2
Single-ply,Open,F,D,67.5,Shauna Perry,,,155,,155,HI,USA,3
Single-ply,Open,F,D,67.5,Rachele Unson,,,147.5,,147.5,WA,USA,4
Single-ply,Open,F,D,67.5,Shawna Sheffield,,,132.5,,132.5,CA,USA,5
Single-ply,Open,F,D,75,Ana Catia Portilho Couto,,,170,,170,,Brazil,1
Single-ply,Open,F,D,82.5,Rebekah Schmidt,,,215,,215,MN,USA,1
Single-ply,Open,F,D,82.5,Gayle Clawson,,,155,,155,AZ,USA,2
Single-ply,Open,F,D,90,Karen Campbell,,,202.5,,202.5,ME,USA,1
Single-ply,Open,F,D,44,Elizabeth Cabe,,,132.5,,132.5,HI,USA,1
Single-ply,Teen 14-15,F,D,56,Gabriela Damasceno,,,90,,90,,Brazil,1
Single-ply,Teen 14-15,F,D,60,Alexandra Pecktol,,,120,,120,OR,USA,1
Single-ply,Teen 14-15,F,D,67.5,Ali Miskinis,,,108.5,,108.5,OH,USA,1
Single-ply,Teen 14-15,F,D,75,Sydney Ruth,,,82.5,,82.5,CA,USA,1
Single-ply,Teen 16-17,F,D,52,Cheyenne Tavares,,,127.5,,127.5,HI,USA,1
Single-ply,Teen 16-17,F,D,56,Mercedas Castillo,,,100,,100,CA,USA,1
Single-ply,Teen 16-17,F,D,56,Deborah Brown,,,97.5,,97.5,WA,USA,2
Single-ply,Teen 16-17,F,D,67.5,Amanda Hesterman,,,110,,110,CA,USA,1
Single-ply,Teen 16-17,F,D,67.5,Kasey Sauerwein,,,87.5,,87.5,CA,USA,2
Single-ply,Teen 16-17,F,D,75,Nicole Cartwright,,,147.5,,147.5,CA,USA,1
Single-ply,Teen 16-17,F,D,75,Kaitlin Gomez,,,110,,110,TX,USA,2
Single-ply,Teen 16-17,F,D,90,Jacqueline Wickens,,,167.5,,167.5,NV,USA,1
Single-ply,Teen 18-19,F,D,48,Angela Rocha,,,117.5,,117.5,TX,USA,1
Single-ply,Teen 18-19,F,D,56,Lizzie Carey,,,112.5,,112.5,WA,USA,1
Single-ply,Teen 18-19,F,D,67.5,Sarah Biddle,,,145,,145,IN,USA,1
Single-ply,Teen 18-19,F,D,75,Tasha Dotson,,,122.5,,122.5,WA,USA,1
Single-ply,Teen 18-19,F,D,90,Anna Knapski,,,163,167.5,163,OH,USA,1
Single-ply,Teen 18-19,F,D,90+,Sasha Martinez,,,182.5,,182.5,TX,USA,1
Single-ply,Teen 18-19,F,D,90+,Priscilla Ortiz,,,155,,155,TX,USA,2
Single-ply,Teen 18-19,F,D,90+,Rachael Richey,,,140,,140,TX,USA,3
Single-ply,Teen 18-19,F,D,90+,Tashika Sandoval,,,125,,125,TX,USA,4
Single-ply,Juniors 20-25,F,D,48,Colleen Loo,,,132.5,,132.5,HI,USA,1
Single-ply,Juniors 20-25,F,D,67.5,Linda Okoro,,,210.5,,210.5,TX,USA,1
Single-ply,Juniors 20-25,F,D,67.5,Katie Larsen,,,145,,145,WA,USA,2
Single-ply,Juniors 20-25,F,D,67.5,Krystal Miller,,,122.5,,122.5,NV,USA,3
Single-ply,Submasters 33-39,F,D,67.5,Tracy Garcia,,,140,,140,AZ,USA,1
Single-ply,Submasters 33-39,F,D,75,Marelena Da Silva Hensimg,,,160,,160,,Brazil,1
Single-ply,Submasters 33-39,F,D,82.5,Anetta Replogle,,,183,,183,NV,USA,1
Single-ply,Masters 40-46,F,D,52,Yu-Xin Hao,,,125,,125,OH,USA,1
Single-ply,Masters 40-46,F,D,56,Siu Whitehead,,,137.5,,137.5,HI,USA,1
Single-ply,Masters 40-46,F,D,60,Velma Panlasigui,,,137.5,,137.5,HI,USA,1
Single-ply,Masters 40-46,F,D,67.5,Rachele Unson,,,147.5,,147.5,WA,USA,1
Single-ply,Masters 40-46,F,D,75,Ana Catia Portilho Couto,,,170,,170,,Brazil,1
Single-ply,Masters 40-46,F,D,75,Lucia Feraud Montenegro,,,150,,150,,Ecuador,2
Single-ply,Masters 40-46,F,D,82.5,Cathy Whitworth,,,160,,160,OR,USA,1
Single-ply,Masters 40-46,F,D,90,Michonne Berry,,,137.5,,137.5,IL,USA,1
Single-ply,Masters 40-46,F,D,44,Elizabeth Cabe,,,132.5,,132.5,HI,USA,1
Single-ply,Masters 47-53,F,D,56,Jeanne Morris,,,97.5,,97.5,WA,USA,1
Single-ply,Masters 47-53,F,D,60,Martha Godinez-Shim,,,132.5,,132.5,HI,USA,1
Single-ply,Masters 47-53,F,D,60,Dolores Garcia-Munro,,,120,,120,CA,USA,2
Single-ply,Masters 47-53,F,D,67.5,Jane McCubbin,,,182.5,,182.5,WI,USA,1
Single-ply,Masters 47-53,F,D,67.5,Beverly Anolin,,,167.5,,167.5,CA,USA,2
Single-ply,Masters 47-53,F,D,67.5,Darnell Criste,,,165,,165,HI,USA,3
Single-ply,Masters 47-53,F,D,75,Josefina Jackson,,,137.5,,137.5,TX,USA,1
Single-ply,Masters 47-53,F,D,75,Ginny McHale,,,115,,115,CO,USA,2
Single-ply,Masters 47-53,F,D,82.5,Suzanne Spero,,,165,,165,MA,USA,1
Single-ply,Masters 47-53,F,D,82.5,Iraci Fatima Fenner,,,120,,120,,Brazil,2
Single-ply,Masters 47-53,F,D,90,Karen Campbell,,,202.5,,202.5,ME,USA,1
Single-ply,Masters 47-53,F,D,90,Pamela Michaels-Olson,,,160,,160,WA,USA,2
Single-ply,Masters 54-60,F,D,56,Karon Denniston,,,100,,100,MI,USA,1
Single-ply,Masters 54-60,F,D,60,Jill Porter,,,120.5,,120.5,TX,USA,1
Single-ply,Masters 54-60,F,D,67.5,Lisa Flannery,,,107.5,,107.5,CA,USA,1
Single-ply,Masters 54-60,F,D,67.5,Marsha Goodman,,,105,,105,AZ,USA,2
Single-ply,Masters 54-60,F,D,75,Jane Stabile,,,160,,160,MA,USA,1
Single-ply,Masters 54-60,F,D,90,Margie Huston,,,135,,135,WA,USA,1
Single-ply,Masters 61-67,F,D,75,Dana Backiel,,,120,,120,WA,USA,1
Single-ply,Masters 61-67,F,D,82.5,Gayle Clawson,,,155,,155,AZ,USA,1
Single-ply,Masters 61-67,F,D,82.5,Karen Harding,,,137.5,,137.5,MA,USA,2
Single-ply,Masters 68-74,F,D,52,Betty Lafferty,,,97.5,,97.5,AL,USA,1
Single-ply,Masters 68-74,F,D,60,Sue Clark,,,122.5,,122.5,TX,USA,1
Single-ply,Masters 68-74,F,D,67.5,Lynn Ford,,,62.5,,62.5,CA,USA,1
Single-ply,Masters 68-74,F,D,90,Winifred Pristell,,,117.5,,117.5,WA,USA,1
Single-ply,Masters 80-84,F,D,67.5,Melicent Whinston,,,72.5,,72.5,OR,USA,1
Single-ply,Law-Fire Open,F,D,75,Sarah Biddle,,,137.5,,137.5,IN,USA,1
Single-ply,Law-Fire 40-47,F,D,60,Simone Fulginiti Pfutzenreuter,,,90,,90,,Brazil,1
Single-ply,Open,M,D,60,Gary Hunter #1,,,160,,160,TX,USA,1
Single-ply,Open,M,D,67.5,Dean Kaneshiro,,,245.5,250,245.5,HI,USA,1
Single-ply,Open,M,D,67.5,Alfredo Evangelista,,,227.5,,227.5,OR,USA,2
Single-ply,Open,M,D,67.5,Willis McCoy,,,217.5,,217.5,OH,USA,3
Single-ply,Open,M,D,75,Eriek Nickson,,,325,,325,IN,USA,1
Single-ply,Open,M,D,75,Ryan Snelling,,,295,,295,MO,USA,2
Single-ply,Open,M,D,75,David Felton,,,250,,250,WI,USA,3
Single-ply,Open,M,D,75,Richard Cirigliano,,,245,,245,CA,USA,4
Single-ply,Open,M,D,82.5,Edwin Manmano,,,315,,315,HI,USA,1
Single-ply,Open,M,D,82.5,Leamon Woodley,,,282.5,,282.5,WA,USA,2
Single-ply,Open,M,D,82.5,David Hansen,,,277.5,,277.5,ND,USA,3
Single-ply,Open,M,D,82.5,Robert Wells,,,250,,250,MA,USA,4
Single-ply,Open,M,D,82.5,Sakari Selkäinaho,,,,,,,Finland,DQ
Single-ply,Open,M,D,90,Tom Eiseman,,,325,,325,NJ,USA,1
Single-ply,Open,M,D,90,Matthew Marsiglia,,,302.5,,302.5,MI,USA,2
Single-ply,Open,M,D,90,Jared Wilsey,,,300,,300,TN,USA,3
Single-ply,Open,M,D,90,Gary Ferstler,,,295,,295,HI,USA,4
Single-ply,Open,M,D,90,Eddie DiFruscia,,,277.5,,277.5,NH,USA,5
Single-ply,Open,M,D,90,Michael Tirado,,,240,,240,NY,USA,6
Single-ply,Open,M,D,100,Petri Hietamäki,,,315,,315,,Finland,1
Single-ply,Open,M,D,100,Steve LeMarié,,,300,,300,LA,USA,2
Single-ply,Open,M,D,100,Tim Sparkes,,,287.5,,287.5,AZ,USA,3
Single-ply,Open,M,D,110,Kuliyev Bakhtiyar,,,366.5,,366.5,,Azerbaijan,1
Single-ply,Open,M,D,110,Kari Pöntinen,,,330,,330,,Finland,2
Single-ply,Open,M,D,110,Antti Kousa,,,310,,310,,Finland,3
Single-ply,Open,M,D,110,Ron L'Huillier,,,298,,298,MI,USA,4
Single-ply,Open,M,D,110,Robert Schleder,,,282.5,,282.5,AZ,USA,5
Single-ply,Open,M,D,110,John Anthony,,,275,,275,OR,USA,6
Single-ply,Open,M,D,110,Brian Birchmeier,,,250,,250,MI,USA,7
Single-ply,Open,M,D,110,Mike Desrosiers,,,247.5,,247.5,AZ,USA,8
Single-ply,Open,M,D,110,Alex Anaya,,,,,,AZ,USA,DQ
Single-ply,Open,M,D,110,Al Bianchi,,,,,,MA,USA,DQ
Single-ply,Open,M,D,110,Brent Howard,,,,,,NV,USA,DQ
Single-ply,Open,M,D,117.5,Tom Emelander,,,348,,348,TX,USA,1
Single-ply,Open,M,D,117.5,Bobby Driskill,,,290,,290,AL,USA,2
Single-ply,Open,M,D,117.5,Terry Putman,,,287.5,,287.5,OK,USA,3
Single-ply,Open,M,D,117.5,Austin Shipley,,,282.5,,282.5,AZ,USA,4
Single-ply,Open,M,D,125,Patrick Holloway,,,382.5,,382.5,AZ,USA,1
Single-ply,Open,M,D,125,Nicolas Lepine,,,295,,295,IL,USA,2
Single-ply,Open,M,D,140,Jim Nickerson,,,340,,340,OR,USA,1
Single-ply,Open,M,D,140,Joe Mickelson,,,250,,250,WA,USA,2
Single-ply,Open,M,D,140+,Jerry Pritchett,,,342.5,,342.5,AZ,USA,1
Single-ply,Open,M,D,140+,Paul Paldino,,,295,,295,MA,USA,2
Single-ply,Open,M,D,140+,Dave Forstner,,,282.5,,282.5,MI,USA,3
Single-ply,Class 1,M,D,56,Homie Shivaie,,,175,,175,CA,USA,1
Single-ply,Class 1,M,D,60,Colas Falon,,,202.5,,202.5,MN,USA,1
Single-ply,Class 1,M,D,67.5,Dave Constantineau,,,205,,205,WI,USA,1
Single-ply,Class 1,M,D,82.5,Aaron Brown,,,255,,255,OR,USA,1
Single-ply,Class 1,M,D,82.5,Chris McGrail,,,232.5,,232.5,UT,USA,2
Single-ply,Class 1,M,D,82.5,Manuel Alejandro Chaparro,,,192.5,,192.5,HI,USA,3
Single-ply,Class 1,M,D,90,Brad Koyle,,,285.5,,285.5,UT,USA,1
Single-ply,Class 1,M,D,90,Shaun Orta,,,272.5,,272.5,WA,USA,2
Single-ply,Class 1,M,D,90,Kevin Fahrenfeld,,,272.5,,272.5,NJ,USA,3
Single-ply,Class 1,M,D,90,Nathan Navares,,,265,,265,HI,USA,4
Single-ply,Class 1,M,D,90,Mark Pearce,,,257.5,,257.5,TX,USA,5
Single-ply,Class 1,M,D,90,Andy Whitaker,,,247.5,,247.5,LA,USA,6
Single-ply,Class 1,M,D,90,Joseph Reyes,,,245,,245,AZ,USA,7
Single-ply,Class 1,M,D,90,Nick Pinto,,,210,,210,OH,USA,8
Single-ply,Class 1,M,D,90,Guadalupe Trevino,,,157.5,,157.5,TX,USA,9
Single-ply,Class 1,M,D,100,Jeremy Drecksel,,,275.5,,275.5,UT,USA,1
Single-ply,Class 1,M,D,100,Brian Fahrenfeld,,,275,,275,NY,USA,2
Single-ply,Class 1,M,D,100,Thomas Reiher,,,237.5,,237.5,HI,USA,3
Single-ply,Class 1,M,D,100,Eric Oleson,,,235,,235,AZ,USA,4
Single-ply,Class 1,M,D,100,Kyle Herzik,,,230,,230,NV,USA,5
Single-ply,Class 1,M,D,100,Richard Curran,,,230,,230,WA,USA,6
Single-ply,Class 1,M,D,100,Doug Amburgey,,,207.5,,207.5,OH,USA,7
Single-ply,Class 1,M,D,110,Dennis Schmidt Jr,,,255,,255,MN,USA,1
Single-ply,Class 1,M,D,110,Fateh Sihota,,,250,,250,,India,2
Single-ply,Class 1,M,D,110,Matt Maini,,,200,,200,AL,USA,3
Single-ply,Class 1,M,D,110,Alex Anaya,,,,,,AZ,USA,DQ
Single-ply,Class 1,M,D,117.5,Nicholas Raymond,,,272.5,,272.5,OR,USA,1
Single-ply,Class 1,M,D,117.5,Timothy Baker,,,240,,240,OH,USA,2
Single-ply,Class 1,M,D,117.5,Isaac Conde,,,225,,225,TX,USA,3
Single-ply,Class 1,M,D,125,Harjit Kumar,,,300,,300,,India,1
Single-ply,Class 1,M,D,140,Brandon Bankston,,,282.5,,282.5,LA,USA,1
Single-ply,Class 1,M,D,140,Roger McMichael,,,240,,240,TX,USA,2
Single-ply,Class 1,M,D,140+,Harjinder Kumar,,,300,,300,,India,1
Single-ply,Class 1,M,D,140+,Marvin Bishop,,,238,,238,OH,USA,2
Single-ply,Class 1,M,D,140+,Anaki Kukahiko,,,215,,215,HI,USA,3
Single-ply,Class 1,M,D,140+,Leo Contreras,,,62.5,,62.5,CA,USA,4
Single-ply,Class 1,M,D,140+,Clay Tawzer,,,,,,CA,USA,DQ
Single-ply,Disabled,M,D,75,Donnie Miskinis,,,205,,205,OH,USA,1
Single-ply,Disabled,M,D,82.5,Vilmar Oliveira,,,210.5,,210.5,,Brazil,1
Single-ply,Disabled,M,D,90,Steve Peña #1,,,200,205,200,CA,USA,1
Single-ply,Disabled,M,D,90,Casey Jones,,,197.5,202.5,197.5,IL,USA,2
Single-ply,Disabled,M,D,90,John Herbein,,,182.5,,182.5,PA,USA,3
Single-ply,Disabled,M,D,90,Nick Sinardi,,,140,,140,FL,USA,4
Single-ply,Disabled,M,D,110,Cody Colchado,,,250,,250,TX,USA,1
Single-ply,Disabled,M,D,140,Luis Campos,,,262.5,,262.5,IN,USA,1
Single-ply,Disabled,M,D,140,Roger McMichael,,,240,,240,TX,USA,2
Single-ply,Disabled,M,D,140+,Allen Miluso,,,92.5,,92.5,CA,USA,1
Single-ply,Special Olympian,M,D,110,Brady Tanner,,,245,,245,KS,USA,1
Single-ply,Teen 12-13,M,D,48,Nathan Amburgey,,,70.5,,70.5,OH,USA,1
Single-ply,Teen 12-13,M,D,56,Kirby Winson,,,137.5,,137.5,MN,USA,1
Single-ply,Teen 12-13,M,D,67.5,Antonio Waldorf,,,115,,115,MN,USA,1
Single-ply,Teen 12-13,M,D,75,Gaven White,,,127.5,,127.5,AZ,USA,1
Single-ply,Teen 12-13,M,D,75,Storm Draayer,,,87.5,,87.5,MN,USA,2
Single-ply,Teen 12-13,M,D,44,Trevor Ogden,,,82.5,,82.5,HI,USA,1
Single-ply,Teen 14-15,M,D,60,Josh Carr,,,122.5,,122.5,ME,USA,1
Single-ply,Teen 14-15,M,D,75,Dylan Balk,,,202.5,,202.5,WI,USA,1
Single-ply,Teen 14-15,M,D,75,Jacob Hill,,,147.5,,147.5,ME,USA,2
Single-ply,Teen 14-15,M,D,75,Jak Nelson,,,145,,145,WI,USA,3
Single-ply,Teen 14-15,M,D,82.5,Kevin Perez,,,135,,135,CA,USA,1
Single-ply,Teen 14-15,M,D,100,Jacob Scott,,,160,,160,ME,USA,1
Single-ply,Teen 14-15,M,D,140,Alex DeSoto,,,202.5,,202.5,AZ,USA,1
Single-ply,Teen 14-15,M,D,140+,James Goodfellow,,,197.5,,197.5,UT,USA,1
Single-ply,Teen 16-17,M,D,60,Justin Andrus,,,191,205,191,LA,USA,1
Single-ply,Teen 16-17,M,D,60,Ivan Rodriguez,,,122.5,,122.5,CA,USA,2
Single-ply,Teen 16-17,M,D,67.5,James Windham,,,185,,185,LA,USA,1
Single-ply,Teen 16-17,M,D,67.5,Brandon Jones #10,,,155,,155,HI,USA,2
Single-ply,Teen 16-17,M,D,75,Nick Mendizabal,,,165,,165,CA,USA,1
Single-ply,Teen 16-17,M,D,75,Hugo Pina,,,160,,160,CA,USA,2
Single-ply,Teen 16-17,M,D,90,Jacob Webb,,,192.5,,192.5,AR,USA,1
Single-ply,Teen 16-17,M,D,90,Patrick Jankun,,,165,,165,NY,USA,2
Single-ply,Teen 16-17,M,D,100,William Cameron LaForge,,,260.5,,260.5,MA,USA,1
Single-ply,Teen 16-17,M,D,100,Weylen White,,,,,,AZ,USA,DQ
Single-ply,Teen 16-17,M,D,110,Jose Perez #4,,,212.5,,212.5,CA,USA,1
Single-ply,Teen 16-17,M,D,125,William Bronaugh,,,187.5,,187.5,CA,USA,1
Single-ply,Teen 18-19,M,D,52,Jesus Sanchez,,,137.5,,137.5,TX,USA,1
Single-ply,Teen 18-19,M,D,67.5,Nick Tsangeos,,,190,,190,OH,USA,1
Single-ply,Teen 18-19,M,D,67.5,Manuel Pina,,,167.5,,167.5,CA,USA,2
Single-ply,Teen 18-19,M,D,75,Roy Arispe,,,228,,228,TX,USA,1
Single-ply,Teen 18-19,M,D,75,Judd Sato III,,,207.5,,207.5,HI,USA,2
Single-ply,Teen 18-19,M,D,75,Donnie Miskinis,,,205,,205,OH,USA,3
Single-ply,Teen 18-19,M,D,75,Ryan Lund,,,200,,200,UT,USA,4
Single-ply,Teen 18-19,M,D,75,Francisco Marquez,,,182.5,,182.5,TX,USA,5
Single-ply,Teen 18-19,M,D,75,Abel Urdiales,,,162.5,,162.5,CA,USA,6
Single-ply,Teen 18-19,M,D,82.5,Jesse Lynn Jester,,,250,,250,KS,USA,1
Single-ply,Teen 18-19,M,D,82.5,Buster Litton,,,240,,240,NV,USA,2
Single-ply,Teen 18-19,M,D,82.5,Danny Borakove,,,190,,190,NY,USA,3
Single-ply,Teen 18-19,M,D,90,Jake Garbush,,,272.5,,272.5,WA,USA,1
Single-ply,Teen 18-19,M,D,90,Jacob Fernandez,,,227.5,,227.5,TX,USA,2
Single-ply,Teen 18-19,M,D,90,Sanford Graves,,,210,,210,CA,USA,3
Single-ply,Teen 18-19,M,D,90,Bradley Bennett,,,190,,190,OH,USA,4
Single-ply,Teen 18-19,M,D,100,Matt Phipps,,,255,,255,NV,USA,1
Single-ply,Teen 18-19,M,D,100,Barry Foster,,,220,,220,TX,USA,2
Single-ply,Teen 18-19,M,D,100,Easton Stanford,,,220,,220,AZ,USA,3
Single-ply,Teen 18-19,M,D,100,Dimas Lopez,,,182.5,,182.5,TX,USA,4
Single-ply,Teen 18-19,M,D,110,Jaime Villa,,,192.5,,192.5,TX,USA,1
Single-ply,Teen 18-19,M,D,117.5,Adam Lindsey,,,207.5,,207.5,NV,USA,1
Single-ply,Teen 18-19,M,D,125,Halit Dilber,,,210,,210,TX,USA,1
Single-ply,Teen 18-19,M,D,140,Dean Crowell,,,272.5,,272.5,HI,USA,1
Single-ply,Teen 18-19,M,D,44,Kyle Henderson,,,142.5,,142.5,WA,USA,1
Single-ply,Juniors 20-25,M,D,48,Jerel Aaron Hulliger,,,100,110,100,CA,USA,1
Single-ply,Juniors 20-25,M,D,56,Andres Cruz,,,137.5,,137.5,TX,USA,1
Single-ply,Juniors 20-25,M,D,56,Raymond Rodriguez,,,105,,105,TX,USA,2
Single-ply,Juniors 20-25,M,D,60,Antonio Moreno,,,190,,190,,Mexico,1
Single-ply,Juniors 20-25,M,D,67.5,Nick Lenhart,,,240,,240,UT,USA,1
Single-ply,Juniors 20-25,M,D,67.5,Jonne Fräntilä,,,215,,215,,Finland,2
Single-ply,Juniors 20-25,M,D,67.5,Luizarthur Nen,,,177.5,,177.5,,Brazil,3
Single-ply,Juniors 20-25,M,D,75,Jared Hazel,,,242.5,,242.5,FL,USA,1
Single-ply,Juniors 20-25,M,D,75,Teddy Guerzon,,,227.5,,227.5,NY,USA,2
Single-ply,Juniors 20-25,M,D,75,Ray Segura,,,192.5,,192.5,WA,USA,3
Single-ply,Juniors 20-25,M,D,75,Ilian Rojas,,,185,,185,TX,USA,4
Single-ply,Juniors 20-25,M,D,82.5,A. J. Mangum,,,307.5,,307.5,TX,USA,1
Single-ply,Juniors 20-25,M,D,82.5,Carlos Mata,,,255,,255,TX,USA,2
Single-ply,Juniors 20-25,M,D,82.5,Aaron Brown,,,255,,255,OR,USA,3
Single-ply,Juniors 20-25,M,D,82.5,Eric Ximenez,,,252.5,,252.5,TX,USA,4
Single-ply,Juniors 20-25,M,D,82.5,Robert Wells,,,250,,250,MA,USA,5
Single-ply,Juniors 20-25,M,D,82.5,Steven Rocha,,,227.5,,227.5,TX,USA,6
Single-ply,Juniors 20-25,M,D,82.5,Jesus Lozano,,,182.5,,182.5,TX,USA,7
Single-ply,Juniors 20-25,M,D,90,Alizada Tabriz,,,250,,250,,Azerbaijan,1
Single-ply,Juniors 20-25,M,D,90,Andy Whitaker,,,247.5,,247.5,LA,USA,2
Single-ply,Juniors 20-25,M,D,90,Michael Tirado,,,240,,240,NY,USA,3
Single-ply,Juniors 20-25,M,D,100,Ben Rice,,,325,,325,WA,USA,1
Single-ply,Juniors 20-25,M,D,100,Christopher Calderon,,,245,,245,TX,USA,2
Single-ply,Juniors 20-25,M,D,100,Gerardo Ruiz,,,242.5,,242.5,TX,USA,3
Single-ply,Juniors 20-25,M,D,100,William G Caughey,,,185,,185,UT,USA,4
Single-ply,Juniors 20-25,M,D,100,Adam Contreras #1,,,155,,155,CA,USA,5
Single-ply,Juniors 20-25,M,D,110,Anthony Rodriguez,,,222.5,,222.5,TX,USA,1
Single-ply,Juniors 20-25,M,D,117.5,Austin Shipley,,,282.5,,282.5,AZ,USA,1
Single-ply,Juniors 20-25,M,D,117.5,David Bergman,,,280,,280,IL,USA,2
Single-ply,Juniors 20-25,M,D,117.5,Nicholas Raymond,,,272.5,,272.5,OR,USA,3
Single-ply,Juniors 20-25,M,D,125,Josh Kubeck,,,325,,325,WI,USA,1
Single-ply,Juniors 20-25,M,D,125,Travis Forbey,,,215,,215,UT,USA,2
Single-ply,Juniors 20-25,M,D,140+,Serigne Sarr,,,200,,200,TX,USA,1
Single-ply,Submasters 33-39,M,D,75,Chansey McKendrick,,,200,,200,UT,USA,1
Single-ply,Submasters 33-39,M,D,82.5,David Hansen,,,277.5,,277.5,ND,USA,1
Single-ply,Submasters 33-39,M,D,90,Brad Koyle,,,285.5,,285.5,UT,USA,1
Single-ply,Submasters 33-39,M,D,90,Nick Pinto,,,210,,210,OH,USA,2
Single-ply,Submasters 33-39,M,D,100,Jeremy Drecksel,,,275.5,,275.5,UT,USA,1
Single-ply,Submasters 33-39,M,D,100,Thomas Reiher,,,237.5,,237.5,HI,USA,2
Single-ply,Submasters 33-39,M,D,100,Eric Oleson,,,235,,235,AZ,USA,3
Single-ply,Submasters 33-39,M,D,110,Kari Pöntinen,,,330,,330,,Finland,1
Single-ply,Submasters 33-39,M,D,110,Antti Kousa,,,310,,310,,Finland,2
Single-ply,Submasters 33-39,M,D,110,Keoki Dacuycuy,,,265,,265,HI,USA,3
Single-ply,Submasters 33-39,M,D,110,WC Carter,,,262.5,,262.5,AL,USA,4
Single-ply,Submasters 33-39,M,D,110,Fateh Sihota,,,250,,250,,India,5
Single-ply,Submasters 33-39,M,D,110,Mike Desrosiers,,,247.5,,247.5,AZ,USA,6
Single-ply,Submasters 33-39,M,D,125,Harjit Kumar,,,290,,290,,India,1
Single-ply,Submasters 33-39,M,D,140,Jim Nickerson,,,340,,340,OR,USA,1
Single-ply,Submasters 33-39,M,D,140,Tom Klundby,,,290.5,,290.5,CA,USA,2
Single-ply,Submasters 33-39,M,D,140,Brandon Bankston,,,282.5,,282.5,LA,USA,3
Single-ply,Submasters 33-39,M,D,140+,Dave Forstner,,,282.5,,282.5,MI,USA,1
Single-ply,Submasters 33-39,M,D,140+,Marvin Bishop,,,238,,238,OH,USA,2
Single-ply,Masters 40-46,M,D,67.5,Willis McCoy,,,217.5,,217.5,OH,USA,1
Single-ply,Masters 40-46,M,D,75,Jon Cunningham,,,222.5,,222.5,UT,USA,1
Single-ply,Masters 40-46,M,D,82.5,Warren Fahrenfeld,,,272.5,,272.5,NJ,USA,1
Single-ply,Masters 40-46,M,D,82.5,Marchand Fleming,,,272.5,,272.5,OK,USA,2
Single-ply,Masters 40-46,M,D,82.5,Jeb Brydon,,,182.5,,182.5,MI,USA,3
Single-ply,Masters 40-46,M,D,90,Eddie DiFruscia,,,277.5,,277.5,NH,USA,1
Single-ply,Masters 40-46,M,D,90,Al Tortorelli,,,272.5,,272.5,CA,USA,2
Single-ply,Masters 40-46,M,D,90,Mark Pearce,,,257.5,,257.5,TX,USA,3
Single-ply,Masters 40-46,M,D,90,Joe Ellis,,,255,,255,IN,USA,4
Single-ply,Masters 40-46,M,D,90,Dan Balk Jr,,,227.5,,227.5,WI,USA,5
Single-ply,Masters 40-46,M,D,100,Tim Sparkes,,,287.5,,287.5,AZ,USA,1
Single-ply,Masters 40-46,M,D,100,John Westleigh,,,252.5,,252.5,ME,USA,2
Single-ply,Masters 40-46,M,D,100,Steven Petersen,,,250,,250,TX,USA,3
Single-ply,Masters 40-46,M,D,100,Doug Amburgey,,,207.5,,207.5,OH,USA,4
Single-ply,Masters 40-46,M,D,110,Roland Garza,,,295,,295,OR,USA,1
Single-ply,Masters 40-46,M,D,110,Robert Exum,,,272.5,,272.5,CA,USA,2
Single-ply,Masters 40-46,M,D,110,Lance Davis,,,255,,255,UT,USA,3
Single-ply,Masters 40-46,M,D,110,Al Bianchi,,,,,,MA,USA,DQ
Single-ply,Masters 40-46,M,D,110,Brent Howard,,,,,,NV,USA,DQ
Single-ply,Masters 40-46,M,D,117.5,Terry Putman,,,287.5,,287.5,OK,USA,1
Single-ply,Masters 40-46,M,D,117.5,Cassius Scott,,,250,,250,LA,USA,2
Single-ply,Masters 40-46,M,D,125,Patrick Holloway,,,382.5,,382.5,AZ,USA,1
Single-ply,Masters 40-46,M,D,140,Thomas Guiney,,,297.5,,297.5,OK,USA,1
Single-ply,Masters 40-46,M,D,140,Dean Munsey,,,277.5,,277.5,OR,USA,2
Single-ply,Masters 40-46,M,D,140,Robert Speno,,,275,,275,CA,USA,3
Single-ply,Masters 40-46,M,D,140,Guy Powell,,,260,,260,WI,USA,4
Single-ply,Masters 40-46,M,D,140,Warren Orr,,,230,,230,,Canada,5
Single-ply,Masters 40-46,M,D,140+,Harjinder Kumar,,,300,,300,,India,1
Single-ply,Masters 47-53,M,D,60,Chetram Mangra,,,115,,115,NY,USA,1
Single-ply,Masters 47-53,M,D,67.5,Dave Constantineau,,,205,,205,WI,USA,1
Single-ply,Masters 47-53,M,D,67.5,John Lee #10,,,182.5,,182.5,CO,USA,2
Single-ply,Masters 47-53,M,D,67.5,Kenny Lyons,,,165,,165,UT,USA,3
Single-ply,Masters 47-53,M,D,67.5,Roosevelt Pristell,,,160,,160,WA,USA,4
Single-ply,Masters 47-53,M,D,75,David Felton,,,250,,250,WI,USA,1
Single-ply,Masters 47-53,M,D,82.5,Leamon Woodley,,,287.5,,287.5,WA,USA,1
Single-ply,Masters 47-53,M,D,82.5,David Brekke,,,215,,215,CO,USA,2
Single-ply,Masters 47-53,M,D,90,Dan Guches,,,272.5,,272.5,OR,USA,1
Single-ply,Masters 47-53,M,D,90,Doug Noebe,,,245,,245,OH,USA,2
Single-ply,Masters 47-53,M,D,90,Robert Harris,,,200,,200,NV,USA,3
Single-ply,Masters 47-53,M,D,100,Steve LeMarié,,,300,,300,LA,USA,1
Single-ply,Masters 47-53,M,D,100,Steve Gaytan,,,227.5,,227.5,CA,USA,2
Single-ply,Masters 47-53,M,D,110,Charlie Driscoll,,,347.5,,347.5,IA,USA,1
Single-ply,Masters 47-53,M,D,110,Anthony Ashley,,,260,,260,IL,USA,2
Single-ply,Masters 47-53,M,D,110,Brian Birchmeier,,,250,,250,MI,USA,3
Single-ply,Masters 47-53,M,D,110,Cody Colchado,,,250,,250,TX,USA,4
Single-ply,Masters 47-53,M,D,110,Mike Frizzell,,,250,,250,IL,USA,5
Single-ply,Masters 47-53,M,D,117.5,Bobby Driskill,,,290,,290,AL,USA,1
Single-ply,Masters 47-53,M,D,140,Joe Mickelson,,,250,,250,WA,USA,1
Single-ply,Masters 54-60,M,D,67.5,Dean Kaneshiro,,,245.5,250,245.5,HI,USA,1
Single-ply,Masters 54-60,M,D,67.5,Alfredo Evangelista,,,227.5,,227.5,OR,USA,2
Single-ply,Masters 54-60,M,D,67.5,Chuck Wong,,,210,,210,MN,USA,3
Single-ply,Masters 54-60,M,D,75,David Anderson #9,,,257.5,,257.5,WI,USA,1
Single-ply,Masters 54-60,M,D,75,Richard Cirigliano,,,245,,245,CA,USA,2
Single-ply,Masters 54-60,M,D,82.5,Richard Hagedorn,,,245,,245,AL,USA,1
Single-ply,Masters 54-60,M,D,82.5,Mike Wonyetye,,,227.5,,227.5,AZ,USA,2
Single-ply,Masters 54-60,M,D,82.5,David Wentworth,,,177.5,,177.5,ME,USA,3
Single-ply,Masters 54-60,M,D,82.5,Flavio Baptista da Costa,,,150,,150,,Brazil,4
Single-ply,Masters 54-60,M,D,90,Gary Ferstler,,,295,,295,HI,USA,1
Single-ply,Masters 54-60,M,D,90,David Bertier,,,245,,245,CA,USA,2
Single-ply,Masters 54-60,M,D,100,Kevin Fisher,,,310,,310,CA,USA,1
Single-ply,Masters 54-60,M,D,100,Chad Drecksel,,,250,,250,UT,USA,2
Single-ply,Masters 54-60,M,D,100,Harry Munro,,,242.5,,242.5,CA,USA,3
Single-ply,Masters 54-60,M,D,100,Jim Curley,,,227.5,,227.5,CO,USA,4
Single-ply,Masters 54-60,M,D,100,Stuart Coogan,,,227.5,,227.5,WI,USA,5
Single-ply,Masters 54-60,M,D,100,Randy Waldorf,,,217.5,,217.5,MN,USA,6
Single-ply,Masters 54-60,M,D,100,Tim Epting,,,213,,213,TX,USA,7
Single-ply,Masters 54-60,M,D,110,Ron L'Huillier,,,298,,298,MI,USA,1
Single-ply,Masters 54-60,M,D,110,Gary Stevens,,,237.5,,237.5,WY,USA,2
Single-ply,Masters 54-60,M,D,110,William B Caughey,,,180,,180,UT,USA,3
Single-ply,Masters 54-60,M,D,117.5,Keith Huffer,,,245,,245,CA,USA,1
Single-ply,Masters 54-60,M,D,117.5,David Wolf,,,237.5,,237.5,WY,USA,2
Single-ply,Masters 54-60,M,D,125,Ted Stewart,,,250,,250,NV,USA,1
Single-ply,Masters 54-60,M,D,140+,Leo Contreras,,,62.5,,62.5,CA,USA,1
Single-ply,Masters 61-67,M,D,56,Homi Shivaie,,,175,,175,CA,USA,1
Single-ply,Masters 61-67,M,D,67.5,Moses Timbal,,,192.5,,192.5,HI,USA,1
Single-ply,Masters 61-67,M,D,75,Dennis Johnson,,,245,,245,WI,USA,1
Single-ply,Masters 61-67,M,D,75,James Christian #1,,,192.5,,192.5,TX,USA,2
Single-ply,Masters 61-67,M,D,75,Stefan Lemire,,,170,,170,UT,USA,3
Single-ply,Masters 61-67,M,D,82.5,Jerry Shetka,,,255,,255,MN,USA,1
Single-ply,Masters 61-67,M,D,82.5,Jack Rankin,,,205,,205,WA,USA,2
Single-ply,Masters 61-67,M,D,82.5,Jeffery Thornton,,,152.5,,152.5,AZ,USA,3
Single-ply,Masters 61-67,M,D,90,Bob Hochstein,,,262.5,,262.5,IL,USA,1
Single-ply,Masters 61-67,M,D,90,Godfrey Holzinger,,,215,,215,WA,USA,2
Single-ply,Masters 61-67,M,D,90,Ron Jones,,,182.5,,182.5,AL,USA,3
Single-ply,Masters 61-67,M,D,100,Al Williamson,,,200,,200,WI,USA,1
Single-ply,Masters 61-67,M,D,110,Bud Davis,,,295,,295,UT,USA,1
Single-ply,Masters 61-67,M,D,110,Bud Davis,,,295,,295,UT,USA,2
Single-ply,Masters 61-67,M,D,110,Bud Davis,,,295,,295,UT,USA,3
Single-ply,Masters 61-67,M,D,110,Cliff Sandberg,,,242.5,,242.5,WA,USA,4
Single-ply,Masters 61-67,M,D,110,Kenney Phillips,,,182.5,,182.5,OK,USA,5
Single-ply,Masters 61-67,M,D,110,Thomas Wright,,,170,,170,KS,USA,6
Single-ply,Masters 61-67,M,D,110,George Weiss,,,92.5,,92.5,CA,USA,7
Single-ply,Masters 61-67,M,D,140+,Alan Fraser,,,187.5,,187.5,NV,USA,1
Single-ply,Masters 61-67,M,D,140+,Allen Miluso,,,92.5,,92.5,CA,USA,2
Single-ply,Masters 61-67,M,D,75,Martin Montgomery,,,210,,210,IN,USA,1
Single-ply,Masters 68-74,M,D,75,Raymond Gandeza,,,200,,200,HI,USA,2
Single-ply,Masters 68-74,M,D,82.5,Dan Martin,,,239,,239,NV,USA,1
Single-ply,Masters 68-74,M,D,82.5,Larry John,,,185,,185,CA,USA,2
Single-ply,Masters 68-74,M,D,82.5,Ed Angstrom,,,182.5,,182.5,IA,USA,3
Single-ply,Masters 68-74,M,D,90,James Rouse,,,210,,210,IL,USA,1
Single-ply,Masters 68-74,M,D,90,John Herbein,,,182.5,,182.5,PA,USA,2
Single-ply,Masters 68-74,M,D,90,Sonny Nummi,,,170,,170,ID,USA,3
Single-ply,Masters 68-74,M,D,90,Dean Baker,,,95,,95,CA,USA,4
Single-ply,Masters 68-74,M,D,100,Alfred Franke,,,228,,228,NV,USA,1
Single-ply,Masters 68-74,M,D,100,Robert Urrea,,,193,,193,CA,USA,2
Single-ply,Masters 68-74,M,D,100,Ronald Ford,,,95,,95,CA,USA,3
Single-ply,Masters 75-79,M,D,75,Bill Tinkler,,,137.5,,137.5,FL,USA,1
Single-ply,Masters 75-79,M,D,90,John Felten,,,170,,170,MN,USA,1
Single-ply,Masters 75-79,M,D,100,Richard Austin,,,160,,160,ME,USA,1
Single-ply,Masters 75-79,M,D,110,Lou Corulli,,,145,,145,WA,USA,1
Single-ply,Masters 80-84,M,D,75,Joseph Cavness,,,82.5,,82.5,CA,USA,1
Single-ply,Masters 80-84,M,D,82.5,Roy Kahn,,,87.5,,87.5,CA,USA,1
Single-ply,Masters 80-84,M,D,82.5,George Choi,,,67.5,,67.5,CA,USA,2
Single-ply,Masters 85-89,M,D,90,Rodney Graves,,,95,102.5,95,NV,USA,1
Single-ply,Law-Fire Open,M,D,82.5,Dave Claroni,,,215.5,,215.5,ME,USA,1
Single-ply,Law-Fire Open,M,D,90,Nick Berriman,,,227.5,,227.5,OR,USA,1
Single-ply,Law-Fire Open,M,D,90,Brian Pittman,,,193,,193,OH,USA,2
Single-ply,Law-Fire Open,M,D,110,Robert Schleder,,,282.5,,282.5,AZ,USA,1
Single-ply,Law-Fire Submasters,M,D,82.5,Dave Claroni,,,215.5,,215.5,ME,USA,1
Single-ply,Law-Fire Submasters,M,D,90,Nick Berriman,,,227.5,,227.5,OR,USA,1
Single-ply,Law-Fire Submasters,M,D,140,Tom Klundby,,,290.5,,290.5,CA,USA,1
Single-ply,Law-Fire 40-47,M,D,100,Barran Stone,,,255.5,,255.5,TX,USA,1
Single-ply,Law-Fire 40-47,M,D,110,Lance Davis,,,255,,255,UT,USA,1
Single-ply,Law-Fire 40-47,M,D,140,Warren Orr,,,230,,230,,Canada,1
Single-ply,Law-Fire 48-55,M,D,75,Larry Esquivel,,,170,,170,CA,USA,1
Single-ply,Law-Fire 48-55,M,D,90,Luis Fernando Meireles Dias,,,230,,230,,Brazil,1
Single-ply,Law-Fire 48-55,M,D,100,William Denniston,,,210,,210,MI,USA,1
Single-ply,Law-Fire 48-55,M,D,140,Dennis Schultz,,,272.5,,272.5,CA,USA,1
Single-ply,Law-Fire 56+,M,D,82.5,Mike Harrison,,,220,,220,TX,USA,1
Single-ply,Law-Fire 56+,M,D,90,Charles McFarland,,,245,,245,OR,USA,1
Single-ply,Law-Fire 56+,M,D,110,Marvin Hollan,,,230,,230,TX,USA,1
