53	Apache High Availability Howto, using LVS and Heartbeat	apache-high-availability-howto-using-lvs-and-heartbeat		<p>Assalam-u-alaikum,</p>\
<p>This howto is also a bit old now. But I thought of uploading it in the howtos section, as it still works.</p>\
<p>Created : Mid 2007</p>\
<p>Last updated: Mid 2007</p>\
<p>The following link is very nice tutorial :<br /><br />http://www.howtoforge.com/high_availability_loadbalanced_apache_cluster<br />but uses Debian! <br /><br />I have used CentOS 4.3 and all heartbeat and ipvs packages from centos43 extras. Nothing needs to be downloaded from ANYWHERE. No need to go to Ultra monkey site, etc. <br /><br /><br />Make sure that example.com has proper Zone entries on your DNS server for:<br /><br /><br />www1.example.com.       IN      A       192.168.0.101<br />www2.example.com.       IN      A       192.168.0.102<br />lb1.example.com.        IN      A       192.168.0.103<br />lb2.example.com.        IN      A       192.168.0.104<br />www.example.com.        IN      A       192.168.0.105<br /><br /><br /><br />192.168.0.103           lb1.example.com         lb1<br /><br />HOSTNAME=lb1.example.com<br />GATEWAY=192.168.0.254<br /><br />IPADDR=192.168.0.103<br />NETMASK=255.255.225.0<br /><br />DEVICE=eth0<br />BOOTPROTO=static<br />HWADDR=00:40:26:5F:5C:60<br />ONBOOT=yes<br />TYPE=Ethernet<br />IPADDR=192.168.0.102<br />NETMASK=255.255.255.0<br /><br />--------------------------------------<br />both Webservers<br /><br />mkdir /media/nfs ; mkdir /media/extras<br />mount -t nfs 192.168.0.254:/data/cdimages/centos43nfs /media/nfs<br />echo "mount -t nfs 192.168.0.254:/data/cdimages/centos43nfs /media/nfs" >> /etc/rc.local<br />mount -t nfs 192.168.0.254:/data/cdimages/centos43extrasnfs /media/extras/<br />echo "mount -t nfs 192.168.0.254:/data/cdimages/centos43extrasnfs /media/extras/" >> /etc/rc.local<br />-------<br /><br />rpm -ivh httpd-2.0.52-22.ent.centos4.i386.rpm apr-0.9.4-24.5.c4.1.i386.rpm httpd-suexec-2.0.52-22.ent.centos4.i386.rpm apr-util-0.9.4-21.i386.rpm<br /><br />------------------------------------------------<br />Load Balancers:<br />/etc/modules does not exist on RedHAT and clones.<br /><br />On both load balancers (also placed the same in /etc/rc.local)<br />/etc/modprobe.conf can be used but I do not know how to use it, so /etc/rc.local is the easy way out.<br /><br /><br />modprobe ip_vs_dh<br />modprobe ip_vs_ftp<br />modprobe ip_vs<br />modprobe ip_vs_lblc<br />modprobe ip_vs_lblcr<br />modprobe ip_vs_lc<br />modprobe ip_vs_nq<br />modprobe ip_vs_rr<br />modprobe ip_vs_sed<br />modprobe ip_vs_sh<br />modprobe ip_vs_wlc<br />modprobe ip_vs_wrr<br /><br /><br />--------------------<br />both LBs<br /><br /><br />rpm -ivh curl-7.12.1-8.rhel4.i386.rpm perl-Crypt-SSLeay-0.51-5.i386.rpm perl-HTML-Parser-3.35-6.i386.rpm perl-LDAP-0.31-5.noarch.rpm perl-Net-DNS-0.48-1.i386.rpm perl-libwww-perl-5.79-5.noarch.rpm libidn-0.5.6-1.i386.rpm perl-Convert-ASN1-0.18-3.noarch.rpm perl-Digest-HMAC-1.01-13.noarch.rpm perl-HTML-Tagset-3.03-30.noarch.rpm perl-URI-1.30-4.noarch.rpm perl-XML-SAX-0.12-7.noarch.rpm perl-Digest-SHA1-2.07-5.i386.rpm perl-XML-NamespaceSupport-1.08-6.noarch.rpm<br /><br />rpm -ivh perl-Mail-IMAPClient-2.2.9-1.rf.noarch.rpm heartbeat-* ipvsadm-1.24-6.i386.rpm<br /><br /><br />------------------<br /><br />Install Heartbeat packages<br /><br />-------------------<br /><br />vi /etc/sysctl.conf<br /><br /># Enables packet forwarding<br />net.ipv4.ip_forward = 1<br /><br />sysctl -p<br /><br />-------------------<br /><br />USE "UNAME -n" for node names<br />vi /etc/ha.d/ha.cf<br /><br />logfacility        local0<br />bcast        eth0                # Linux<br />mcast eth0 225.0.0.1 694 1 0<br />auto_failback off<br />node        lb1.example.com<br />node        lb2.example.com<br />respawn hacluster /usr/lib/heartbeat/ipfail<br />apiauth ipfail gid=haclient uid=hacluster<br /><br /><br />-------------------<br />USE "UNAME -n" for node names<br /><br />LB1:<br /><br />vi /etc/ha.d/haresources<br /><br />lb1.example.com        \\<br /> ldirectord::ldirectord.cf \\<br /> LVSSyncDaemonSwap::master \\<br /> IPaddr2::192.168.0.105/24/eth0/192.168.0.255<br /><br />LB2:<br /><br />lb2.example.com        \\<br /> ldirectord::ldirectord.cf \\<br /> LVSSyncDaemonSwap::master \\<br /> IPaddr2::192.168.0.105/24/eth0/192.168.0.255<br /><br />------------<br />both LBs<br /><br />vi /etc/ha.d/authkeys<br /><br />auth 3<br />3 md5 redhat<br /><br />----------------------<br />both LBs<br /><br />chmod 600 /etc/ha.d/authkeys<br /><br />-----------<br />both LBs<br /><br />vi /etc/ha.d/ldirectord.cf<br /><br />checktimeout=10<br />checkinterval=2<br />autoreload=no<br />logfile="local0"<br />quiescent=yes<br /><br />virtual=192.168.0.105:80<br /> real=192.168.0.101:80 gate<br /> real=192.168.0.102:80 gate<br /> fallback=127.0.0.1:80 gate<br /> service=http<br /> request="ldirector.html"<br /> receive="Test Page"<br /> scheduler=rr<br /> protocol=tcp<br /> checktype=negotiate<br /><br /><br />---------<br />Both LBs<br /><br />chkconfig --level 35  ldirectord off<br />chkconfig --level 35  heartbeat  on<br /><br /><br />service ldirectord stop<br />service heartbeat start<br />+++++++++++++++++++++++++<br /><br />[root@lb1 /]# service ldirectord stop<br />Stopping ldirectord                                        [  OK  ]<br />[root@lb1 /]# service heartbeat start<br />Starting High-Availability services:<br />ldirectord is stopped for /etc/ha.d/ldirectord.cf<br /> [FAILED]<br />heartbeat: 2007/02/16_04:12:30 ERROR: Current node [lb1.example.com] not in configuration!<br />heartbeat: 2007/02/16_04:12:30 info: By default, cluster nodes are named by `uname -n` and must be declared with a 'node' directive in the ha.cf file.<br />heartbeat: 2007/02/16_04:12:30 ERROR: Configuration error, heartbeat not started.<br /><br />[root@lb1 /]# uname -n<br />lb1.example.com<br />[root@lb1 /]#<br /><br />OHHHHH<br /><br /><br />Files corrected with uname -n output . i.e. instead of lb1, I have now changed that to lb1.example.com<br /><br />[root@lb1 /]# service heartbeat start<br />Starting High-Availability services:<br />ldirectord is stopped for /etc/ha.d/ldirectord.cf<br /> [  OK  ]<br />[root@lb1 /]#   <br /><br />[root@lb2 /]# service ldirectord stop<br />Stopping ldirectord                                        [  OK  ]<br />[root@lb2 /]# service heartbeat start<br />Starting High-Availability services:<br />ldirectord is stopped for /etc/ha.d/ldirectord.cf<br /> [  OK  ]<br />[root@lb2 /]# <br /><br /><br />Good. Alhumdulilah.<br /><br /><br />LB1:<br /><br />[root@lb1 /]# ip addr sh eth0<br />2: eth0:  mtu 1500 qdisc pfifo_fast qlen 1000<br /> link/ether 00:08:c7:69:13:9d brd ff:ff:ff:ff:ff:ff<br /> inet 192.168.0.103/24 brd 192.168.0.255 scope global eth0<br /> inet 192.168.0.105/24 brd 192.168.0.255 scope global secondary eth0<br /> inet6 fe80::208:c7ff:fe69:139d/64 scope link<br /> valid_lft forever preferred_lft forever<br />[root@lb1 /]#<br /><br />Notice LB1 has two IPs , which DO NOT SHOW in ifconfig -a output.<br /><br /><br />LB2:<br />[root@lb2 /]# ip addr sh eth0<br />2: eth0:  mtu 1500 qdisc pfifo_fast qlen 1000<br /> link/ether 00:50:8b:60:c8:f8 brd ff:ff:ff:ff:ff:ff<br /> inet 192.168.0.104/24 brd 192.168.0.255 scope global eth0<br /> inet6 fe80::250:8bff:fe60:c8f8/64 scope link<br /> valid_lft forever preferred_lft forever<br />[root@lb2 /]#<br /><br /><br />----------------------------<br /><br />[root@lb1 /]# ldirectord ldirectord.cf status<br />ldirectord for /etc/ha.d/ldirectord.cf is running with pid: 3978<br />[root@lb1 /]#<br /><br />NOTE: The above output (running) will be displayed on ACTIVE LB<br /><br /><br />[root@lb2 /]# ldirectord ldirectord.cf status<br />ldirectord is stopped for /etc/ha.d/ldirectord.cf<br />[root@lb2 /]#<br /><br />-------------------<br /><br />[root@lb1 /]# ipvsadm -L -n<br />IP Virtual Server version 1.2.0 (size=4096)<br />Prot LocalAddress:Port Scheduler Flags<br /> -> RemoteAddress:Port           Forward Weight ActiveConn InActConn<br />[root@lb1 /]# <br /><br /><br />[root@lb2 /]# ipvsadm -L -n<br />IP Virtual Server version 1.2.0 (size=4096)<br />Prot LocalAddress:Port Scheduler Flags<br /> -> RemoteAddress:Port           Forward Weight ActiveConn InActConn<br />[root@lb2 /]#<br /><br />NOTE: If LB1 does not show as below, try restarting heartbeat on LB1 and LB2. In the same order I have written here.<br /><br /><br />[root@lb1 /]# ipvsadm -L -n<br />IP Virtual Server version 1.2.0 (size=4096)<br />Prot LocalAddress:Port Scheduler Flags<br /> -> RemoteAddress:Port           Forward Weight ActiveConn InActConn<br />TCP  192.168.0.105:80 rr<br /> -> 192.168.0.101:80             Route   0      0          0<br /> -> 192.168.0.102:80             Route   0      0          0<br /> -> 127.0.0.1:80                 Local   1      0          0<br />[root@lb1 /]#      <br /><br /><br />--------------<br /><br />[root@lb1 /]# /etc/ha.d/resource.d/LVSSyncDaemonSwap master status<br />master running<br />(ipvs_syncmaster pid: 4704)<br />[root@lb1 /]#  <br /><br />NOTE: Master running on LB1<br /><br /><br />[root@lb2 /]# /etc/ha.d/resource.d/LVSSyncDaemonSwap master status<br />master stopped<br />(ipvs_syncbackup pid: 4488)<br />[root@lb2 /]#<br /><br />--------------------<br /><br />WWW1 and WWW2<br /><br />vi /etc/sysctl.conf<br /><br /># When an arp request is received on eth0, only respond if that address is<br /># configured on eth0. In particular, do not respond if the address is<br /># configured on lo<br />net.ipv4.conf.eth0.arp_ignore = 1<br /><br /># Ditto for eth1, add for all ARPing interfaces<br />#net.ipv4.conf.eth1.arp_ignore = 1<br /><br /><br /># Enable configuration of arp_announce option<br />net.ipv4.conf.all.arp_announce = 2<br /><br /># When making an ARP request sent through eth0 Always use an address that<br /># is configured on eth0 as the source address of the ARP request.  If this<br /># is not set, and packets are being sent out eth0 for an address that is on<br /># lo, and an arp request is required, then the address on lo will be used.<br /># As the source IP address of arp requests is entered into the ARP cache on<br /># the destination, it has the effect of announcing this address.  This is<br /># not desirable in this case as adresses on lo on the real-servers should<br /># be announced only by the linux-director.<br />net.ipv4.conf.eth0.arp_announce = 2<br /><br /># Ditto for eth1, add for all ARPing interfaces<br />#net.ipv4.conf.eth1.arp_announce = 2<br /><br /><br />sysctl -p on BOTH WWWs<br /><br />---------------------<br /><br />Note :  /etc/network/interfaces exists in debian only it does not exist in RedHat. For that you need to use the /etc/sysconfig/network-scripts/ifcfg-* files.<br /><br />DEBIAN<br /><br />vi /etc/network/interfaces<br /><br />auto lo:0<br />iface lo:0 inet static<br /> address 192.168.0.105<br /> netmask 255.255.255.255<br /> pre-up sysctl -p > /dev/null<br /><br />------------------<br /><br />WWW1 and WWW2<br /><br />REDHAT / CentOS / Fedora<br /><br /><br />cd /etc/sysconfig/network-scripts/<br /><br />cp ifcfg-lo ifcfg-lo:0<br /><br />vi ifcfg-lo\\:0<br /><br />DEVICE=lo:0<br />BOOTPROTO=static<br />IPADDR=192.168.0.105<br />NETMASK=255.255.255.255<br />ONBOOT=yes<br />NAME=loopback<br /><br /><br />-----------------<br />both WWWs<br /><br />[root@www1 network-scripts]# ifconfig<br />eth0      Link encap:Ethernet  HWaddr 00:0A:5E:05:97:B4<br /> inet addr:192.168.0.101  Bcast:192.168.0.255  Mask:255.255.255.0<br /> inet6 addr: fe80::20a:5eff:fe05:97b4/64 Scope:Link<br /> UP BROADCAST RUNNING MULTICAST  MTU:1500  Metric:1<br /> RX packets:7914 errors:472 dropped:0 overruns:0 frame:472<br /> TX packets:2875 errors:0 dropped:0 overruns:0 carrier:0<br /> collisions:0 txqueuelen:1000<br /> RX bytes:2257584 (2.1 MiB)  TX bytes:293073 (286.2 KiB)<br /> Interrupt:5 Base address:0x7080<br /><br />lo        Link encap:Local Loopback<br /> inet addr:127.0.0.1  Mask:255.0.0.0<br /> inet6 addr: ::1/128 Scope:Host<br /> UP LOOPBACK RUNNING  MTU:16436  Metric:1<br /> RX packets:26 errors:0 dropped:0 overruns:0 frame:0<br /> TX packets:26 errors:0 dropped:0 overruns:0 carrier:0<br /> collisions:0 txqueuelen:0<br /> RX bytes:1820 (1.7 KiB)  TX bytes:1820 (1.7 KiB)<br /><br />[root@www1 network-scripts]# ifup lo:0<br /><br /><br />[root@www1 network-scripts]# ifconfig<br />eth0      Link encap:Ethernet  HWaddr 00:0A:5E:05:97:B4<br /> inet addr:192.168.0.101  Bcast:192.168.0.255  Mask:255.255.255.0<br /> inet6 addr: fe80::20a:5eff:fe05:97b4/64 Scope:Link<br /> UP BROADCAST RUNNING MULTICAST  MTU:1500  Metric:1<br /> RX packets:8001 errors:472 dropped:0 overruns:0 frame:472<br /> TX packets:2923 errors:0 dropped:0 overruns:0 carrier:0<br /> collisions:0 txqueuelen:1000<br /> RX bytes:2266978 (2.1 MiB)  TX bytes:299149 (292.1 KiB)<br /> Interrupt:5 Base address:0x7080<br /><br />lo        Link encap:Local Loopback<br /> inet addr:127.0.0.1  Mask:255.0.0.0<br /> inet6 addr: ::1/128 Scope:Host<br /> UP LOOPBACK RUNNING  MTU:16436  Metric:1<br /> RX packets:26 errors:0 dropped:0 overruns:0 frame:0<br /> TX packets:26 errors:0 dropped:0 overruns:0 carrier:0<br /> collisions:0 txqueuelen:0<br /> RX bytes:1820 (1.7 KiB)  TX bytes:1820 (1.7 KiB)<br /><br />lo:0      Link encap:Local Loopback<br /> inet addr:192.168.0.105  Mask:255.255.255.255<br /> UP LOOPBACK RUNNING  MTU:16436  Metric:1<br /><br />[root@www1 network-scripts]#<br /><br /><br /><br />[root@www2 network-scripts]# ifconfig<br />eth0      Link encap:Ethernet  HWaddr 00:40:26:5F:5C:60<br /> inet addr:192.168.0.102  Bcast:192.168.0.255  Mask:255.255.255.0<br /> inet6 addr: fe80::240:26ff:fe5f:5c60/64 Scope:Link<br /> UP BROADCAST RUNNING MULTICAST  MTU:1500  Metric:1<br /> RX packets:8349 errors:0 dropped:0 overruns:0 frame:0<br /> TX packets:4236 errors:0 dropped:0 overruns:0 carrier:0<br /> collisions:132 txqueuelen:1000<br /> RX bytes:2187763 (2.0 MiB)  TX bytes:450715 (440.1 KiB)<br /> Interrupt:5 Base address:0x7080<br /><br />lo        Link encap:Local Loopback<br /> inet addr:127.0.0.1  Mask:255.0.0.0<br /> inet6 addr: ::1/128 Scope:Host<br /> UP LOOPBACK RUNNING  MTU:16436  Metric:1<br /> RX packets:53 errors:0 dropped:0 overruns:0 frame:0<br /> TX packets:53 errors:0 dropped:0 overruns:0 carrier:0<br /> collisions:0 txqueuelen:0<br /> RX bytes:5347 (5.2 KiB)  TX bytes:5347 (5.2 KiB)<br /><br />[root@www2 network-scripts]# ifup lo:0<br />[root@www2 network-scripts]# ifconfig<br />eth0      Link encap:Ethernet  HWaddr 00:40:26:5F:5C:60<br /> inet addr:192.168.0.102  Bcast:192.168.0.255  Mask:255.255.255.0<br /> inet6 addr: fe80::240:26ff:fe5f:5c60/64 Scope:Link<br /> UP BROADCAST RUNNING MULTICAST  MTU:1500  Metric:1<br /> RX packets:8412 errors:0 dropped:0 overruns:0 frame:0<br /> TX packets:4275 errors:0 dropped:0 overruns:0 carrier:0<br /> collisions:132 txqueuelen:1000<br /> RX bytes:2193922 (2.0 MiB)  TX bytes:455943 (445.2 KiB)<br /> Interrupt:5 Base address:0x7080<br /><br />lo        Link encap:Local Loopback<br /> inet addr:127.0.0.1  Mask:255.0.0.0<br /> inet6 addr: ::1/128 Scope:Host<br /> UP LOOPBACK RUNNING  MTU:16436  Metric:1<br /> RX packets:53 errors:0 dropped:0 overruns:0 frame:0<br /> TX packets:53 errors:0 dropped:0 overruns:0 carrier:0<br /> collisions:0 txqueuelen:0<br /> RX bytes:5347 (5.2 KiB)  TX bytes:5347 (5.2 KiB)<br /><br />lo:0      Link encap:Local Loopback<br /> inet addr:192.168.0.105  Mask:255.255.255.255<br /> UP LOOPBACK RUNNING  MTU:16436  Metric:1<br /><br />[root@www2 network-scripts]#  <br /><br />-----------------------<br />Both WWWs<br /><br />vi /var/www/html/ldirector.html<br />Test Page<br /><br /><br />-------------<br /><br />Both WWWs<br /><br />Configure the ServerName Directive repectively for each node:<br /><br />WWW1<br />ServerName www1.example.com<br /><br />WWW2<br />ServerName www2.example.com<br /><br />Both WWWs:<br />cd /etc/httpd/conf.d/<br />mv welcome.conf welcome.conf.orig<br /><br /><br />service httpd start<br />chkconfig --level 35 httpd on<br /><br /><br />WWW1 (to represent some web content):<br /><br />[root@www1 conf.d]# cd /var/www/html/<br />[root@www1 html]# vi index.html<br />WWW1 Website page<br /><br /><br />WWW2 (to represent some web content):<br /><br />[root@www2 conf.d]# cd /var/www/html/<br />[root@www2 html]# vi index.html<br />WWW2 Website page<br /><br /><br />NOTE: I have used different webpage contents on both servers to actually notice the difference if one node fails. In real life, of-course the web content will be same.<br /><br /><br />Now try from some webclient / browser (192.168.0.22) the following:<br /><br />http://www.example.com<br /><br />OR<br /><br />http://192.168.0.105<br /><br /><br />You will see WWW1 one time you press GO or ENTER, and will see WWW2 the second time. And it will keep switching like this proving that the load balancer is working properly and is sending connections to the web server which has lesser load. Since there are only two web servers abnd one client to check both servers one by one, the Load Balancer takes you to www1.example.com and to www2.example.com turn by turn.<br /><br />Great Alhumdulillah.<br /><br /><br />Try stopping apache on WWW1, you would see the WWW2 page on your browser and if you keep clicking GO/ refresh, you will keep seeing WWW2 page. As soon as you turn up WWW1 server, and press refresh on client. You will see WWW1 page.  Same goes for WWW2 server. Great.<br /><br /><br />-----------------------------<br /><br />Lets Fail the LB now. First check which one is active?<br /><br />[root@lb1 /]# /etc/ha.d/resource.d/LVSSyncDaemonSwap master status<br />master running<br />(ipvs_syncmaster pid: 4704)<br />[root@lb1 /]#<br /><br /><br />So LB1 is ACTIVE LB. Let's fail that and see if heartbeat takes over or not. So we still see our web page on 192.168.0.105 (www.example.com) or not?<br /><br />[root@lb1 /]# service heartbeat stop<br />Stopping High-Availability services:<br /> [  OK  ]<br />[root@lb1 /]#<br /><br /><br />Check status again:<br /><br />[root@lb1 /]# /etc/ha.d/resource.d/LVSSyncDaemonSwap master status<br />master stopped<br />(ipvs_syncbackup pid: 5125)<br />[root@lb1 /]# <br /><br />Check to make sure if LB2 has taken over as master:<br /><br />[root@lb2 /]# /etc/ha.d/resource.d/LVSSyncDaemonSwap master status<br />master running<br />(ipvs_syncmaster pid: 4743)<br />[root@lb2 /]#<br /><br /><br />NOTICE the master has stopped on LB1. Check browser on client, Working perfectly. We still get our page.<br /><br /><br />If I start heartbeat on LB1 again, LB1 must remain inactive and LB2 must still remain ACTIVE. Lets see:<br /><br />[root@lb1 /]# service heartbeat start<br />Starting High-Availability services:<br />ldirectord is stopped for /etc/ha.d/ldirectord.cf<br /> [  OK  ]<br />[root@lb1 /]# /etc/ha.d/resource.d/LVSSyncDaemonSwap master status<br />master stopped<br />(ipvs_syncbackup pid: 5125)<br />[root@lb1 /]#<br /><br />Notice that LB2 is still ACTIVE. <br /><br />Alhumdulillah.<br /><br /><br />-----------------------------------------------------------------<br />================================================================<br /><br />Lets connect null modem wire to serial ports of the two LBs and change appropriate settings in various config files on both LBs , so the too much broadcast for heartbeat signals on the switch is removed / minimized.<br /><br />Both LBs :<br /><br /><br />vi /etc/ha.d/ha.cf<br /><br />logfacility        local0<br />serial /dev/ttyS0<br />baud 19200<br /><br />#bcast        eth0                # Linux<br />#mcast eth0 225.0.0.1 694 1 0<br />auto_failback off<br />node        lb1.example.com<br />node        lb2.example.com<br />respawn hacluster /usr/lib/heartbeat/ipfail<br />apiauth ipfail gid=haclient uid=hacluster<br /><br /><br /><br />[root@lb2 ~]# service heartbeat stop<br />Stopping High-Availability services:<br /> [  OK  ]<br /><br />[root@lb1 ~]# service heartbeat stop<br />Stopping High-Availability services:<br /> [  OK  ]<br /><br />Checked through browser. Found everything working. Success. Alhumdulillah.</p>\
<p> </p>		1	11	0	34	2008-07-01 20:42:46	64		2010-12-24 18:16:05	74	0	0000-00-00 00:00:00	2008-07-01 20:42:46	0000-00-00 00:00:00			show_title=\
link_titles=\
show_intro=\
show_section=\
link_section=\
show_category=\
link_category=\
show_vote=\
show_author=\
show_create_date=\
show_modify_date=\
show_pdf_icon=\
show_print_icon=\
show_email_icon=\
language=\
keyref=\
readmore=	4	0	71			0	7203	robots=\
author=
