<?xml version="1.0" encoding="UTF-8" standalone="no"?>
<svg
   xmlns:dc="http://purl.org/dc/elements/1.1/"
   xmlns:cc="http://creativecommons.org/ns#"
   xmlns:rdf="http://www.w3.org/1999/02/22-rdf-syntax-ns#"
   xmlns:svg="http://www.w3.org/2000/svg"
   xmlns="http://www.w3.org/2000/svg"
   xmlns:sodipodi="http://sodipodi.sourceforge.net/DTD/sodipodi-0.dtd"
   xmlns:inkscape="http://www.inkscape.org/namespaces/inkscape"
   width="210mm"
   height="297mm"
   viewBox="0 0 210 297"
   version="1.1"
   id="svg8"
   inkscape:version="1.0.2 (e86c870879, 2021-01-15)"
   sodipodi:docname="okr.svg">
  <defs
     id="defs2">
    <rect
       x="40.712574"
       y="495.30075"
       width="107.27708"
       height="17.707368"
       id="rect2657" />
    <rect
       x="8.8313293"
       y="27.998914"
       width="190.31702"
       height="48.158628"
       id="rect2207" />
    <rect
       x="8.8313293"
       y="27.998915"
       width="85.813248"
       height="83.87823"
       id="rect2207-5" />
    <rect
       x="8.8313293"
       y="27.998915"
       width="190.31702"
       height="48.158627"
       id="rect2224" />
    <rect
       x="8.8313293"
       y="27.998915"
       width="97.091652"
       height="75.218668"
       id="rect2207-8" />
    <rect
       x="8.8313293"
       y="27.998915"
       width="190.31702"
       height="48.158627"
       id="rect2312" />
    <rect
       x="8.8313293"
       y="27.998915"
       width="190.31702"
       height="48.158627"
       id="rect2207-8-3" />
    <rect
       x="8.8313293"
       y="27.998915"
       width="190.31702"
       height="48.158627"
       id="rect2400" />
    <rect
       x="8.8313293"
       y="27.998915"
       width="190.31702"
       height="48.158627"
       id="rect2207-8-8" />
    <rect
       x="8.8313293"
       y="27.998915"
       width="190.31702"
       height="48.158627"
       id="rect2400-9" />
    <rect
       x="8.8313293"
       y="27.998915"
       width="178.64267"
       height="18.151253"
       id="rect2207-8-8-4" />
    <rect
       x="8.8313293"
       y="27.998915"
       width="190.31702"
       height="48.158627"
       id="rect2552" />
    <rect
       x="8.8313293"
       y="27.998915"
       width="178.56919"
       height="48.727045"
       id="rect2207-8-8-3" />
    <rect
       x="8.8313293"
       y="27.998915"
       width="190.31702"
       height="48.158627"
       id="rect2552-3" />
    <rect
       x="40.712574"
       y="495.30075"
       width="107.27708"
       height="17.707369"
       id="rect2657-8" />
    <rect
       x="40.712574"
       y="495.30075"
       width="107.27708"
       height="17.707369"
       id="rect2670" />
    <rect
       x="40.712574"
       y="495.30075"
       width="107.27708"
       height="17.707369"
       id="rect2657-8-9" />
    <rect
       x="40.712574"
       y="495.30075"
       width="107.27708"
       height="17.707369"
       id="rect2714" />
    <rect
       x="40.712574"
       y="495.30075"
       width="107.27708"
       height="17.707369"
       id="rect2657-8-9-7" />
    <rect
       x="40.712574"
       y="495.30075"
       width="107.27708"
       height="17.707369"
       id="rect2757" />
    <rect
       x="40.712574"
       y="495.30075"
       width="107.27708"
       height="17.707369"
       id="rect2657-8-9-7-4" />
    <rect
       x="40.712574"
       y="495.30075"
       width="107.27708"
       height="17.707369"
       id="rect2800" />
    <rect
       x="40.712574"
       y="495.30075"
       width="107.27708"
       height="17.707369"
       id="rect2657-8-9-0" />
    <rect
       x="40.712574"
       y="495.30075"
       width="107.27708"
       height="17.707369"
       id="rect2867" />
    <rect
       x="40.712574"
       y="495.30075"
       width="107.27708"
       height="17.707369"
       id="rect2657-8-9-0-0" />
    <rect
       x="40.712574"
       y="495.30075"
       width="107.27708"
       height="17.707369"
       id="rect2910" />
    <rect
       x="40.712574"
       y="495.30075"
       width="107.27708"
       height="17.707369"
       id="rect2657-8-9-0-2" />
    <rect
       x="40.712574"
       y="495.30075"
       width="107.27708"
       height="17.707369"
       id="rect2910-5" />
    <rect
       x="40.712574"
       y="495.30075"
       width="107.27708"
       height="17.707369"
       id="rect2657-8-9-0-05" />
    <rect
       x="40.712574"
       y="495.30075"
       width="107.27708"
       height="17.707369"
       id="rect2910-9" />
    <rect
       x="40.712574"
       y="495.30075"
       width="107.27708"
       height="17.707369"
       id="rect2657-8-9-0-9" />
    <rect
       x="40.712574"
       y="495.30075"
       width="107.27708"
       height="17.707369"
       id="rect2910-2" />
    <rect
       x="40.712574"
       y="495.30075"
       width="107.27708"
       height="17.707369"
       id="rect2657-8-9-0-4" />
    <rect
       x="40.712574"
       y="495.30075"
       width="107.27708"
       height="17.707369"
       id="rect2910-7" />
    <rect
       x="40.712574"
       y="495.30075"
       width="107.27708"
       height="17.707369"
       id="rect2657-8-9-0-5" />
    <rect
       x="40.712574"
       y="495.30075"
       width="107.27708"
       height="17.707369"
       id="rect2910-4" />
  </defs>
  <sodipodi:namedview
     id="base"
     pagecolor="#ffffff"
     bordercolor="#666666"
     borderopacity="1.0"
     inkscape:pageopacity="0.0"
     inkscape:pageshadow="2"
     inkscape:zoom="0.49497475"
     inkscape:cx="36.491804"
     inkscape:cy="609.47167"
     inkscape:document-units="mm"
     inkscape:current-layer="layer1"
     inkscape:document-rotation="0"
     showgrid="false"
     inkscape:window-width="1920"
     inkscape:window-height="1016"
     inkscape:window-x="0"
     inkscape:window-y="27"
     inkscape:window-maximized="1" />
  <metadata
     id="metadata5">
    <rdf:RDF>
      <cc:Work
         rdf:about="">
        <dc:format>image/svg+xml</dc:format>
        <dc:type
           rdf:resource="http://purl.org/dc/dcmitype/StillImage" />
        <dc:title></dc:title>
      </cc:Work>
    </rdf:RDF>
  </metadata>
  <g
     inkscape:label="Calque 1"
     inkscape:groupmode="layer"
     id="layer1">
    <text
       xml:space="preserve"
       style="font-size:8.46667px;line-height:1.25;font-family:Cantarell;-inkscape-font-specification:'Cantarell, Normal';letter-spacing:0px;word-spacing:0px;stroke-width:0.264583"
       x="54.596855"
       y="17.245808"
       id="text835"><tspan
         sodipodi:role="line"
         id="tspan833"
         x="54.596855"
         y="17.245808"
         style="stroke-width:0.264583">Objective &amp; Key Results</tspan></text>
    <g
       id="g2203"
       transform="matrix(0.38639351,0,0,0.38639351,47.105908,16.922257)">
      <path
         d="m 76.622719,89.166473 c 0,9.50295 -7.750625,17.253567 -17.253567,17.253567 -9.502942,0 -17.253568,-7.750617 -17.253568,-17.253567 0,-9.50294 7.750626,-17.25357 17.253568,-17.25357 9.502942,0 17.253567,7.75063 17.253567,17.25357 z M 59.369152,52.502643 c -20.219026,0 -36.663832,16.44481 -36.663832,36.66383 0,20.219027 16.444806,36.663837 36.663832,36.663837 20.219025,0 36.663831,-16.44481 36.663831,-36.663837 0,-20.21902 -16.444806,-36.66383 -36.663831,-36.66383 z m 51.760708,36.66383 c 0,28.576227 -23.184487,51.760707 -51.760708,51.760707 -28.576222,0 -51.7607037,-23.18448 -51.7607037,-51.760707 0,-28.57622 23.1844817,-51.7607 51.7607037,-51.7607 28.576221,0 51.760708,23.18448 51.760708,51.7607 z"
         id="path1576"
         style="stroke-width:0.0673967" />
      <path
         style="fill:#bf616a;stroke:none;stroke-width:0.241771"
         d="m 36.75202,83.412626 2.13831,7.626768 -36.3873466,10.596156 c -1.2366572,0.10382 -2.373767,-1.09408 -3.3262618,-1.777051 -2.3590303,-1.69141 -4.7349327,-4.17454 -7.3652901,-5.371206 -2.0803435,-0.946704 -5.9340495,1.227656 -8.0780645,1.686986 1.722057,3.30879 7.2220265,5.402951 9.9787836,7.872801 -1.4554791,0.31197 -3.7772056,1.66682 -5.2269796,1.19987 -3.690253,-1.18856 -5.969927,-6.627671 -9.741193,-7.551741 -2.072261,-0.5078 -6.062112,1.50198 -8.078064,2.16945 2.08557,2.614751 6.922899,6.163651 9.978783,7.380741 v 0.49205 c -1.49254,0.3191 -3.993178,1.66732 -5.464571,1.20012 -3.656275,-1.161 -5.862055,-6.00424 -9.503601,-7.20239 -2.223889,-0.73143 -5.798221,1.50175 -8.078057,1.81985 1.513822,2.92745 6.229345,5.5336 8.790825,7.53476 1.103564,0.86207 2.867242,1.8474 3.308206,3.29132 0.444054,1.45303 -0.778581,3.37054 -1.306747,4.67349 -1.315724,3.24703 -3.324955,6.86163 -3.902177,10.33305 1.883902,-0.28712 6.321559,-0.93244 7.673684,-2.35299 2.646279,-2.78008 1.73678,-8.89552 4.561963,-11.49133 1.078665,-0.99123 3.705695,-1.44072 5.108426,-1.65526 l -4.514212,11.80921 c 1.889795,-0.17075 6.63755,-1.01683 7.911984,-2.5348 2.446469,-2.91441 1.977462,-8.50975 4.7729515,-11.11639 1.139244,-1.06209 3.4512327,-1.18067 4.8967299,-1.60236 l -4.2766199,11.8092 c 1.9795964,-0.42317 7.0390809,-1.04979 8.2650431,-2.77492 1.6897371,-2.37709 2.6163427,-5.84088 3.7513106,-8.54223 0.5153294,-1.22717 0.9617615,-2.82634 2.2492599,-3.3831 L 40.481468,97.488199 c 0,0 2.024269,6.029101 2.447891,7.574631 l 5.702162,-4.66218 8.553241,-7.606996 5.22698,-5.19861 z"
         id="path1719"
         sodipodi:nodetypes="cccccccccccccccccccccccccccccccccccc" />
    </g>
    <g
       id="g2199"
       transform="matrix(0.1077803,0,0,0.1077803,186.87004,74.597505)">
      <path
         d="m -72.649478,-388.13244 c 1.078278,2.12313 1.212947,4.72549 0.516381,6.85976 l -48.174483,129.51619 c -1.28076,3.32121 -4.10788,5.35053 -7.53775,5.60872 -3.19399,0.13838 -6.3991,-1.49809 -7.95661,-4.56483 l -26.83714,-52.84227 -392.91225,243.637809 c -4.04752,2.509794 -9.22623,0.531243 -11.38278,-3.71501 l -23.00326,-45.293379 c -2.15656,-4.24625 -0.53123,-9.22622 3.71502,-11.38278 l 392.91225,-243.6378 -26.83714,-52.84228 c -1.55752,-3.06673 -1.22409,-6.50033 1.0077,-9.11754 2.23179,-2.61722 5.53815,-3.70293 8.85565,-3.0138 l 132.519785,36.55953 c 2.13427,0.69656 4.036349,2.10456 5.114627,4.22768 z"
         id="path2182"
         style="fill:#d8dee9;stroke-width:0.264583"
         sodipodi:nodetypes="scccscssscccsccs" />
      <path
         d="m -492.45324,-213.44542 c 8.94281,-8.57943 9.23761,-22.79562 0.65815,-31.73843 -8.5794,-8.94275 -22.79559,-9.23755 -31.7384,-0.65812 -2.44659,2.34719 -4.24227,5.20403 -5.46452,8.32084 -1.09199,-3.16481 -2.76771,-6.09364 -5.11493,-8.54024 -8.57943,-8.94277 -22.79558,-9.23758 -31.73839,-0.65812 -8.94278,8.5794 -9.23759,22.79559 -0.65816,31.73837 8.57943,8.94281 22.79562,9.23758 31.7384,0.65818 2.44663,-2.34722 4.2423,-5.20406 5.46455,-8.32084 1.09199,3.16478 2.76771,6.09361 5.1149,8.5402 8.57946,8.94278 22.79562,9.23759 31.7384,0.65816 z m 9.48469,128.77591 c -1.9404,1.861561 -17.1484,1.546198 -19.00997,-0.394205 -2.10439,-2.193524 -0.72996,-16.635345 -0.658,-20.106745 l -15.86917,-0.32907 -0.75414,36.366904 c -0.0618,2.975474 -1.36147,5.84261 -3.47062,7.866049 -4.72451,4.532543 -15.30399,4.313167 -19.83652,-0.41134 -2.02343,-2.109134 -3.20323,-5.027687 -3.14154,-8.003161 l 2.30012,-110.919092 c -15.07906,-2.54526 -29.91051,-9.05438 -40.59436,-20.19067 -17.6445,-18.39179 -17.04597,-43.26835 1.26145,-60.83194 27.67205,-26.54768 81.89181,-25.42336 108.4395,2.24871 17.56359,18.3074 17.13034,43.1874 -1.26145,60.8319 -11.13633,10.68385 -26.22486,16.57253 -41.39649,18.49047 l -1.2169,58.68297 15.86923,0.32908 c 0.072,-3.4714 -0.70255,-17.95777 1.49093,-20.06216 1.94043,-1.86157 17.1484,-1.54625 19.01001,0.39418 0.64747,0.67492 1.03845,1.75799 1.01787,2.7498 -0.12676,6.11625 0.26674,50.94111 -2.17995,53.28832 z"
         id="path1894"
         style="stroke-width:0.116913" />
      <rect
         style="fill:#8fbcbb;stroke:#ffffff;stroke-width:1.5;stroke-linecap:round;stroke-linejoin:round"
         id="rect2034"
         width="67.73333"
         height="135.46666"
         x="-443.72549"
         y="-194.21349" />
      <rect
         style="fill:#d08770;stroke:#ffffff;stroke-width:1.5;stroke-linecap:round;stroke-linejoin:round"
         id="rect2036"
         width="67.73333"
         height="239.18332"
         x="-342.12549"
         y="-297.93015" />
      <rect
         style="fill:#5e81ac;stroke:#ffffff;stroke-width:1.5;stroke-linecap:round;stroke-linejoin:round"
         id="rect2038"
         width="67.733337"
         height="203.2"
         x="-240.5255"
         y="-261.94681" />
      <rect
         style="fill:#bf616a;stroke:#ffffff;stroke-width:1.5;stroke-linecap:round;stroke-linejoin:round"
         id="rect2040"
         width="67.73333"
         height="304.79999"
         x="-138.92548"
         y="-363.54681" />
    </g>
    <text
       xml:space="preserve"
       id="text2205"
       style="font-style:normal;font-variant:normal;font-weight:normal;font-stretch:normal;font-size:4.23333px;line-height:1.25;font-family:sans-serif;-inkscape-font-specification:'sans-serif, Normal';font-variant-ligatures:normal;font-variant-caps:normal;font-variant-numeric:normal;font-variant-east-asian:normal;text-align:justify;letter-spacing:0px;word-spacing:0px;white-space:pre;shape-inside:url(#rect2207)"
       x="0"
       y="0"
       transform="translate(0.96118982,51.782748)"><tspan
         x="8.8320312"
         y="31.743552"><tspan
           dx="0 0 0 0 0.71025074 0 0 0 0.7102493 0 0 0 0 0 0 0 0 0 0 0.7102474 0 0.7102474 0 0 0 0.7102474 0 0 0 0 0 0 0 0 0.7102474 0 0 0 0 0.7102474 0 0 0 0.71025503 0 0 0 0 0 0 0 0 0.71025503 0 0 0 0 0 0 0.71025503 0 0 0 0 0.71023977 0 0 0 0 0 0 0 0.71025503"
           style="font-style:normal;font-variant:normal;font-weight:normal;font-stretch:normal;font-size:4.23333px;font-family:sans-serif;-inkscape-font-specification:'sans-serif, Normal';font-variant-ligatures:normal;font-variant-caps:normal;font-variant-numeric:normal;font-variant-east-asian:normal;text-align:justify;text-anchor:start">Les OKR (Objective &amp; Key Results) sont une pratique simple pour aligner globalement </tspan></tspan><tspan
         x="8.8320312"
         y="37.035216"><tspan
           dx="0 0 0 0 0.95033109 0 0 0 0 0 0 0 0 0 0 0 0 0.95032918 0 0 0 0.95032918 0 0 0 0.95032918 0 0 0 0 0 0 0 0 0 0.95033681 0 0 0 0 0 0 0 0 0.95032918 0 0 0 0 0.95032918 0 0 0 0 0.95032918 0 0 0 0 0 0 0 0 0 0 0 0.95032156 0 0 0 0 0 0 0 0 0.95033681 0 0 0 0 0.95033681"
           style="font-style:normal;font-variant:normal;font-weight:normal;font-stretch:normal;font-size:4.23333px;font-family:sans-serif;-inkscape-font-specification:'sans-serif, Normal';font-variant-ligatures:normal;font-variant-caps:normal;font-variant-numeric:normal;font-variant-east-asian:normal;text-align:justify;text-anchor:start">une organisation sur des objectifs communs. Tout part d’objectifs exprimés sous une </tspan></tspan><tspan
         x="8.8320312"
         y="42.32688"><tspan
           dx="0 0 0 0 0 0 1.2297596 0 0 0 0 0 0 0 0 0 1.2297577 0 0 0 0 0 0 0 0 0 1.2297596 0 0 0 1.2297558 0 0 0 1.2297634 0 0 0 0 0 0 0 0 0 0 0 1.2297558 0 0 0 1.2297634 0 0 0 0 0 0 0 0 0 0 1.229771 0 0 1.2297558 0 0 0 0 0 0 0 1.2297558 0 0 0 0 0 0 0 0 1.229771"
           style="font-style:normal;font-variant:normal;font-weight:normal;font-stretch:normal;font-size:4.23333px;font-family:sans-serif;-inkscape-font-specification:'sans-serif, Normal';font-variant-ligatures:normal;font-variant-caps:normal;font-variant-numeric:normal;font-variant-east-asian:normal;text-align:justify;text-anchor:start">forme littérale complétés par des indicateurs qui permettent de mesurer l’impact à </tspan></tspan><tspan
         x="8.8320312"
         y="47.618544"><tspan
           dx="0 0 0 0 0 0 0 0 0.60196149 0 0 0.60196149 0 0 0 0 0 0 0.6019634 0 0 0.6019634 0 0 0 0.6019634 0 0 0 0 0 0 0 0 0 0 0 0.6019634 0 0.6019634 0 0 0 0.6019634 0 0 0 0 0 0 0 0 0 0 0.6019634 0 0 0 0.60194814 0 0 0.6019634 0 0 0.6019634 0 0 0 0 0 0 0.6019634 0 0 0 0.6019634 0 0 0.6019634"
           style="font-style:normal;font-variant:normal;font-weight:normal;font-stretch:normal;font-size:4.23333px;font-family:sans-serif;-inkscape-font-specification:'sans-serif, Normal';font-variant-ligatures:normal;font-variant-caps:normal;font-variant-numeric:normal;font-variant-east-asian:normal;text-align:justify;text-anchor:start">travers le temps. Le mot globalement a son importance car il ne s’agit pas de décrire </tspan></tspan><tspan
         x="8.8320312"
         y="52.910208"><tspan
           dx="0 0 0 0 0 0.3089155 0 0 0.3089155 0 0 0 0 0 0 0.30891645 0 0 0 0 0 0 0 0 0 0 0 0 0.30891454 0 0 0.30891836 0 0 0 0 0 0.30891073 0 0 0 0 0.30891836 0 0 0 0 0.30891836 0 0 0 0 0 0 0 0 0 0 0.30891073 0 0 0 0 0.30891836 0 0 0 0 0.3089031 0 0 0.30891836 0 0 0 0 0 0 0.30891836 0 0 0.30891836"
           style="font-style:normal;font-variant:normal;font-weight:normal;font-stretch:normal;font-size:4.23333px;font-family:sans-serif;-inkscape-font-specification:'sans-serif, Normal';font-variant-ligatures:normal;font-variant-caps:normal;font-variant-numeric:normal;font-variant-east-asian:normal;text-align:justify;text-anchor:start">tout ce qu’une organisation va faire lors d’un trimestre, mais bien de mettre en lumière </tspan></tspan><tspan
         x="8.8320312"
         y="58.201872"><tspan
           style="font-style:normal;font-variant:normal;font-weight:normal;font-stretch:normal;font-size:4.23333px;font-family:sans-serif;-inkscape-font-specification:'sans-serif, Normal';font-variant-ligatures:normal;font-variant-caps:normal;font-variant-numeric:normal;font-variant-east-asian:normal;text-align:justify;text-anchor:start">les objectifs majeurs.
</tspan></tspan></text>
    <text
       xml:space="preserve"
       style="font-style:normal;font-variant:normal;font-weight:normal;font-stretch:normal;font-size:7.05556px;line-height:1.25;font-family:Cantarell;-inkscape-font-specification:'Cantarell, Normal';font-variant-ligatures:normal;font-variant-caps:normal;font-variant-numeric:normal;font-variant-east-asian:normal;letter-spacing:0px;word-spacing:0px;stroke-width:0.264583"
       x="24.975391"
       y="127.24706"
       id="text2213"><tspan
         sodipodi:role="line"
         id="tspan2211"
         x="24.975391"
         y="127.24706"
         style="font-style:normal;font-variant:normal;font-weight:normal;font-stretch:normal;font-size:7.05556px;font-family:Cantarell;-inkscape-font-specification:'Cantarell, Normal';font-variant-ligatures:normal;font-variant-caps:normal;font-variant-numeric:normal;font-variant-east-asian:normal;stroke-width:0.264583">Dans quel but ?</tspan></text>
    <text
       xml:space="preserve"
       id="text2205-3"
       style="font-style:normal;font-variant:normal;font-weight:normal;font-stretch:normal;font-size:4.23333px;line-height:1.25;font-family:sans-serif;-inkscape-font-specification:'sans-serif, Normal';font-variant-ligatures:normal;font-variant-caps:normal;font-variant-numeric:normal;font-variant-east-asian:normal;text-align:justify;letter-spacing:0px;word-spacing:0px;white-space:pre;shape-inside:url(#rect2207-5);"
       x="0"
       y="0"
       transform="translate(0.96118982,103.49888)"><tspan
         x="8.8320312"
         y="31.743552"><tspan
           dx="0 0 0 2.7679768 0 0 0 0 0 0 0 0 2.7679753 0 0 0 0 0 0 0 0 0 0 0 2.7679791 0 0 0 0 0 0 0 0 2.7679791"
           style="shape-inside:url(#rect2207-5)">Le principe fondamental derrière la </tspan></tspan><tspan
         x="8.8320312"
         y="37.035216"><tspan
           dx="0 0 0 0 0 0 0 0 6.4695554 0 0 0 6.4695554 0 0 0 6.4695554 0 0 6.4695592"
           style="shape-inside:url(#rect2207-5)">méthode OKR est de décrire </tspan></tspan><tspan
         x="8.8320312"
         y="42.32688"><tspan
           dx="0 0 0 0 0 0 0 0 0 0 0 0 0 0 0 1.1225971 0 0 1.1226009 0 0 0 0 0 0 0 0 0 1.1226009 0 0 1.1226009"
           style="shape-inside:url(#rect2207-5)">spécifiquement la stratégie en actions </tspan></tspan><tspan
         x="8.8320312"
         y="47.618544"><tspan
           dx="0 0 0 0 0 0 0 0 0.4325794 0 0 0.43257749 0 0 0 0 0 0 0 0 0 0 0 0.4325794 0 0 0.4325794 0 0 0 0 0 0 0 0.43257558"
           style="shape-inside:url(#rect2207-5)">claires et mesurables. La méthode OKR </tspan></tspan><tspan
         x="8.8320312"
         y="52.910208"><tspan
           dx="0 0 0 0 0 0 0 2.6906314 0 0 2.6906304 0 0 0 0 0 0 0 0 2.6906323 0 0 2.6906285 0 0 0 0 0 0 0 0 0 2.6906247"
           style="shape-inside:url(#rect2207-5)">permet de décliner la stratégie de </tspan></tspan><tspan
         x="8.8320312"
         y="58.201872"><tspan
           dx="0 0 0 0 0 0 0 0 0 0 0 0 0 0 0 3.4425893 0 0 3.4425855 0 0 0 0 0 0 0 0 0 3.4425855"
           style="shape-inside:url(#rect2207-5)">l'organisation en objectifs tactiques </tspan></tspan><tspan
         x="8.8320312"
         y="63.493536"><tspan
           dx="0 0 0 0 0 0 0 0 0 0 1.1437877 0 0 1.1437877 0 0 0 0 0 0 0 0 0 0 0 1.1437877 0 0 0 0 1.1437877"
           style="shape-inside:url(#rect2207-5)">ambitieux et mesurables. Ceci permet </tspan></tspan><tspan
         x="8.8320312"
         y="68.7852"><tspan
           dx="0 0 0 0 0 0 0 0 0 0 0.97583997 0 0 0 0.97583807 0 0 0 0 0 0 0 0 0 0.97583807 0 0 0.97583807"
           style="shape-inside:url(#rect2207-5)">d’aligner les activités de l'organisation </tspan></tspan><tspan
         x="8.8320312"
         y="74.076865"><tspan
           dx="0 0 0 2.1994734 0 0 0 2.199472 0 0 0 0 0 0 0 2.1994748 0 0 0 0 0 2.199471 0 0 0 0 0 0 2.199471 0 0 0 0 2.1994748"
           style="shape-inside:url(#rect2207-5)">et les équipes entre elles. Tous les </tspan></tspan><tspan
         x="8.8320312"
         y="79.368529"><tspan
           dx="0 0 0 0 0 0 0 0 0 0 0 0 0 0 0 3.8082223 0 0 0 0 0 0 3.8082242 0 0 0 3.8082242 0 0 0 0 3.8082242"
           style="shape-inside:url(#rect2207-5)">collaborateurs savent sur quoi se </tspan></tspan><tspan
         x="8.8320312"
         y="84.660193"><tspan
           dx="0 0 0 0 0 0 0 0 0 0 0.97208059 0 0 0.97208059 0 0 0.97208059 0 0 0 0 0 0 0.97208059 0 0 0 0 0 0 0 0 0 0.97208059"
           style="shape-inside:url(#rect2207-5)">focaliser et se voient embarqués dans </tspan></tspan><tspan
         x="8.8320312"
         y="89.951857"><tspan
           style="shape-inside:url(#rect2207-5)">un collectif qui a du sens !</tspan></tspan></text>
    <text
       xml:space="preserve"
       style="font-style:normal;font-variant:normal;font-weight:normal;font-stretch:normal;font-size:7.05556px;line-height:1.25;font-family:Cantarell;-inkscape-font-specification:'Cantarell, Normal';font-variant-ligatures:normal;font-variant-caps:normal;font-variant-numeric:normal;font-variant-east-asian:normal;letter-spacing:0px;word-spacing:0px;stroke-width:0.264583"
       x="137.91805"
       y="127.04715"
       id="text2301"><tspan
         sodipodi:role="line"
         id="tspan2299"
         x="137.91805"
         y="127.04715"
         style="font-style:normal;font-variant:normal;font-weight:normal;font-stretch:normal;font-size:7.05556px;font-family:Cantarell;-inkscape-font-specification:'Cantarell, Normal';font-variant-ligatures:normal;font-variant-caps:normal;font-variant-numeric:normal;font-variant-east-asian:normal;stroke-width:0.264583">Histoire</tspan></text>
    <text
       xml:space="preserve"
       id="text2205-8"
       style="font-style:normal;font-variant:normal;font-weight:normal;font-stretch:normal;font-size:4.23333px;line-height:1.25;font-family:sans-serif;-inkscape-font-specification:'sans-serif, Normal';font-variant-ligatures:normal;font-variant-caps:normal;font-variant-numeric:normal;font-variant-east-asian:normal;text-align:justify;letter-spacing:0px;word-spacing:0px;white-space:pre;shape-inside:url(#rect2207-8);"
       x="0"
       y="0"
       transform="translate(94.185799,103.49126)"><tspan
         x="8.8320312"
         y="31.743552"><tspan
           dx="0 0 0 0.96739852 0 0 0 0 0 0 0 0.96739805 0 0 0 0.96739614 0 0 0 0.96739614 0 0.96739995 0 0 0 0.96739995 0 0 0 0 0.96740377 0 0 0.96739614"
           style="shape-inside:url(#rect2207-8)">La théorie des OKR a été pour la première </tspan></tspan><tspan
         x="8.8320312"
         y="37.035216"><tspan
           dx="0 0 0 0 0 0.057118773 0 0 0 0 0 0.05711782 0 0 0 0 0.05711782 0 0 0.057121634 0 0 0 0 0 0.05711782 0 0 0.05711782 0 0 0 0 0 0 0.05711782 0 0 0 0 0 0 0.05711782"
           style="shape-inside:url(#rect2207-8)">fois citée dans le livre de Andrew Grove, High </tspan></tspan><tspan
         x="8.8320312"
         y="42.32688"><tspan
           dx="0 0 0 0 0 0 0 2.3538918 0 0 0 0 0 0 0 0 0 0 2.3538899 0 0 0 0 0 0 0 2.3538938 0 0 0 0 0 0 2.3538938"
           style="shape-inside:url(#rect2207-8)">Output Management (1983). Grove, alors </tspan></tspan><tspan
         x="8.8320312"
         y="47.618544"><tspan
           dx="0 0 0 0 0 0 0 0 0 0 0.059963584 0 0 0 0 0.059961677 0 0 0 0.059959769 0 0 0.059963584 0 0 0 0 0 0.059963584 0 0 0 0 0 0 0.059963584 0 0 0.059963584"
           style="shape-inside:url(#rect2207-8)">président puis CEO de Intel décrit la méthode </tspan></tspan><tspan
         x="8.8320312"
         y="52.910208"><tspan
           dx="0 0 0 0 0.2315315 0 0 0 0 0.2315315 0 0 0.2315315 0 0 0 0 0 0 0 0.23152959 0 0 0 0 0 0 0.23152959 0 0 0 0 0 0 0 0 0 0 0.23153341"
           style="shape-inside:url(#rect2207-8)">OKR dans sa théorie “MBO”, Management by </tspan></tspan><tspan
         x="8.8320312"
         y="58.201872"><tspan
           dx="0 0 0 0 0 0 0 0 0 0 0 1.0624889 0 0 1.062487 0 0 0 0 0 0 1.0624889 0 0 1.0624889 0 0 0 0 0 0 0 0 1.0624889 0 0 0 0 1.0624889"
           style="shape-inside:url(#rect2207-8)">Objectives et marque un tournant dans les </tspan></tspan><tspan
         x="8.8320312"
         y="63.493536"><tspan
           dx="0 0 0 0 0 0 0 0 0 0 1.5766796 0 0 1.5766796 0 0 0 0 0 0 0 0 0 0 1.5766796 0 0 0 0 0 0 0 0 0 1.5766796"
           style="shape-inside:url(#rect2207-8)">pratiques de management modernes. John </tspan></tspan><tspan
         x="8.8320312"
         y="68.7852"><tspan
           dx="0 0 0 0 0 0 0 1.2088398 0 0 0 0 0 0 0 0 0 0 0 1.2088398 0 0 0 0 0 0 0 1.2088398 0 0 0 0 0 0 0 0 0 0 1.208836 0 0 1.2088436"
           style="shape-inside:url(#rect2207-8)">Doerr, aujourd’hui Venture Capitalist et qui </tspan></tspan><tspan
         x="8.8320312"
         y="74.076865"><tspan
           dx="0 0 0 0 0 0 0 0 0 0 0.36864698 0 0 0 0 0.36864507 0 0 0 0 0 0.36864889 0 0.36864507 0 0 0 0 0 0 0 0 0.36864889 0 0 0 0 0 0 0 0 0 0 0 0.36864889"
           style="shape-inside:url(#rect2207-8)">travaille avec Grove à l’époque explicitera la </tspan></tspan><tspan
         x="8.8320312"
         y="79.368529"><tspan
           dx="0 0 0 0 0 0 0 0 0.31037271 0 0 0.31037176 0 0 0 0 0.31037176 0 0.31037176 0 0 0 0 0 0 0 0 0 0.31037176 0 0 0.31037176 0 0 0 0 0 0 0 0 0 0 0 0.31036794"
           style="shape-inside:url(#rect2207-8)">théorie et sera à l’origine du déploiement de </tspan></tspan><tspan
         x="8.8320312"
         y="84.660193"><tspan
           dx="0 0 0 0 0 0 0 0 0 2.868588 0 0 0 0 2.8685899 0 0 2.8685918 0 0 0 0 0 0 0 0 0 0 2.868588"
           style="shape-inside:url(#rect2207-8)">celle-ci dans de nombreuses entreprises </tspan></tspan><tspan
         x="8.8320312"
         y="89.951857"><tspan
           style="shape-inside:url(#rect2207-8)">comme Netflix ou Google.</tspan></tspan></text>
    <text
       xml:space="preserve"
       style="font-style:normal;font-variant:normal;font-weight:normal;font-stretch:normal;font-size:7.05556px;line-height:1.25;font-family:Cantarell;-inkscape-font-specification:'Cantarell, Normal';font-variant-ligatures:normal;font-variant-caps:normal;font-variant-numeric:normal;font-variant-east-asian:normal;letter-spacing:0px;word-spacing:0px;stroke-width:0.264583"
       x="9.1979084"
       y="211.68707"
       id="text2389"><tspan
         sodipodi:role="line"
         id="tspan2387"
         x="9.1979084"
         y="211.68707"
         style="font-style:normal;font-variant:normal;font-weight:normal;font-stretch:normal;font-size:7.05556px;font-family:Cantarell;-inkscape-font-specification:'Cantarell, Normal';font-variant-ligatures:normal;font-variant-caps:normal;font-variant-numeric:normal;font-variant-east-asian:normal;stroke-width:0.264583">Principes</tspan></text>
    <text
       xml:space="preserve"
       id="text2205-8-1"
       style="font-style:normal;font-variant:normal;font-weight:normal;font-stretch:normal;font-size:4.23333px;line-height:1.25;font-family:sans-serif;-inkscape-font-specification:'sans-serif, Normal';font-variant-ligatures:normal;font-variant-caps:normal;font-variant-numeric:normal;font-variant-east-asian:normal;text-align:justify;letter-spacing:0px;word-spacing:0px;white-space:pre;shape-inside:url(#rect2207-8-3);"
       x="0"
       y="0"
       transform="translate(0.82063004,188.77362)"><tspan
         x="8.8320312"
         y="31.743552"><tspan
           dx="0 0 0 0 0 0 1.1987642 0 0 0 0 1.1987633 0 0 0 0 0 0 0 1.1987613 0 0 0 1.1987652 0 0 0 0 0 0 0 0 0 0 0 1.1987652 0 0 1.1987652 0 0 0 0 0 0 0 0 0 1.1987652 0 0 0 0 0 1.1987652 0 1.1987652 0 0 0 1.1987652 0 0 0 0 0 0 0 0 0 1.1987652 0 0 0 0 0 0 0 0 0 1.1987652"
           style="shape-inside:url(#rect2207-8-3)">Grove nous indique que transmettre la stratégie grâce à des objectifs ambitieux et </tspan></tspan><tspan
         x="8.8320312"
         y="37.035216"><tspan
           dx="0 0 0 0 0 0 0 0 0 0 0 0.48804319 0 0 0 0 0 0 0 0 0 0.4880451 0 0 0.48804128 0 0 0 0 0 0 0 0.48804128 0 0 0 0.48804128 0 0 0.48804128 0 0 0.48804128 0 0 0 0 0 0 0 0 0 0 0.48804128 0 0 0.48804128 0 0 0.48804128 0 0 0 0 0 0 0.48804128 0 0 0 0 0 0.48804128"
           style="shape-inside:url(#rect2207-8-3)">mesurables constitue un élément clé de la délégation et du succès d’une organisation. </tspan></tspan><tspan
         x="8.8320312"
         y="42.32688"><tspan
           dx="0 0 0 1.2991823 0 0 0 0 0 1.2991832 0 0 1.2991813 0 0 0 0 1.2991832 0 0 0 0 0 0 0 0 0 0 1.2991832 0 1.2991832 0 0 0 1.2991832 0 0 0 0 0 0 0 0 0 1.2991832 0 0 0 1.2991832 0 0 0 1.2991756 0 0 0 0 0 0 0 1.2991832 0 0 0 0 0 0 1.2991832 0 0 1.2991832 0 0 0 0 0 0 0 0 0 0 1.2991832"
           style="shape-inside:url(#rect2207-8-3)">De plus, le fait d’attacher à ces objectifs des key results permet de formaliser les </tspan></tspan><tspan
         x="8.8320312"
         y="47.618544"><tspan
           dx="0 0 0 0 0 0 0 0 0 0 1.5212234 0 0 0 1.5212234 0 0 0 0 1.5212253 0 0 0 0 1.5212253 0 0 0 0 0 0 0 0 0 0 1.5212291 0 0 1.5212215 0 0 0 1.5212291 0 0 0 0 0 0 0 0 0 0 1.5212291 0 0 1.5212215 0 0 0 0 0 0 1.5212139 0 0 0 1.5212139 0 0 0 0 0 0 0 1.5212291"
           style="shape-inside:url(#rect2207-8-3)">résultats que l’on veut atteindre, de les visualiser et suivre les impacts souhaités </tspan></tspan><tspan
         x="8.8320312"
         y="52.910208"><tspan
           style="shape-inside:url(#rect2207-8-3)">(chiffrés et datés) et des informations très concrètes sur la réalisation de ces objectifs.</tspan></tspan></text>
    <text
       xml:space="preserve"
       id="text2205-8-6"
       style="font-style:normal;font-variant:normal;font-weight:normal;font-stretch:normal;font-size:4.23333px;line-height:1.25;font-family:sans-serif;-inkscape-font-specification:'sans-serif, Normal';font-variant-ligatures:normal;font-variant-caps:normal;font-variant-numeric:normal;font-variant-east-asian:normal;text-align:justify;letter-spacing:0px;word-spacing:0px;white-space:pre;shape-inside:url(#rect2207-8-8);"
       x="0"
       y="0"
       transform="translate(0.64286326,221.18153)"><tspan
         x="8.8320312"
         y="31.743552"><tspan
           style="shape-inside:url(#rect2207-8-8)">La méthode OKR demande de répondre à ces deux questions :</tspan></tspan></text>
    <text
       xml:space="preserve"
       id="text2205-8-6-3"
       style="font-style:normal;font-variant:normal;font-weight:normal;font-stretch:normal;font-size:4.23333px;line-height:1.25;font-family:sans-serif;-inkscape-font-specification:'sans-serif, Normal';font-variant-ligatures:normal;font-variant-caps:normal;font-variant-numeric:normal;font-variant-east-asian:normal;text-align:justify;letter-spacing:0px;word-spacing:0px;white-space:pre;shape-inside:url(#rect2207-8-8-4);"
       x="0"
       y="0"
       transform="translate(12.494458,232.67423)"><tspan
         x="8.8320312"
         y="31.743552"><tspan
           dx="0 0 0 0.78646171 0 0 0 0 0 0 0 0 0 0 0 0 0.78646123 0 0 0 0 0 0.78646505 0 0.78646123 0 0 0 0.78646123 0 0 0 0 0 0 0 0.78646505 0 0 0 0 0.78645742 0 0 0 0 0 0 0 0.78646505 0 0 0 0 0 0 0 0 0 0 0 0.78645742 0 0 0.78647268 0 0 0 0.78645742 0 0 0 0 0.78645742"
           style="font-style:normal;font-variant:normal;font-weight:normal;font-stretch:normal;font-size:4.23333px;font-family:sans-serif;-inkscape-font-specification:'sans-serif, Normal';font-variant-ligatures:normal;font-variant-caps:normal;font-variant-numeric:normal;font-variant-east-asian:normal">Où voulons-nous aller ? (La réponse vous fournit l’Objectif, ce que nous voulons </tspan></tspan><tspan
         x="8.8320312"
         y="37.035216"><tspan
           style="font-style:normal;font-variant:normal;font-weight:normal;font-stretch:normal;font-size:4.23333px;font-family:sans-serif;-inkscape-font-specification:'sans-serif, Normal';font-variant-ligatures:normal;font-variant-caps:normal;font-variant-numeric:normal;font-variant-east-asian:normal">atteindre)</tspan></tspan></text>
    <text
       xml:space="preserve"
       id="text2205-8-6-8"
       style="font-style:normal;font-variant:normal;font-weight:normal;font-stretch:normal;font-size:4.23333px;line-height:1.25;font-family:sans-serif;-inkscape-font-specification:'sans-serif, Normal';font-variant-ligatures:normal;font-variant-caps:normal;font-variant-numeric:normal;font-variant-east-asian:normal;text-align:justify;letter-spacing:0px;word-spacing:0px;white-space:pre;shape-inside:url(#rect2207-8-8-3);"
       x="0"
       y="0"
       transform="translate(12.568677,246.7585)"><tspan
         x="8.8320312"
         y="31.743552"><tspan
           dx="0 0 0 0 0 0 0 0 0.72944295 0 0 0 0 0 0 0 0 0 0 0 0.72944295 0 0 0 0 0 0 0.72944295 0 0 0.72944295 0 0 0 0 0.72944295 0 0 0 0 0 0 0.72944295 0 0 0 0 0 0 0 0.72944295 0 0.72944295 0 0 0 0 0 0 0 0 0 0 0 0.72943532 0 0.72945058 0 0 0 0.72943532"
           style="font-style:normal;font-variant:normal;font-weight:normal;font-stretch:normal;font-size:4.23333px;font-family:sans-serif;-inkscape-font-specification:'sans-serif, Normal';font-variant-ligatures:normal;font-variant-caps:normal;font-variant-numeric:normal;font-variant-east-asian:normal">Comment allons-nous savoir si nous sommes arrivés à destination ? (La réponse </tspan></tspan><tspan
         x="8.8320312"
         y="37.035216"><tspan
           dx="0 0 0 0 0 0.99644601 0 0 0 0 0 0 0 0.99644697 0 0 0 0 0 0 0 0.99644887 0 0 0.99644887 0 0 0.99644506 0 0 0 0.99644887 0 0 0 0 0 0 0 0.99644887 0 0 0.99644887 0 0 0 0 0 0 0 0.99644887 0 0 0 0 0.99644125 0 0 0 0 0 0 0.99644887 0 0 0 0.99644887 0 0 0 0 0.99644887"
           style="font-style:normal;font-variant:normal;font-weight:normal;font-stretch:normal;font-size:4.23333px;font-family:sans-serif;-inkscape-font-specification:'sans-serif, Normal';font-variant-ligatures:normal;font-variant-caps:normal;font-variant-numeric:normal;font-variant-east-asian:normal">nous fournit l’étape ou le key result, le comment nous savons que nous avons </tspan></tspan><tspan
         x="8.8320312"
         y="42.32688"><tspan
           style="font-style:normal;font-variant:normal;font-weight:normal;font-stretch:normal;font-size:4.23333px;font-family:sans-serif;-inkscape-font-specification:'sans-serif, Normal';font-variant-ligatures:normal;font-variant-caps:normal;font-variant-numeric:normal;font-variant-east-asian:normal">atteint notre objectif)</tspan></tspan></text>
    <circle
       style="fill:#2e3440;stroke:none;stroke-width:1.5;stroke-linecap:round;stroke-linejoin:round"
       id="path3041"
       cx="14.259938"
       cy="263.57196"
       r="2.5402021" />
    <circle
       style="fill:#2e3440;stroke:none;stroke-width:1.5;stroke-linecap:round;stroke-linejoin:round"
       id="path3041-1"
       cx="14.259938"
       cy="277.65656"
       r="2.5402021" />
  </g>
</svg>
