<?xml version="1.0" encoding="UTF-8" standalone="no"?>
<svg
   xmlns:dc="http://purl.org/dc/elements/1.1/"
   xmlns:cc="http://creativecommons.org/ns#"
   xmlns:rdf="http://www.w3.org/1999/02/22-rdf-syntax-ns#"
   xmlns:svg="http://www.w3.org/2000/svg"
   xmlns="http://www.w3.org/2000/svg"
   xmlns:sodipodi="http://sodipodi.sourceforge.net/DTD/sodipodi-0.dtd"
   xmlns:inkscape="http://www.inkscape.org/namespaces/inkscape"
   width="158.0011mm"
   height="204.29024mm"
   viewBox="0 0 158.0011 204.29024"
   version="1.1"
   id="svg8"
   inkscape:version="1.0.1 (3bc2e813f5, 2020-09-07)"
   sodipodi:docname="pirates-metrics-activation.svg">
  <defs
     id="defs2" />
  <sodipodi:namedview
     id="base"
     pagecolor="#ffffff"
     bordercolor="#666666"
     borderopacity="1.0"
     inkscape:pageopacity="0.0"
     inkscape:pageshadow="2"
     inkscape:zoom="0.27089825"
     inkscape:cx="350.47024"
     inkscape:cy="156.97061"
     inkscape:document-units="mm"
     inkscape:current-layer="layer1"
     inkscape:document-rotation="0"
     showgrid="false"
     inkscape:window-width="1920"
     inkscape:window-height="1016"
     inkscape:window-x="0"
     inkscape:window-y="27"
     inkscape:window-maximized="1"
     fit-margin-top="0"
     fit-margin-left="0"
     fit-margin-right="0"
     fit-margin-bottom="0"
     showguides="true"
     inkscape:guide-bbox="true">
    <sodipodi:guide
       position="78.997594,3.5935891"
       orientation="1,0"
       id="guide846" />
  </sodipodi:namedview>
  <metadata
     id="metadata5">
    <rdf:RDF>
      <cc:Work
         rdf:about="">
        <dc:format>image/svg+xml</dc:format>
        <dc:type
           rdf:resource="http://purl.org/dc/dcmitype/StillImage" />
        <dc:title></dc:title>
      </cc:Work>
    </rdf:RDF>
  </metadata>
  <g
     inkscape:label="Calque 1"
     inkscape:groupmode="layer"
     id="layer1"
     transform="translate(11.365152,-4.4598267)">
    <path
       style="fill:#4c566a;fill-opacity:1;stroke:#000000;stroke-width:0.265633px;stroke-linecap:butt;stroke-linejoin:miter;stroke-opacity:1"
       d="M -11.172197,4.5928303 67.632442,208.46862 146.44132,4.7455972 Z"
       id="path1132"
       sodipodi:nodetypes="cccc" />
    <rect
       style="opacity:0.999;fill:#eceff4;stroke-width:0.00658027"
       id="rect28"
       width="140"
       height="26.54339"
       x="-2.364604"
       y="19.66371" />
    <text
       xml:space="preserve"
       style="font-style:normal;font-weight:normal;font-size:10.5833px;line-height:1.25;font-family:sans-serif;letter-spacing:0px;word-spacing:0px;fill:#000000;fill-opacity:1;stroke:none;stroke-width:0.264583"
       x="41.970379"
       y="35.855114"
       id="text1028"><tspan
         sodipodi:role="line"
         id="tspan1026"
         x="41.970379"
         y="35.855114"
         style="stroke-width:0.264583">Aquisition</tspan></text>
    <rect
       style="opacity:0.999;fill:#b48ead;stroke-width:0.00609215"
       id="rect28-3"
       width="120"
       height="26.543392"
       x="7.635396"
       y="54.572006" />
    <text
       xml:space="preserve"
       style="font-style:normal;font-weight:normal;font-size:10.5833px;line-height:1.25;font-family:sans-serif;letter-spacing:0px;word-spacing:0px;fill:#000000;fill-opacity:1;stroke:none;stroke-width:0.264583"
       x="41.5518"
       y="71.789185"
       id="text1032"><tspan
         sodipodi:role="line"
         id="tspan1030"
         x="41.5518"
         y="71.789185"
         style="stroke-width:0.264583">Activation</tspan></text>
    <rect
       style="opacity:0.999;fill:#eceff4;stroke-width:0.00556136"
       id="rect28-6"
       width="100"
       height="26.543392"
       x="17.635397"
       y="89.480301" />
    <text
       xml:space="preserve"
       style="font-style:normal;font-weight:normal;font-size:10.5833px;line-height:1.25;font-family:sans-serif;letter-spacing:0px;word-spacing:0px;fill:#000000;fill-opacity:1;stroke:none;stroke-width:0.264583"
       x="42.050476"
       y="106.90936"
       id="text1036"><tspan
         sodipodi:role="line"
         id="tspan1034"
         x="42.050476"
         y="106.90936"
         style="stroke-width:0.264583">Rétention</tspan></text>
    <rect
       style="opacity:0.999;fill:#eceff4;stroke-width:0.00497421"
       id="rect28-7"
       width="80"
       height="26.543392"
       x="27.635397"
       y="124.3886" />
    <rect
       style="opacity:0.999;fill:#eceff4;stroke-width:0.00430781"
       id="rect28-5"
       width="60"
       height="26.543392"
       x="37.635395"
       y="159.29691" />
    <text
       xml:space="preserve"
       style="font-style:normal;font-weight:normal;font-size:10.5833px;line-height:1.25;font-family:sans-serif;letter-spacing:0px;word-spacing:0px;fill:#000000;fill-opacity:1;stroke:none;stroke-width:0.264583"
       x="44.828075"
       y="176.3513"
       id="text1040"><tspan
         sodipodi:role="line"
         id="tspan1038"
         x="44.828075"
         y="176.3513"
         style="stroke-width:0.264583">Revenus</tspan></text>
    <text
       xml:space="preserve"
       style="font-style:normal;font-weight:normal;font-size:10.5833px;line-height:1.25;font-family:sans-serif;letter-spacing:0px;word-spacing:0px;fill:#000000;fill-opacity:1;stroke:none;stroke-width:0.264583"
       x="40.75082"
       y="141.81766"
       id="text1044"><tspan
         sodipodi:role="line"
         id="tspan1042"
         x="40.75082"
         y="141.81766"
         style="stroke-width:0.264583">Réference</tspan></text>
  </g>
</svg>
