<?xml version="1.0" encoding="UTF-8" standalone="no"?>
<svg
   xmlns:dc="http://purl.org/dc/elements/1.1/"
   xmlns:cc="http://creativecommons.org/ns#"
   xmlns:rdf="http://www.w3.org/1999/02/22-rdf-syntax-ns#"
   xmlns:svg="http://www.w3.org/2000/svg"
   xmlns="http://www.w3.org/2000/svg"
   xmlns:sodipodi="http://sodipodi.sourceforge.net/DTD/sodipodi-0.dtd"
   xmlns:inkscape="http://www.inkscape.org/namespaces/inkscape"
   width="297mm"
   height="210mm"
   viewBox="0 0 297 210"
   version="1.1"
   id="svg4550"
   sodipodi:docname="lean-startup-board-en.svg"
   inkscape:version="1.0.1 (3bc2e813f5, 2020-09-07)">
  <defs
     id="defs4544">
    <rect
       x="2.6377301"
       y="41.69972"
       width="46.596593"
       height="50.913928"
       id="rect5244" />
    <rect
       x="2.2362745"
       y="24.246421"
       width="46.97803"
       height="16.831902"
       id="rect5238" />
    <rect
       x="2.2362745"
       y="24.246422"
       width="46.606203"
       height="22.116636"
       id="rect5238-5" />
    <rect
       x="2.2362745"
       y="24.246422"
       width="46.978031"
       height="16.831902"
       id="rect5257" />
    <rect
       x="2.6377301"
       y="41.699718"
       width="46.596592"
       height="50.913929"
       id="rect5244-6" />
    <rect
       x="2.6377301"
       y="41.699718"
       width="46.596592"
       height="50.913929"
       id="rect5260" />
    <rect
       x="2.2362745"
       y="24.246422"
       width="46.978031"
       height="16.831902"
       id="rect5238-5-5" />
    <rect
       x="2.2362745"
       y="24.246422"
       width="46.978031"
       height="16.831902"
       id="rect5339" />
    <rect
       x="2.6377301"
       y="41.699718"
       width="46.596592"
       height="50.913929"
       id="rect5244-6-9" />
    <rect
       x="2.6377301"
       y="41.699718"
       width="46.596592"
       height="50.913929"
       id="rect5342" />
    <rect
       x="2.2362745"
       y="24.246422"
       width="71.834072"
       height="12.258353"
       id="rect5238-5-5-4" />
    <rect
       x="2.2362745"
       y="24.246422"
       width="46.978031"
       height="16.831902"
       id="rect2161" />
    <rect
       x="2.6377301"
       y="41.699718"
       width="64.375903"
       height="50.722276"
       id="rect5244-6-9-7" />
    <rect
       x="2.6377301"
       y="41.699718"
       width="46.596592"
       height="50.913929"
       id="rect2164" />
    <rect
       x="2.2362745"
       y="24.246422"
       width="87.39877"
       height="11.893403"
       id="rect5238-3" />
    <rect
       x="2.2362745"
       y="24.246422"
       width="46.978031"
       height="16.831902"
       id="rect1073" />
    <rect
       x="2.6377301"
       y="41.699718"
       width="85.974729"
       height="35.456977"
       id="rect5244-61" />
    <rect
       x="2.6377301"
       y="41.699718"
       width="46.596592"
       height="50.913929"
       id="rect1076" />
    <rect
       x="194.55682"
       y="40.994301"
       width="390.34805"
       height="115.78642"
       id="rect1560-9-36" />
    <rect
       x="194.55682"
       y="40.994301"
       width="390.34805"
       height="115.78642"
       id="rect4838" />
    <rect
       x="194.55682"
       y="40.994301"
       width="390.34805"
       height="115.78642"
       id="rect1560-9-36-5" />
    <rect
       x="194.55682"
       y="40.994301"
       width="390.34805"
       height="115.78642"
       id="rect4841" />
  </defs>
  <sodipodi:namedview
     id="base"
     pagecolor="#ffffff"
     bordercolor="#666666"
     borderopacity="1.0"
     inkscape:pageopacity="0.0"
     inkscape:pageshadow="2"
     inkscape:zoom="0.49497475"
     inkscape:cx="340.16871"
     inkscape:cy="274.12174"
     inkscape:document-units="mm"
     inkscape:current-layer="layer1"
     inkscape:document-rotation="0"
     showgrid="false"
     showguides="true"
     inkscape:guide-bbox="true"
     inkscape:window-width="1920"
     inkscape:window-height="1016"
     inkscape:window-x="0"
     inkscape:window-y="27"
     inkscape:window-maximized="1">
    <sodipodi:guide
       position="-26.458334,225.11904"
       orientation="1,0"
       id="guide5222" />
  </sodipodi:namedview>
  <metadata
     id="metadata4547">
    <rdf:RDF>
      <cc:Work
         rdf:about="">
        <dc:format>image/svg+xml</dc:format>
        <dc:type
           rdf:resource="http://purl.org/dc/dcmitype/StillImage" />
        <dc:title></dc:title>
      </cc:Work>
    </rdf:RDF>
  </metadata>
  <g
     inkscape:label="Calque 1"
     inkscape:groupmode="layer"
     id="layer1">
    <rect
       style="opacity:0.999;fill:#4c566a;stroke:#000000;stroke-width:0.793738;stroke-miterlimit:4;stroke-dasharray:none;stroke-opacity:1"
       id="rect5113"
       width="147.70627"
       height="95.938522"
       x="148.5"
       y="0.79260772" />
    <rect
       style="opacity:0.999;fill:#fefefe;stroke:#000000;stroke-width:0.728;stroke-miterlimit:4;stroke-dasharray:none;stroke-opacity:1;fill-opacity:1"
       id="rect5113-2"
       width="147.70627"
       height="80.681427"
       x="148.5"
       y="16.0497" />
    <g
       id="g1156"
       transform="translate(16.575185,8.1130203)"
       style="fill:#eceff4">
      <path
         d="m 248.74032,40.940231 c 0,0.239027 -0.19393,0.432956 -0.43296,0.432956 -0.14431,0 -0.27961,-0.07216 -0.36078,-0.193929 l -1.02377,-1.537891 h -0.20294 v 0.595314 l 1.11395,1.853586 c 0.0271,0.0451 0.0406,0.09471 0.0406,0.148829 0,0.157848 -0.13079,0.288635 -0.28864,0.288635 h -0.8659 v 1.226705 c 0,0.279618 -0.2255,0.505113 -0.50512,0.505113 h -0.72159 c -0.27511,0 -0.50511,-0.225495 -0.50511,-0.505113 v -1.226705 h -0.86591 c -0.15785,0 -0.28864,-0.130787 -0.28864,-0.288635 0,-0.05412 0.0136,-0.10373 0.0406,-0.148829 l 1.11395,-1.853586 v -0.595314 h -0.20294 l -1.02376,1.537891 c -0.0812,0.121769 -0.21648,0.193929 -0.36079,0.193929 -0.23903,0 -0.43296,-0.193929 -0.43296,-0.432956 0,-0.08569 0.0271,-0.171378 0.0722,-0.239028 l 1.15455,-1.731818 c 0.18039,-0.266086 0.46001,-0.482563 0.79374,-0.482563 h 1.73183 c 0.33373,0 0.61335,0.216477 0.79374,0.482563 l 1.15456,1.731818 c 0.0451,0.06765 0.0722,0.153339 0.0722,0.239028 z m -1.87614,-3.607955 c 0,0.559233 -0.45099,1.010227 -1.01022,1.010227 -0.55924,0 -1.01023,-0.450994 -1.01023,-1.010227 0,-0.559233 0.45099,-1.010227 1.01023,-1.010227 0.55923,0 1.01022,0.450994 1.01022,1.010227 z"
         id="path5504-7-2-2"
         style="fill:#eceff4;stroke-width:0.00450993" />
      <path
         d="m 253.72788,39.352731 v 1.876136 c 0,0.239027 -0.19393,0.432955 -0.43296,0.432955 -0.23902,0 -0.43295,-0.193928 -0.43295,-0.432955 v -1.5875 h -0.28863 v 4.113069 c 0,0.279616 -0.2255,0.505113 -0.50512,0.505113 -0.27961,0 -0.50511,-0.225497 -0.50511,-0.505113 v -2.092614 h -0.28865 v 2.092614 c 0,0.279616 -0.22549,0.505113 -0.50511,0.505113 -0.27961,0 -0.50511,-0.225497 -0.50511,-0.505113 v -4.113069 h -0.28864 v 1.5875 c 0,0.239027 -0.19392,0.432955 -0.43295,0.432955 -0.23903,0 -0.43296,-0.193928 -0.43296,-0.432955 v -1.876136 c 0,-0.478054 0.38786,-0.865909 0.86591,-0.865909 h 2.88637 c 0.47805,0 0.86591,0.387855 0.86591,0.865909 z m -1.29886,-2.020455 c 0,0.559233 -0.451,1.010227 -1.01023,1.010227 -0.55924,0 -1.01023,-0.450994 -1.01023,-1.010227 0,-0.559233 0.45099,-1.010227 1.01023,-1.010227 0.55923,0 1.01023,0.450994 1.01023,1.010227 z"
         id="path922-5-7-61"
         style="fill:#eceff4;stroke-width:0.00450993" />
    </g>
    <rect
       style="opacity:0.999;fill:#4c566a;stroke:#000000;stroke-width:0.793737;stroke-miterlimit:4;stroke-dasharray:none;stroke-opacity:1"
       id="rect5113-3"
       width="147.70627"
       height="95.938522"
       x="0.79373002"
       y="0.79260772" />
    <rect
       style="opacity:1;fill:#fefefe;stroke:#000000;stroke-width:0.525382;stroke-miterlimit:4;stroke-dasharray:none;stroke-opacity:1;fill-opacity:1"
       id="rect5184"
       width="49.733566"
       height="80.644012"
       x="0.88240397"
       y="16.0497" />
    <rect
       style="opacity:0.999;fill:#2e3440;stroke-width:0.00582083"
       id="rect5115"
       width="0.23599106"
       height="8.7916183"
       x="148.382"
       y="66.821045" />
    <text
       xml:space="preserve"
       style="font-style:normal;font-weight:normal;font-size:10.5833px;line-height:1.25;font-family:sans-serif;letter-spacing:0px;word-spacing:0px;fill:#eceff4;fill-opacity:1;stroke:none;stroke-width:0.264583"
       x="171.83441"
       y="11.676403"
       id="text5134"><tspan
         sodipodi:role="line"
         id="tspan5132"
         x="171.83441"
         y="11.676403"
         style="fill:#eceff4;stroke-width:0.264583">Indicateurs actuels</tspan></text>
    <text
       xml:space="preserve"
       style="font-style:normal;font-weight:normal;font-size:10.5833px;line-height:1.25;font-family:sans-serif;letter-spacing:0px;word-spacing:0px;fill:#eceff4;fill-opacity:1;stroke:none;stroke-width:0.264583"
       x="13.935"
       y="11.676403"
       id="text5138"><tspan
         sodipodi:role="line"
         id="tspan5136"
         x="13.935"
         y="11.676403"
         style="fill:#eceff4;stroke-width:0.264583">Indicateurs de réussite</tspan></text>
    <rect
       style="opacity:1;fill:#fefefe;stroke:#000000;stroke-width:0.521923;stroke-miterlimit:4;stroke-dasharray:none;stroke-opacity:1;fill-opacity:1"
       id="rect5184-9"
       width="48.832321"
       height="80.775764"
       x="50.615971"
       y="16.0497" />
    <text
       xml:space="preserve"
       style="font-style:normal;font-variant:normal;font-weight:normal;font-stretch:normal;font-size:4.23333px;line-height:1.25;font-family:sans-serif;-inkscape-font-specification:'sans-serif, Normal';font-variant-ligatures:normal;font-variant-caps:normal;font-variant-numeric:normal;font-variant-east-asian:normal;letter-spacing:0px;word-spacing:0px;fill:#000000;fill-opacity:1;stroke:none;stroke-width:0.264583"
       x="5.0837994"
       y="21.823463"
       id="text5146"><tspan
         sodipodi:role="line"
         id="tspan5144"
         x="5.0837994"
         y="21.823463"
         style="font-style:normal;font-variant:normal;font-weight:normal;font-stretch:normal;font-size:4.23333px;font-family:sans-serif;-inkscape-font-specification:'sans-serif, Normal';font-variant-ligatures:normal;font-variant-caps:normal;font-variant-numeric:normal;font-variant-east-asian:normal;stroke-width:0.264583">Problème / Solution</tspan></text>
    <rect
       style="opacity:1;fill:#fefefe;stroke:#000000;stroke-width:0.521923;stroke-miterlimit:4;stroke-dasharray:none;stroke-opacity:1;fill-opacity:1"
       id="rect5184-6"
       width="48.968025"
       height="80.681435"
       x="99.531975"
       y="16.0497" />
    <text
       xml:space="preserve"
       style="font-style:normal;font-variant:normal;font-weight:normal;font-stretch:normal;font-size:4.23333px;line-height:1.25;font-family:sans-serif;-inkscape-font-specification:'sans-serif, Normal';font-variant-ligatures:normal;font-variant-caps:normal;font-variant-numeric:normal;font-variant-east-asian:normal;letter-spacing:0px;word-spacing:0px;fill:#000000;fill-opacity:1;stroke:none;stroke-width:0.264583"
       x="57.427017"
       y="21.823463"
       id="text5146-0"><tspan
         sodipodi:role="line"
         id="tspan5144-8"
         x="57.427017"
         y="21.823463"
         style="font-style:normal;font-variant:normal;font-weight:normal;font-stretch:normal;font-size:4.23333px;font-family:sans-serif;-inkscape-font-specification:'sans-serif, Normal';font-variant-ligatures:normal;font-variant-caps:normal;font-variant-numeric:normal;font-variant-east-asian:normal;stroke-width:0.264583">Produit / marché</tspan></text>
    <text
       xml:space="preserve"
       style="font-style:normal;font-variant:normal;font-weight:normal;font-stretch:normal;font-size:4.23333px;line-height:1.25;font-family:sans-serif;-inkscape-font-specification:'sans-serif, Normal';font-variant-ligatures:normal;font-variant-caps:normal;font-variant-numeric:normal;font-variant-east-asian:normal;letter-spacing:0px;word-spacing:0px;fill:#000000;fill-opacity:1;stroke:none;stroke-width:0.264583"
       x="116.2976"
       y="21.989861"
       id="text5146-0-8"><tspan
         sodipodi:role="line"
         id="tspan5144-8-5"
         x="116.2976"
         y="21.989861"
         style="font-style:normal;font-variant:normal;font-weight:normal;font-stretch:normal;font-size:4.23333px;font-family:sans-serif;-inkscape-font-specification:'sans-serif, Normal';font-variant-ligatures:normal;font-variant-caps:normal;font-variant-numeric:normal;font-variant-east-asian:normal;stroke-width:0.264583">Échelle</tspan></text>
    <text
       xml:space="preserve"
       id="text5236"
       style="font-style:normal;font-variant:normal;font-weight:normal;font-stretch:normal;font-size:3.175px;line-height:1.25;font-family:sans-serif;-inkscape-font-specification:'sans-serif, Normal';font-variant-ligatures:normal;font-variant-caps:normal;font-variant-numeric:normal;font-variant-east-asian:normal;letter-spacing:0px;word-spacing:0px;white-space:pre;fill:#4c566a;fill-opacity:1;stroke:none;shape-inside:url(#rect5238);"
       transform="translate(-0.21918074,2.3994037)"><tspan
         x="2.2363281"
         y="27.055225"><tspan
           style="shape-inside:url(#rect5238)">Comment allez-vous </tspan></tspan><tspan
         x="2.2363281"
         y="31.023975"><tspan
           style="shape-inside:url(#rect5238)">déterminer s'il s'agit d'un </tspan></tspan><tspan
         x="2.2363281"
         y="34.992725"><tspan
           style="shape-inside:url(#rect5238)">problème qui mérite d'être </tspan></tspan><tspan
         x="2.2363281"
         y="38.961475"><tspan
           style="shape-inside:url(#rect5238)">résolu ?</tspan></tspan></text>
    <text
       xml:space="preserve"
       id="text5242"
       style="font-style:normal;font-variant:normal;font-weight:normal;font-stretch:normal;font-size:3.175px;line-height:1.25;font-family:sans-serif;-inkscape-font-specification:'sans-serif, Normal';font-variant-ligatures:normal;font-variant-caps:normal;font-variant-numeric:normal;font-variant-east-asian:normal;letter-spacing:0px;word-spacing:0px;white-space:pre;shape-inside:url(#rect5244);fill:#d8dee9;fill-opacity:1;stroke:none;"
       transform="translate(-0.62152449,2.8245555)"><tspan
         x="2.6386719"
         y="44.50835"><tspan
           style="shape-inside:url(#rect5244)">Quel est votre critère de </tspan></tspan><tspan
         x="2.6386719"
         y="48.4771"><tspan
           style="shape-inside:url(#rect5244)">validation anticipée ?
</tspan></tspan><tspan
         x="2.6386719"
         y="52.44585"><tspan
           style="shape-inside:url(#rect5244)">Combien de clients cela </tspan></tspan><tspan
         x="2.6386719"
         y="56.4146"><tspan
           style="shape-inside:url(#rect5244)">représente-t-il ?
</tspan></tspan><tspan
         x="2.6386719"
         y="60.38335"><tspan
           style="shape-inside:url(#rect5244)">Quand ?</tspan></tspan></text>
    <text
       xml:space="preserve"
       id="text5236-1"
       style="font-style:normal;font-variant:normal;font-weight:normal;font-stretch:normal;font-size:3.175px;line-height:1.25;font-family:sans-serif;-inkscape-font-specification:'sans-serif, Normal';font-variant-ligatures:normal;font-variant-caps:normal;font-variant-numeric:normal;font-variant-east-asian:normal;letter-spacing:0px;word-spacing:0px;white-space:pre;shape-inside:url(#rect5238-5);fill:#4c566a;fill-opacity:1;stroke:none;"
       transform="translate(50.532156,2.3994037)"><tspan
         x="2.2363281"
         y="27.055225"><tspan
           style="shape-inside:url(#rect5238-5)">Comment allez-vous </tspan></tspan><tspan
         x="2.2363281"
         y="31.023975"><tspan
           style="shape-inside:url(#rect5238-5)">déterminer si vous avez </tspan></tspan><tspan
         x="2.2363281"
         y="34.992725"><tspan
           style="shape-inside:url(#rect5238-5)">construit quelque chose que </tspan></tspan><tspan
         x="2.2363281"
         y="38.961475"><tspan
           style="shape-inside:url(#rect5238-5)">suffisamment de personnes
</tspan></tspan><tspan
         x="2.2363281"
         y="42.930225"><tspan
           style="shape-inside:url(#rect5238-5)">veulent ?</tspan></tspan></text>
    <text
       xml:space="preserve"
       id="text5242-1"
       style="font-style:normal;font-variant:normal;font-weight:normal;font-stretch:normal;font-size:3.175px;line-height:1.25;font-family:sans-serif;-inkscape-font-specification:'sans-serif, Normal';font-variant-ligatures:normal;font-variant-caps:normal;font-variant-numeric:normal;font-variant-east-asian:normal;letter-spacing:0px;word-spacing:0px;white-space:pre;shape-inside:url(#rect5244-6);fill:#d8dee9;fill-opacity:1;stroke:none;"
       transform="translate(50.129812,6.0476637)"><tspan
         x="2.6386719"
         y="44.50835"><tspan
           style="shape-inside:url(#rect5244-6)">Quel est votre objectif en </tspan></tspan><tspan
         x="2.6386719"
         y="48.4771"><tspan
           style="shape-inside:url(#rect5244-6)">matière de revenus ?
</tspan></tspan><tspan
         x="2.6386719"
         y="52.44585"><tspan
           style="shape-inside:url(#rect5244-6)">Combien de clients cela </tspan></tspan><tspan
         x="2.6386719"
         y="56.4146"><tspan
           style="shape-inside:url(#rect5244-6)">représente-t-il ?
</tspan></tspan><tspan
         x="2.6386719"
         y="60.38335"><tspan
           style="shape-inside:url(#rect5244-6)">Quand ?</tspan></tspan></text>
    <text
       xml:space="preserve"
       id="text5236-1-8"
       style="font-style:normal;font-variant:normal;font-weight:normal;font-stretch:normal;font-size:3.175px;line-height:1.25;font-family:sans-serif;-inkscape-font-specification:'sans-serif, Normal';font-variant-ligatures:normal;font-variant-caps:normal;font-variant-numeric:normal;font-variant-east-asian:normal;letter-spacing:0px;word-spacing:0px;white-space:pre;fill:#4c566a;fill-opacity:1;stroke:none;shape-inside:url(#rect5238-5-5);"
       transform="translate(99.156806,2.3994037)"><tspan
         x="2.2363281"
         y="27.055225"><tspan
           style="shape-inside:url(#rect5238-5-5)">Comment votre modèle </tspan></tspan><tspan
         x="2.2363281"
         y="31.023975"><tspan
           style="shape-inside:url(#rect5238-5-5)">d'entreprise passera-t-il à </tspan></tspan><tspan
         x="2.2363281"
         y="34.992725"><tspan
           style="shape-inside:url(#rect5238-5-5)">l'échelle ?
</tspan></tspan></text>
    <text
       xml:space="preserve"
       id="text5242-1-4"
       style="font-style:normal;font-variant:normal;font-weight:normal;font-stretch:normal;font-size:3.175px;line-height:1.25;font-family:sans-serif;-inkscape-font-specification:'sans-serif, Normal';font-variant-ligatures:normal;font-variant-caps:normal;font-variant-numeric:normal;font-variant-east-asian:normal;letter-spacing:0px;word-spacing:0px;white-space:pre;shape-inside:url(#rect5244-6-9);fill:#d8dee9;fill-opacity:1;stroke:none;"
       transform="translate(98.754462,-1.7486484)"><tspan
         x="2.6386719"
         y="44.50835"><tspan
           style="shape-inside:url(#rect5244-6-9)">Quel est votre moteur de </tspan></tspan><tspan
         x="2.6386719"
         y="48.4771"><tspan
           style="shape-inside:url(#rect5244-6-9)">croissance ?
</tspan></tspan><tspan
         x="2.6386719"
         y="52.44585"><tspan
           style="shape-inside:url(#rect5244-6-9)">Quel est votre objectif en </tspan></tspan><tspan
         x="2.6386719"
         y="56.4146"><tspan
           style="shape-inside:url(#rect5244-6-9)">matière de recettes ?
</tspan></tspan><tspan
         x="2.6386719"
         y="60.38335"><tspan
           style="shape-inside:url(#rect5244-6-9)">Combien de clients cela </tspan></tspan><tspan
         x="2.6386719"
         y="64.3521"><tspan
           style="shape-inside:url(#rect5244-6-9)">représente-t-il ?
</tspan></tspan><tspan
         x="2.6386719"
         y="68.32085"><tspan
           style="shape-inside:url(#rect5244-6-9)">Quand ?</tspan></tspan></text>
    <path
       d="m 178.71606,56.663171 c 0,0.239027 -0.19393,0.432955 -0.43296,0.432955 -0.14431,0 -0.27961,-0.07216 -0.36079,-0.193928 l -1.02376,-1.537891 h -0.20294 v 0.595313 l 1.11395,1.853587 c 0.0271,0.0451 0.0406,0.09471 0.0406,0.148828 0,0.157848 -0.13079,0.288636 -0.28864,0.288636 h -0.8659 v 1.226704 c 0,0.279618 -0.2255,0.505114 -0.50512,0.505114 h -0.72159 c -0.27511,0 -0.50512,-0.225496 -0.50512,-0.505114 v -1.226704 h -0.8659 c -0.15785,0 -0.28864,-0.130788 -0.28864,-0.288636 0,-0.05412 0.0136,-0.103729 0.0406,-0.148828 l 1.11395,-1.853587 v -0.595313 h -0.20294 l -1.02376,1.537891 c -0.0812,0.121768 -0.21648,0.193928 -0.36079,0.193928 -0.23903,0 -0.43296,-0.193928 -0.43296,-0.432955 0,-0.08569 0.0271,-0.171378 0.0722,-0.239028 l 1.15455,-1.731818 c 0.18039,-0.266086 0.46001,-0.482563 0.79374,-0.482563 h 1.73183 c 0.33373,0 0.61335,0.216477 0.79374,0.482563 l 1.15455,1.731818 c 0.0451,0.06765 0.0722,0.153339 0.0722,0.239028 z m -1.87614,-3.607955 c 0,0.559233 -0.45099,1.010227 -1.01022,1.010227 -0.55924,0 -1.01023,-0.450994 -1.01023,-1.010227 0,-0.559233 0.45099,-1.010227 1.01023,-1.010227 0.55923,0 1.01022,0.450994 1.01022,1.010227 z"
       id="path5504-35"
       style="fill:#eceff4;stroke-width:0.00450993" />
    <path
       d="m 183.7036,55.075671 v 1.876136 c 0,0.239027 -0.19393,0.432954 -0.43296,0.432954 -0.23903,0 -0.43295,-0.193927 -0.43295,-0.432954 v -1.5875 h -0.28864 v 4.113068 c 0,0.279617 -0.2255,0.505114 -0.50511,0.505114 -0.27962,0 -0.50511,-0.225497 -0.50511,-0.505114 v -2.092614 h -0.28865 v 2.092614 c 0,0.279617 -0.22549,0.505114 -0.50511,0.505114 -0.27961,0 -0.50511,-0.225497 -0.50511,-0.505114 v -4.113068 h -0.28864 v 1.5875 c 0,0.239027 -0.19392,0.432954 -0.43295,0.432954 -0.23903,0 -0.43296,-0.193927 -0.43296,-0.432954 v -1.876136 c 0,-0.478054 0.38786,-0.865909 0.86591,-0.865909 h 2.88637 c 0.47805,0 0.86591,0.387855 0.86591,0.865909 z m -1.29887,-2.020455 c 0,0.559233 -0.45099,1.010227 -1.01022,1.010227 -0.55924,0 -1.01023,-0.450994 -1.01023,-1.010227 0,-0.559233 0.45099,-1.010227 1.01023,-1.010227 0.55923,0 1.01022,0.450994 1.01022,1.010227 z"
       id="path922-62"
       style="fill:#eceff4;stroke-width:0.00450994" />
    <path
       d="m 189.84557,56.663171 c 0,0.239027 -0.19392,0.432955 -0.43296,0.432955 -0.14431,0 -0.27961,-0.07216 -0.36079,-0.193928 l -1.02376,-1.537891 h -0.20294 v 0.595313 l 1.11395,1.853587 c 0.0271,0.0451 0.0406,0.09471 0.0406,0.148828 0,0.157848 -0.13079,0.288636 -0.28864,0.288636 h -0.8659 v 1.226704 c 0,0.279618 -0.2255,0.505114 -0.50512,0.505114 h -0.72159 c -0.27511,0 -0.50512,-0.225496 -0.50512,-0.505114 v -1.226704 h -0.8659 c -0.15785,0 -0.28864,-0.130788 -0.28864,-0.288636 0,-0.05412 0.0136,-0.103729 0.0406,-0.148828 l 1.11395,-1.853587 v -0.595313 h -0.20294 l -1.02376,1.537891 c -0.0812,0.121768 -0.21648,0.193928 -0.36079,0.193928 -0.23903,0 -0.43296,-0.193928 -0.43296,-0.432955 0,-0.08569 0.0271,-0.171378 0.0722,-0.239028 l 1.15455,-1.731818 c 0.18039,-0.266086 0.46001,-0.482563 0.79374,-0.482563 h 1.73183 c 0.33373,0 0.61335,0.216477 0.79374,0.482563 l 1.15455,1.731818 c 0.0451,0.06765 0.0722,0.153339 0.0722,0.239028 z m -1.87614,-3.607955 c 0,0.559233 -0.45099,1.010227 -1.01022,1.010227 -0.55924,0 -1.01023,-0.450994 -1.01023,-1.010227 0,-0.559233 0.45099,-1.010227 1.01023,-1.010227 0.55923,0 1.01022,0.450994 1.01022,1.010227 z"
       id="path5504-3-9"
       style="fill:#eceff4;stroke-width:0.00450993" />
    <path
       d="m 194.83312,55.075671 v 1.876136 c 0,0.239027 -0.19393,0.432954 -0.43296,0.432954 -0.23903,0 -0.43295,-0.193927 -0.43295,-0.432954 v -1.5875 h -0.28864 v 4.113068 c 0,0.279617 -0.2255,0.505114 -0.50511,0.505114 -0.27962,0 -0.50511,-0.225497 -0.50511,-0.505114 v -2.092614 h -0.28864 v 2.092614 c 0,0.279617 -0.2255,0.505114 -0.50512,0.505114 -0.27961,0 -0.50511,-0.225497 -0.50511,-0.505114 v -4.113068 h -0.28864 v 1.5875 c 0,0.239027 -0.19392,0.432954 -0.43295,0.432954 -0.23903,0 -0.43296,-0.193927 -0.43296,-0.432954 v -1.876136 c 0,-0.478054 0.38786,-0.865909 0.86591,-0.865909 h 2.88637 c 0.47805,0 0.86591,0.387855 0.86591,0.865909 z m -1.29887,-2.020455 c 0,0.559233 -0.45099,1.010227 -1.01022,1.010227 -0.55924,0 -1.01023,-0.450994 -1.01023,-1.010227 0,-0.559233 0.45099,-1.010227 1.01023,-1.010227 0.55923,0 1.01022,0.450994 1.01022,1.010227 z"
       id="path922-6-1"
       style="fill:#eceff4;stroke-width:0.00450994" />
    <path
       d="m 200.9751,56.663171 c 0,0.239027 -0.19393,0.432955 -0.43296,0.432955 -0.14431,0 -0.27961,-0.07216 -0.36078,-0.193928 l -1.02377,-1.537891 h -0.20294 v 0.595313 l 1.11395,1.853587 c 0.0271,0.0451 0.0406,0.09471 0.0406,0.148828 0,0.157848 -0.13079,0.288636 -0.28864,0.288636 h -0.8659 v 1.226704 c 0,0.279618 -0.2255,0.505114 -0.50512,0.505114 h -0.72159 c -0.27511,0 -0.50511,-0.225496 -0.50511,-0.505114 v -1.226704 h -0.86591 c -0.15785,0 -0.28864,-0.130788 -0.28864,-0.288636 0,-0.05412 0.0136,-0.103729 0.0406,-0.148828 l 1.11395,-1.853587 v -0.595313 h -0.20294 l -1.02376,1.537891 c -0.0812,0.121768 -0.21648,0.193928 -0.36079,0.193928 -0.23903,0 -0.43296,-0.193928 -0.43296,-0.432955 0,-0.08569 0.0271,-0.171378 0.0722,-0.239028 l 1.15455,-1.731818 c 0.18039,-0.266086 0.46001,-0.482563 0.79374,-0.482563 h 1.73183 c 0.33373,0 0.61335,0.216477 0.79374,0.482563 l 1.15456,1.731818 c 0.0451,0.06765 0.0722,0.153339 0.0722,0.239028 z m -1.87614,-3.607955 c 0,0.559233 -0.45099,1.010227 -1.01022,1.010227 -0.55924,0 -1.01023,-0.450994 -1.01023,-1.010227 0,-0.559233 0.45099,-1.010227 1.01023,-1.010227 0.55923,0 1.01022,0.450994 1.01022,1.010227 z"
       id="path5504-7-2"
       style="fill:#eceff4;stroke-width:0.00450993" />
    <path
       d="m 205.96266,55.075671 v 1.876136 c 0,0.239027 -0.19393,0.432954 -0.43296,0.432954 -0.23902,0 -0.43295,-0.193927 -0.43295,-0.432954 v -1.5875 h -0.28863 v 4.113068 c 0,0.279617 -0.2255,0.505114 -0.50512,0.505114 -0.27961,0 -0.50511,-0.225497 -0.50511,-0.505114 v -2.092614 h -0.28865 v 2.092614 c 0,0.279617 -0.22549,0.505114 -0.50511,0.505114 -0.27961,0 -0.50511,-0.225497 -0.50511,-0.505114 v -4.113068 h -0.28864 v 1.5875 c 0,0.239027 -0.19392,0.432954 -0.43295,0.432954 -0.23903,0 -0.43296,-0.193927 -0.43296,-0.432954 v -1.876136 c 0,-0.478054 0.38786,-0.865909 0.86591,-0.865909 h 2.88637 c 0.47805,0 0.86591,0.387855 0.86591,0.865909 z m -1.29886,-2.020455 c 0,0.559233 -0.451,1.010227 -1.01023,1.010227 -0.55924,0 -1.01023,-0.450994 -1.01023,-1.010227 0,-0.559233 0.45099,-1.010227 1.01023,-1.010227 0.55923,0 1.01023,0.450994 1.01023,1.010227 z"
       id="path922-5-7"
       style="fill:#eceff4;stroke-width:0.00450994" />
    <path
       d="m 226.30342,45.552023 c 0.51676,0 0.94494,0.428177 0.94494,0.944943 v 13.15534 l 7.91387,-6.334054 c 0.16242,-0.132881 0.38389,-0.206705 0.59059,-0.206705 0.51676,0 0.94494,0.428178 0.94494,0.94494 v 5.595819 l 7.91388,-6.334054 c 0.16241,-0.132881 0.38388,-0.206705 0.59058,-0.206705 0.51677,0 0.94495,0.428178 0.94495,0.94494 v 17.008932 c 0,0.516761 -0.42818,0.944937 -0.94495,0.944937 h -24.56844 c -0.51677,0 -0.94495,-0.428176 -0.94495,-0.944937 V 46.496966 c 0,-0.516766 0.42818,-0.944943 0.94495,-0.944943 z"
       id="path1083"
       style="fill:#eceff4;stroke-width:0.0147647" />
    <path
       d="m 178.59607,66.549944 c 0,0.239027 -0.19393,0.432955 -0.43296,0.432955 -0.14431,0 -0.27961,-0.07216 -0.36079,-0.193928 l -1.02376,-1.537891 h -0.20294 v 0.595313 l 1.11395,1.853587 c 0.0271,0.0451 0.0406,0.09471 0.0406,0.148828 0,0.157848 -0.13079,0.288636 -0.28864,0.288636 h -0.8659 v 1.226704 c 0,0.279618 -0.2255,0.505114 -0.50512,0.505114 h -0.72159 c -0.27511,0 -0.50512,-0.225496 -0.50512,-0.505114 v -1.226704 h -0.8659 c -0.15785,0 -0.28864,-0.130788 -0.28864,-0.288636 0,-0.05412 0.0136,-0.103729 0.0406,-0.148828 l 1.11395,-1.853587 V 65.25108 h -0.20294 l -1.02376,1.537891 c -0.0812,0.121768 -0.21648,0.193928 -0.36079,0.193928 -0.23903,0 -0.43296,-0.193928 -0.43296,-0.432955 0,-0.08569 0.0271,-0.171378 0.0722,-0.239028 l 1.15455,-1.731818 c 0.18039,-0.266086 0.46001,-0.482563 0.79374,-0.482563 h 1.73183 c 0.33373,0 0.61335,0.216477 0.79374,0.482563 l 1.15455,1.731818 c 0.0451,0.06765 0.0722,0.153339 0.0722,0.239028 z m -1.87614,-3.607955 c 0,0.559233 -0.45099,1.010227 -1.01022,1.010227 -0.55924,0 -1.01023,-0.450994 -1.01023,-1.010227 0,-0.559233 0.45099,-1.010227 1.01023,-1.010227 0.55923,0 1.01022,0.450994 1.01022,1.010227 z"
       id="path5504-35-0"
       style="fill:#eceff4;stroke-width:0.00450993" />
    <path
       d="m 183.58362,64.962444 v 1.876136 c 0,0.239027 -0.19393,0.432954 -0.43296,0.432954 -0.23903,0 -0.43295,-0.193927 -0.43295,-0.432954 v -1.5875 h -0.28864 v 4.113068 c 0,0.279617 -0.2255,0.505114 -0.50511,0.505114 -0.27962,0 -0.50511,-0.225497 -0.50511,-0.505114 v -2.092614 h -0.28865 v 2.092614 c 0,0.279617 -0.22549,0.505114 -0.50511,0.505114 -0.27961,0 -0.50511,-0.225497 -0.50511,-0.505114 V 65.25108 h -0.28864 v 1.5875 c 0,0.239027 -0.19392,0.432954 -0.43295,0.432954 -0.23903,0 -0.43296,-0.193927 -0.43296,-0.432954 v -1.876136 c 0,-0.478054 0.38786,-0.865909 0.86591,-0.865909 h 2.88637 c 0.47805,0 0.86591,0.387855 0.86591,0.865909 z m -1.29887,-2.020455 c 0,0.559233 -0.45099,1.010227 -1.01022,1.010227 -0.55924,0 -1.01023,-0.450994 -1.01023,-1.010227 0,-0.559233 0.45099,-1.010227 1.01023,-1.010227 0.55923,0 1.01022,0.450994 1.01022,1.010227 z"
       id="path922-62-9"
       style="fill:#eceff4;stroke-width:0.00450993" />
    <path
       d="m 189.72559,66.549944 c 0,0.239027 -0.19392,0.432955 -0.43296,0.432955 -0.14431,0 -0.27961,-0.07216 -0.36079,-0.193928 l -1.02376,-1.537891 h -0.20294 v 0.595313 l 1.11395,1.853587 c 0.0271,0.0451 0.0406,0.09471 0.0406,0.148828 0,0.157848 -0.13079,0.288636 -0.28864,0.288636 h -0.8659 v 1.226704 c 0,0.279618 -0.2255,0.505114 -0.50512,0.505114 h -0.72159 c -0.27511,0 -0.50512,-0.225496 -0.50512,-0.505114 v -1.226704 h -0.8659 c -0.15785,0 -0.28864,-0.130788 -0.28864,-0.288636 0,-0.05412 0.0136,-0.103729 0.0406,-0.148828 l 1.11395,-1.853587 V 65.25108 h -0.20294 l -1.02376,1.537891 c -0.0812,0.121768 -0.21648,0.193928 -0.36079,0.193928 -0.23903,0 -0.43296,-0.193928 -0.43296,-0.432955 0,-0.08569 0.0271,-0.171378 0.0722,-0.239028 l 1.15455,-1.731818 c 0.18039,-0.266086 0.46001,-0.482563 0.79374,-0.482563 h 1.73183 c 0.33373,0 0.61335,0.216477 0.79374,0.482563 l 1.15455,1.731818 c 0.0451,0.06765 0.0722,0.153339 0.0722,0.239028 z m -1.87614,-3.607955 c 0,0.559233 -0.45099,1.010227 -1.01022,1.010227 -0.55924,0 -1.01023,-0.450994 -1.01023,-1.010227 0,-0.559233 0.45099,-1.010227 1.01023,-1.010227 0.55923,0 1.01022,0.450994 1.01022,1.010227 z"
       id="path5504-3-9-3"
       style="fill:#eceff4;stroke-width:0.00450993" />
    <path
       d="m 194.71314,64.962444 v 1.876136 c 0,0.239027 -0.19393,0.432954 -0.43296,0.432954 -0.23903,0 -0.43295,-0.193927 -0.43295,-0.432954 v -1.5875 h -0.28864 v 4.113068 c 0,0.279617 -0.2255,0.505114 -0.50511,0.505114 -0.27962,0 -0.50511,-0.225497 -0.50511,-0.505114 v -2.092614 h -0.28864 v 2.092614 c 0,0.279617 -0.2255,0.505114 -0.50512,0.505114 -0.27961,0 -0.50511,-0.225497 -0.50511,-0.505114 V 65.25108 h -0.28864 v 1.5875 c 0,0.239027 -0.19392,0.432954 -0.43295,0.432954 -0.23903,0 -0.43296,-0.193927 -0.43296,-0.432954 v -1.876136 c 0,-0.478054 0.38786,-0.865909 0.86591,-0.865909 h 2.88637 c 0.47805,0 0.86591,0.387855 0.86591,0.865909 z m -1.29887,-2.020455 c 0,0.559233 -0.45099,1.010227 -1.01022,1.010227 -0.55924,0 -1.01023,-0.450994 -1.01023,-1.010227 0,-0.559233 0.45099,-1.010227 1.01023,-1.010227 0.55923,0 1.01022,0.450994 1.01022,1.010227 z"
       id="path922-6-1-6"
       style="fill:#eceff4;stroke-width:0.00450993" />
    <path
       d="m 200.85512,66.549944 c 0,0.239027 -0.19392,0.432955 -0.43295,0.432955 -0.14432,0 -0.27962,-0.07216 -0.36078,-0.193928 l -1.02378,-1.537891 h -0.20294 v 0.595313 l 1.11396,1.853587 c 0.0271,0.0451 0.0406,0.09471 0.0406,0.148828 0,0.157848 -0.1308,0.288636 -0.28865,0.288636 h -0.8659 v 1.226704 c 0,0.279618 -0.2255,0.505114 -0.50512,0.505114 h -0.72159 c -0.27511,0 -0.50511,-0.225496 -0.50511,-0.505114 v -1.226704 h -0.86591 c -0.15785,0 -0.28864,-0.130788 -0.28864,-0.288636 0,-0.05412 0.0136,-0.103729 0.0406,-0.148828 l 1.11395,-1.853587 V 65.25108 h -0.20294 l -1.02376,1.537891 c -0.0812,0.121768 -0.21648,0.193928 -0.36079,0.193928 -0.23903,0 -0.43296,-0.193928 -0.43296,-0.432955 0,-0.08569 0.0271,-0.171378 0.0722,-0.239028 l 1.15455,-1.731818 c 0.18039,-0.266086 0.46001,-0.482563 0.79374,-0.482563 h 1.73183 c 0.33373,0 0.61335,0.216477 0.79374,0.482563 l 1.15456,1.731818 c 0.0451,0.06765 0.0722,0.153339 0.0722,0.239028 z m -1.87614,-3.607955 c 0,0.559233 -0.45099,1.010227 -1.01022,1.010227 -0.55924,0 -1.01023,-0.450994 -1.01023,-1.010227 0,-0.559233 0.45099,-1.010227 1.01023,-1.010227 0.55923,0 1.01022,0.450994 1.01022,1.010227 z"
       id="path5504-7-2-0"
       style="fill:#eceff4;stroke-width:0.00450993" />
    <path
       d="m 205.84268,64.962444 v 1.876136 c 0,0.239027 -0.19392,0.432954 -0.43295,0.432954 -0.23903,0 -0.43296,-0.193927 -0.43296,-0.432954 v -1.5875 h -0.28862 v 4.113068 c 0,0.279617 -0.22551,0.505114 -0.50513,0.505114 -0.2796,0 -0.50511,-0.225497 -0.50511,-0.505114 v -2.092614 h -0.28865 v 2.092614 c 0,0.279617 -0.22548,0.505114 -0.5051,0.505114 -0.27962,0 -0.50511,-0.225497 -0.50511,-0.505114 V 65.25108 h -0.28864 v 1.5875 c 0,0.239027 -0.19393,0.432954 -0.43295,0.432954 -0.23903,0 -0.43297,-0.193927 -0.43297,-0.432954 v -1.876136 c 0,-0.478054 0.38786,-0.865909 0.86592,-0.865909 h 2.88636 c 0.47805,0 0.86591,0.387855 0.86591,0.865909 z m -1.29886,-2.020455 c 0,0.559233 -0.45099,1.010227 -1.01023,1.010227 -0.55923,0 -1.01023,-0.450994 -1.01023,-1.010227 0,-0.559233 0.451,-1.010227 1.01023,-1.010227 0.55924,0 1.01023,0.450994 1.01023,1.010227 z"
       id="path922-5-7-6"
       style="fill:#eceff4;stroke-width:0.00450993" />
    <path
       d="m 264.86902,77.221305 c 0,0.239027 -0.19393,0.432955 -0.43296,0.432955 -0.14431,0 -0.27961,-0.07216 -0.36078,-0.193928 l -1.02377,-1.537891 h -0.20294 v 0.595313 l 1.11395,1.853587 c 0.0271,0.0451 0.0406,0.09471 0.0406,0.148829 0,0.157848 -0.13079,0.288635 -0.28864,0.288635 h -0.8659 v 1.226704 c 0,0.279618 -0.2255,0.505114 -0.50512,0.505114 h -0.72159 c -0.27511,0 -0.50511,-0.225496 -0.50511,-0.505114 v -1.226704 h -0.86591 c -0.15785,0 -0.28864,-0.130787 -0.28864,-0.288635 0,-0.05412 0.0136,-0.10373 0.0406,-0.148829 l 1.11395,-1.853587 v -0.595313 h -0.20294 l -1.02376,1.537891 c -0.0812,0.121768 -0.21648,0.193928 -0.36079,0.193928 -0.23903,0 -0.43296,-0.193928 -0.43296,-0.432955 0,-0.08569 0.0271,-0.171378 0.0722,-0.239028 l 1.15455,-1.731818 c 0.18039,-0.266086 0.46001,-0.482563 0.79374,-0.482563 h 1.73183 c 0.33373,0 0.61335,0.216477 0.79374,0.482563 l 1.15456,1.731818 c 0.0451,0.06765 0.0722,0.153339 0.0722,0.239028 z m -1.87614,-3.607955 c 0,0.559233 -0.45099,1.010227 -1.01022,1.010227 -0.55924,0 -1.01023,-0.450994 -1.01023,-1.010227 0,-0.559233 0.45099,-1.010227 1.01023,-1.010227 0.55923,0 1.01022,0.450994 1.01022,1.010227 z"
       id="path5504-7-2-8"
       style="fill:#eceff4;stroke-width:0.00450993" />
    <path
       d="m 271.83955,75.633805 v 1.876136 c 0,0.239027 -0.19393,0.432954 -0.43296,0.432954 -0.23902,0 -0.43295,-0.193927 -0.43295,-0.432954 v -1.5875 h -0.28863 v 4.113068 c 0,0.279617 -0.2255,0.505114 -0.50512,0.505114 -0.27961,0 -0.50511,-0.225497 -0.50511,-0.505114 v -2.092614 h -0.28865 v 2.092614 c 0,0.279617 -0.22549,0.505114 -0.50511,0.505114 -0.27961,0 -0.50511,-0.225497 -0.50511,-0.505114 v -4.113068 h -0.28864 v 1.5875 c 0,0.239027 -0.19392,0.432954 -0.43295,0.432954 -0.23903,0 -0.43296,-0.193927 -0.43296,-0.432954 v -1.876136 c 0,-0.478054 0.38786,-0.865909 0.86591,-0.865909 h 2.88637 c 0.47805,0 0.86591,0.387855 0.86591,0.865909 z m -1.29886,-2.020455 c 0,0.559233 -0.451,1.010227 -1.01023,1.010227 -0.55924,0 -1.01023,-0.450994 -1.01023,-1.010227 0,-0.559233 0.45099,-1.010227 1.01023,-1.010227 0.55923,0 1.01023,0.450994 1.01023,1.010227 z"
       id="path922-5-7-7"
       style="fill:#eceff4;stroke-width:0.00450993" />
    <text
       xml:space="preserve"
       style="font-style:normal;font-variant:normal;font-weight:normal;font-stretch:normal;font-size:7.05556px;line-height:1.25;font-family:sans-serif;-inkscape-font-specification:'sans-serif, Normal';font-variant-ligatures:normal;font-variant-caps:normal;font-variant-numeric:normal;font-variant-east-asian:normal;letter-spacing:0px;word-spacing:0px;fill:#eceff4;fill-opacity:1;stroke:none;stroke-width:0.264583;"
       x="257.32648"
       y="42.318958"
       id="text1152"><tspan
         sodipodi:role="line"
         id="tspan1150"
         x="257.32648"
         y="42.318958"
         style="font-style:normal;font-variant:normal;font-weight:normal;font-stretch:normal;font-size:7.05556px;font-family:sans-serif;-inkscape-font-specification:'sans-serif, Normal';font-variant-ligatures:normal;font-variant-caps:normal;font-variant-numeric:normal;font-variant-east-asian:normal;fill:#eceff4;stroke-width:0.264583;">Sale</tspan></text>
    <path
       d="m 267.21959,70.285606 c 0,0.783585 -0.8722,1.417651 -1.94928,1.417651 -0.1689,0 -0.33226,-0.01661 -0.48731,-0.0443 -0.22982,0.163362 -0.49009,0.282423 -0.76975,0.354413 -0.0748,0.01938 -0.15505,0.03323 -0.23812,0.0443 h -0.008 c -0.0415,0 -0.0803,-0.03323 -0.0886,-0.0803 -0.0111,-0.05261 0.0249,-0.08584 0.0554,-0.121829 0.10799,-0.12183 0.22981,-0.229815 0.32395,-0.459629 -0.44855,-0.260273 -0.73651,-0.661756 -0.73651,-1.11031 0,-0.783585 0.87219,-1.417651 1.94927,-1.417651 1.07709,0 1.94927,0.634066 1.94927,1.417651 z m 1.06323,0.708826 c 0,0.451323 -0.28796,0.850037 -0.73651,1.110309 0.0941,0.229815 0.21597,0.3378 0.32395,0.459629 0.0305,0.036 0.0665,0.06922 0.0554,0.12183 -0.0111,0.04984 -0.0526,0.08583 -0.0969,0.0803 -0.0831,-0.01107 -0.16337,-0.02492 -0.23813,-0.0443 -0.27965,-0.07199 -0.53992,-0.191051 -0.76973,-0.354413 -0.15506,0.02769 -0.31842,0.0443 -0.48732,0.0443 -0.50117,0 -0.9608,-0.138443 -1.3069,-0.365488 0.0803,0.0055 0.16336,0.01107 0.24366,0.01107 0.5953,0 1.15738,-0.171669 1.58655,-0.48178 0.4624,-0.3378 0.71713,-0.79466 0.71713,-1.290284 0,-0.143981 -0.0222,-0.285192 -0.0637,-0.420866 0.46794,0.257504 0.77251,0.667293 0.77251,1.129691 z"
       id="path2023"
       style="fill:#eceff4;stroke-width:0.00276884" />
    <path
       d="m 216.58161,60.946232 c 0,0.173222 -0.0663,0.341346 -0.1885,0.463617 l -3.31663,3.316633 c -0.12222,0.117182 -0.2904,0.188503 -0.46361,0.188503 -0.17323,0 -0.33626,-0.07132 -0.45852,-0.188503 l -0.3821,-0.382103 c -0.12223,-0.122275 -0.1936,-0.290394 -0.1936,-0.463612 0,-0.17322 0.0713,-0.341345 0.1936,-0.463616 l 1.49273,-1.49274 h -3.58665 c -0.36681,0 -0.59607,-0.305681 -0.59607,-0.652119 v -0.652118 c 0,-0.346438 0.22926,-0.652116 0.59607,-0.652116 h 3.58665 l -1.49273,-1.497837 c -0.12223,-0.117169 -0.1936,-0.285299 -0.1936,-0.458519 0,-0.173218 0.0713,-0.341343 0.1936,-0.45852 l 0.3821,-0.382102 c 0.12222,-0.122275 0.28529,-0.193595 0.45852,-0.193595 0.17321,0 0.34133,0.07132 0.46361,0.193595 l 3.31663,3.316634 c 0.12222,0.117182 0.1885,0.285301 0.1885,0.458518 z"
       id="path2120"
       style="fill:#eceff4;stroke-width:0.00509466" />
    <path
       d="m 256.59728,50.86196 c 0.0854,0.150705 0.1106,0.329663 0.0646,0.496288 l -1.25035,4.520698 c -0.0486,0.162208 -0.15972,0.307174 -0.31042,0.39257 -0.15071,0.08541 -0.32771,0.103734 -0.49185,0.06206 l -0.52082,-0.144054 c -0.16663,-0.04612 -0.31161,-0.157198 -0.39701,-0.3079 -0.0854,-0.150705 -0.10626,-0.332129 -0.0601,-0.498804 l 0.56275,-2.034657 -3.12044,1.768294 c -0.31914,0.180845 -0.6693,0.02793 -0.8401,-0.273479 l -0.32151,-0.567354 c -0.1708,-0.301407 -0.12205,-0.680383 0.19708,-0.861228 l 3.12045,-1.768294 -2.03717,-0.567197 c -0.16411,-0.04168 -0.30909,-0.152766 -0.39449,-0.30347 -0.0854,-0.150703 -0.10626,-0.332127 -0.0576,-0.49437 l 0.14405,-0.520818 c 0.0461,-0.166639 0.15276,-0.309085 0.30348,-0.394492 0.15069,-0.0854 0.33212,-0.106233 0.49879,-0.06014 l 4.5207,1.25036 c 0.16411,0.04169 0.30466,0.155282 0.39006,0.305985 z"
       id="path2120-4"
       style="fill:#eceff4;stroke-width:0.00509466" />
    <path
       d="m 256.50658,73.822392 c -0.093,0.146126 -0.23923,0.252347 -0.40798,0.28987 l -4.57889,1.016775 c -0.16603,0.03322 -0.3462,0.0031 -0.49232,-0.08995 -0.14613,-0.09303 -0.24536,-0.240738 -0.28557,-0.405246 l -0.11713,-0.527524 c -0.0375,-0.168787 -0.007,-0.348935 0.0856,-0.495057 0.093,-0.146125 0.24346,-0.249662 0.41229,-0.287131 l 2.06084,-0.457632 -3.02561,-1.926062 c -0.30943,-0.19698 -0.33868,-0.57796 -0.15264,-0.870207 l 0.35019,-0.550112 c 0.18604,-0.292247 0.54359,-0.426995 0.85303,-0.230015 l 3.02561,1.926063 -0.45488,-2.06515 c -0.0402,-0.164479 -0.0101,-0.344636 0.0829,-0.490761 0.093,-0.146122 0.24345,-0.24966 0.40955,-0.282831 l 0.52752,-0.117142 c 0.16877,-0.03751 0.34463,-0.01011 0.49076,0.08292 0.14612,0.09302 0.24964,0.243461 0.28713,0.412275 l 1.01677,4.578894 c 0.0402,0.164486 0.006,0.341899 -0.0872,0.488022 z"
       id="path2120-44"
       style="fill:#eceff4;stroke-width:0.00509466" />
    <text
       xml:space="preserve"
       id="text5236-1-8-6"
       style="font-style:normal;font-variant:normal;font-weight:normal;font-stretch:normal;font-size:3.175px;line-height:1.25;font-family:sans-serif;-inkscape-font-specification:'sans-serif, Normal';font-variant-ligatures:normal;font-variant-caps:normal;font-variant-numeric:normal;font-variant-east-asian:normal;letter-spacing:0px;word-spacing:0px;white-space:pre;fill:#4c566a;fill-opacity:1;stroke:none;shape-inside:url(#rect5238-5-5-4);"
       transform="translate(151.9973,-4.0648928)"><tspan
         x="2.2363281"
         y="27.055225"><tspan
           style="shape-inside:url(#rect5238-5-5-4)">Quel est le rendement de votre système </tspan></tspan><tspan
         x="2.2363281"
         y="31.023975"><tspan
           style="shape-inside:url(#rect5238-5-5-4)">d'acquisition clients ?</tspan></tspan></text>
    <text
       xml:space="preserve"
       id="text5242-1-4-3"
       style="font-style:normal;font-variant:normal;font-weight:normal;font-stretch:normal;font-size:3.175px;line-height:1.25;font-family:sans-serif;-inkscape-font-specification:'sans-serif, Normal';font-variant-ligatures:normal;font-variant-caps:normal;font-variant-numeric:normal;font-variant-east-asian:normal;letter-spacing:0px;word-spacing:0px;white-space:pre;shape-inside:url(#rect5244-6-9-7);fill:#d8dee9;fill-opacity:1;stroke:none;"
       transform="translate(151.59496,-10.32961)"><tspan
         x="2.6386719"
         y="44.50835"><tspan
           style="shape-inside:url(#rect5244-6-9-7);fill:#d8dee9">Identifiez votre étape actuelle.
</tspan></tspan><tspan
         x="2.6386719"
         y="48.4771"><tspan
           style="shape-inside:url(#rect5244-6-9-7);fill:#d8dee9">Identifier les indicateurs du cycle de vie </tspan></tspan><tspan
         x="2.6386719"
         y="52.44585"><tspan
           style="shape-inside:url(#rect5244-6-9-7);fill:#d8dee9">du client (AARRR)..</tspan></tspan></text>
    <rect
       style="opacity:0.999;fill:#4c566a;stroke:#000000;stroke-width:0.728;stroke-miterlimit:4;stroke-dasharray:none;stroke-opacity:1"
       id="rect5113-5"
       width="295.34769"
       height="101.88998"
       x="0.7643249"
       y="96.701721" />
    <rect
       style="opacity:0.999;fill:#ffffff;fill-opacity:1;stroke:#000000;stroke-width:0.771209;stroke-miterlimit:4;stroke-dasharray:none;stroke-opacity:1"
       id="rect5184-6-6"
       width="98.239334"
       height="87.732002"
       x="0.7371406"
       y="113.19434" />
    <text
       xml:space="preserve"
       style="font-style:normal;font-weight:normal;font-size:10.5833px;line-height:1.25;font-family:sans-serif;letter-spacing:0px;word-spacing:0px;fill:#eceff4;fill-opacity:1;stroke:none;stroke-width:0.264583"
       x="115.91054"
       y="108.20063"
       id="text5138-5"><tspan
         sodipodi:role="line"
         id="tspan5136-3"
         x="115.91054"
         y="108.20063"
         style="fill:#eceff4;stroke-width:0.264583">Expériences</tspan></text>
    <text
       xml:space="preserve"
       style="font-style:normal;font-variant:normal;font-weight:normal;font-stretch:normal;font-size:4.23333px;line-height:1.25;font-family:sans-serif;-inkscape-font-specification:'sans-serif, Normal';font-variant-ligatures:normal;font-variant-caps:normal;font-variant-numeric:normal;font-variant-east-asian:normal;letter-spacing:0px;word-spacing:0px;fill:#000000;fill-opacity:1;stroke:none;stroke-width:0.264583"
       x="35.681973"
       y="118.318"
       id="text5146-6"><tspan
         sodipodi:role="line"
         id="tspan5144-0"
         x="35.681973"
         y="118.318"
         style="font-style:normal;font-variant:normal;font-weight:normal;font-stretch:normal;font-size:4.23333px;font-family:sans-serif;-inkscape-font-specification:'sans-serif, Normal';font-variant-ligatures:normal;font-variant-caps:normal;font-variant-numeric:normal;font-variant-east-asian:normal;stroke-width:0.264583">Objectifs clés</tspan></text>
    <text
       xml:space="preserve"
       id="text5236-2"
       style="font-style:normal;font-variant:normal;font-weight:normal;font-stretch:normal;font-size:3.175px;line-height:1.25;font-family:sans-serif;-inkscape-font-specification:'sans-serif, Normal';font-variant-ligatures:normal;font-variant-caps:normal;font-variant-numeric:normal;font-variant-east-asian:normal;letter-spacing:0px;word-spacing:0px;white-space:pre;shape-inside:url(#rect5238-3);fill:#4c566a;fill-opacity:1;stroke:none;"
       transform="translate(3.2836079,102.3439)"><tspan
         x="2.2363281"
         y="27.055225"><tspan
           style="shape-inside:url(#rect5238-3)">Déterminer la bonne action, au bon moment.</tspan></tspan></text>
    <rect
       style="opacity:0.999;fill:#ffffff;fill-opacity:1;stroke:#000000;stroke-width:0.771209;stroke-miterlimit:4;stroke-dasharray:none;stroke-opacity:1"
       id="rect5184-6-6-5"
       width="98.239334"
       height="87.732002"
       x="98.976471"
       y="113.19434" />
    <text
       xml:space="preserve"
       id="text5242-9"
       style="font-style:normal;font-variant:normal;font-weight:normal;font-stretch:normal;font-size:3.175px;line-height:1.25;font-family:sans-serif;-inkscape-font-specification:'sans-serif, Normal';font-variant-ligatures:normal;font-variant-caps:normal;font-variant-numeric:normal;font-variant-east-asian:normal;letter-spacing:0px;word-spacing:0px;white-space:pre;fill:#d8dee9;fill-opacity:1;stroke:none;shape-inside:url(#rect5244-61);"
       transform="translate(2.8812642,90.686298)"><tspan
         x="2.6386719"
         y="44.50835"><tspan
           style="shape-inside:url(#rect5244-61)">Quelles sont vos hypothèses les plus risquées ou vos </tspan></tspan><tspan
         x="2.6386719"
         y="48.4771"><tspan
           style="shape-inside:url(#rect5244-61)">convictions les plus fortes ?
</tspan></tspan><tspan
         x="2.6386719"
         y="52.44585"><tspan
           style="shape-inside:url(#rect5244-61)">Quel est votre prochain objectif important ?
</tspan></tspan><tspan
         x="2.6386719"
         y="56.4146"><tspan
           style="shape-inside:url(#rect5244-61)">Comment allez-vous y parvenir ?
</tspan></tspan><tspan
         x="2.6386719"
         y="60.38335"><tspan
           style="shape-inside:url(#rect5244-61)">D'ici à quand ?</tspan></tspan></text>
    <rect
       style="opacity:0.999;fill:#ffffff;fill-opacity:1;stroke:#000000;stroke-width:0.773423;stroke-miterlimit:4;stroke-dasharray:none;stroke-opacity:1"
       id="rect5184-6-6-5-7"
       width="98.806625"
       height="87.729767"
       x="197.2169"
       y="113.19546" />
    <text
       xml:space="preserve"
       style="font-style:normal;font-variant:normal;font-weight:normal;font-stretch:normal;font-size:4.23333px;line-height:1.25;font-family:sans-serif;-inkscape-font-specification:'sans-serif, Normal';font-variant-ligatures:normal;font-variant-caps:normal;font-variant-numeric:normal;font-variant-east-asian:normal;letter-spacing:0px;word-spacing:0px;fill:#000000;fill-opacity:1;stroke:none;stroke-width:0.264583"
       x="17.950771"
       y="171.80792"
       id="text5146-6-1"><tspan
         sodipodi:role="line"
         id="tspan5144-0-7"
         x="17.950771"
         y="171.80792"
         style="font-style:normal;font-variant:normal;font-weight:normal;font-stretch:normal;font-size:4.23333px;font-family:sans-serif;-inkscape-font-specification:'sans-serif, Normal';font-variant-ligatures:normal;font-variant-caps:normal;font-variant-numeric:normal;font-variant-east-asian:normal;stroke-width:0.264583">File d'attente des expériences</tspan></text>
    <rect
       style="opacity:0.999;fill:none;stroke:#000000;stroke-width:0.771209;stroke-miterlimit:4;stroke-dasharray:none;stroke-opacity:1"
       id="rect5184-6-6-8"
       width="98.525986"
       height="33.969261"
       x="0.45048749"
       y="166.95708" />
    <text
       xml:space="preserve"
       style="font-style:normal;font-variant:normal;font-weight:normal;font-stretch:normal;font-size:4.23333px;line-height:1.25;font-family:sans-serif;-inkscape-font-specification:'sans-serif, Normal';font-variant-ligatures:normal;font-variant-caps:normal;font-variant-numeric:normal;font-variant-east-asian:normal;letter-spacing:0px;word-spacing:0px;fill:#000000;fill-opacity:1;stroke:none;stroke-width:0.264583"
       x="126.87575"
       y="118.318"
       id="text5146-6-4"><tspan
         sodipodi:role="line"
         id="tspan5144-0-1"
         x="126.87575"
         y="118.318"
         style="font-style:normal;font-variant:normal;font-weight:normal;font-stretch:normal;font-size:4.23333px;font-family:sans-serif;-inkscape-font-specification:'sans-serif, Normal';font-variant-ligatures:normal;font-variant-caps:normal;font-variant-numeric:normal;font-variant-east-asian:normal;stroke-width:0.264583">Expériences actives</tspan></text>
    <text
       xml:space="preserve"
       style="font-style:normal;font-variant:normal;font-weight:normal;font-stretch:normal;font-size:4.23333px;line-height:1.25;font-family:sans-serif;-inkscape-font-specification:'sans-serif, Normal';font-variant-ligatures:normal;font-variant-caps:normal;font-variant-numeric:normal;font-variant-east-asian:normal;letter-spacing:0px;word-spacing:0px;fill:#000000;fill-opacity:1;stroke:none;stroke-width:0.264583"
       x="222.87181"
       y="118.318"
       id="text5146-6-4-8"><tspan
         sodipodi:role="line"
         id="tspan5144-0-1-5"
         x="222.87181"
         y="118.318"
         style="font-style:normal;font-variant:normal;font-weight:normal;font-stretch:normal;font-size:4.23333px;font-family:sans-serif;-inkscape-font-specification:'sans-serif, Normal';font-variant-ligatures:normal;font-variant-caps:normal;font-variant-numeric:normal;font-variant-east-asian:normal;stroke-width:0.264583">Expériences achevées</tspan></text>
    <text
       xml:space="preserve"
       style="font-style:normal;font-variant:normal;font-weight:normal;font-stretch:normal;font-size:4.23333px;line-height:1.25;font-family:sans-serif;-inkscape-font-specification:'sans-serif, Normal';font-variant-ligatures:normal;font-variant-caps:normal;font-variant-numeric:normal;font-variant-east-asian:normal;letter-spacing:0px;word-spacing:0px;fill:#000000;fill-opacity:1;stroke:none;stroke-width:0.264583"
       x="109.07727"
       y="128.25284"
       id="text5146-6-4-9"><tspan
         sodipodi:role="line"
         id="tspan5144-0-1-7"
         x="109.07727"
         y="128.25284"
         style="font-style:normal;font-variant:normal;font-weight:normal;font-stretch:normal;font-size:4.23333px;font-family:sans-serif;-inkscape-font-specification:'sans-serif, Normal';font-variant-ligatures:normal;font-variant-caps:normal;font-variant-numeric:normal;font-variant-east-asian:normal;stroke-width:0.264583">Build</tspan></text>
    <text
       xml:space="preserve"
       style="font-style:normal;font-variant:normal;font-weight:normal;font-stretch:normal;font-size:4.23333px;line-height:1.25;font-family:sans-serif;-inkscape-font-specification:'sans-serif, Normal';font-variant-ligatures:normal;font-variant-caps:normal;font-variant-numeric:normal;font-variant-east-asian:normal;letter-spacing:0px;word-spacing:0px;fill:#000000;fill-opacity:1;stroke:none;stroke-width:0.264583"
       x="139.53116"
       y="128.12262"
       id="text5146-6-4-9-5"><tspan
         sodipodi:role="line"
         id="tspan5144-0-1-7-3"
         x="139.53116"
         y="128.12262"
         style="font-style:normal;font-variant:normal;font-weight:normal;font-stretch:normal;font-size:4.23333px;font-family:sans-serif;-inkscape-font-specification:'sans-serif, Normal';font-variant-ligatures:normal;font-variant-caps:normal;font-variant-numeric:normal;font-variant-east-asian:normal;stroke-width:0.264583">Measure</tspan></text>
    <text
       xml:space="preserve"
       style="font-style:normal;font-variant:normal;font-weight:normal;font-stretch:normal;font-size:4.23333px;line-height:1.25;font-family:sans-serif;-inkscape-font-specification:'sans-serif, Normal';font-variant-ligatures:normal;font-variant-caps:normal;font-variant-numeric:normal;font-variant-east-asian:normal;letter-spacing:0px;word-spacing:0px;fill:#000000;fill-opacity:1;stroke:none;stroke-width:0.264583"
       x="175.67577"
       y="128.12262"
       id="text5146-6-4-9-5-8"><tspan
         sodipodi:role="line"
         id="tspan5144-0-1-7-3-8"
         x="175.67577"
         y="128.12262"
         style="font-style:normal;font-variant:normal;font-weight:normal;font-stretch:normal;font-size:4.23333px;font-family:sans-serif;-inkscape-font-specification:'sans-serif, Normal';font-variant-ligatures:normal;font-variant-caps:normal;font-variant-numeric:normal;font-variant-east-asian:normal;stroke-width:0.264583">Learn</tspan></text>
    <rect
       style="opacity:1;fill:#000000;fill-opacity:1;stroke:none;stroke-width:1.1693;stroke-miterlimit:4;stroke-dasharray:none;stroke-opacity:1"
       id="rect5184-6-3"
       width="0.69999999"
       height="76.124374"
       x="131.48959"
       y="125.0365" />
    <rect
       style="opacity:1;fill:#000000;fill-opacity:1;stroke:none;stroke-width:1.1693;stroke-miterlimit:4;stroke-dasharray:none;stroke-opacity:1"
       id="rect5184-6-3-8"
       width="0.69999999"
       height="76.124382"
       x="164.0027"
       y="124.88087" />
    <g
       id="g3890"
       transform="matrix(0.28222223,0,0,0.28222223,-42.748766,8.6423382)">
      <g
         id="g4986"
         transform="translate(-2.1437511)">
        <g
           transform="matrix(0.0131659,0,0,0.0131659,688.30091,691.92451)"
           id="layer1-3-1"
           inkscape:label="Calque 1">
          <path
             d="m 1415.3266,417.63549 c 65.3931,65.72296 35.7973,214.24287 -80.2372,349.80555 C 1197.9961,927.45356 994.17711,1010.7783 903.028,924.6035 824.47965,850.21159 874.34255,687.85041 996.27518,555.26974 820.95666,723.91162 736.68191,952.02215 841.64611,1050.4285 c 112.26067,105.0432 362.26129,-8.9856 524.49049,-210.19212 133.1086,-165.23764 164.037,-340.08103 88.5894,-416.26742 -29.3186,-29.51662 -71.3967,-42.75093 -120.5734,-41.28632 32.525,2.81048 60.643,14.30309 81.174,34.95285"
             style="fill:#ce5c00;fill-opacity:1;fill-rule:nonzero;stroke:#ce5c00;stroke-width:10.5558"
             id="path3898-4-29-6-2"
             inkscape:connector-curvature="0" />
          <path
             d="m 1313.1868,263.46327 c 47.0788,-38.96404 205.3893,55.15399 353.7641,205.61352 145.5511,147.76781 239.1809,307.05462 209.9018,361.04746 -26.3631,48.82051 -143.8358,-2.2431 -280.0582,-119.83456 174.5795,161.33199 329.9738,234.28567 360.5328,171.18846 31.0604,-63.95487 -78.1128,-247.995 -245.1581,-418.0619 -170.5023,-173.56351 -353.1834,-283.5548 -408.0472,-239.77468 -22.1935,17.62817 -19.924,57.76654 2.4938,112.11564 -10.305,-34.20074 -8.8141,-59.52143 6.5711,-72.29394"
             style="fill:#204a87;fill-opacity:1;fill-rule:nonzero;stroke:#204a87;stroke-width:10.5558"
             id="path3896-6-0-7-7"
             inkscape:connector-curvature="0" />
          <path
             d="m 1212.8512,355.76127 c -71.687,-71.35711 -23.2491,-206.60312 92.3235,-289.492426 100.8078,-72.1751859 217.9903,-77.941284 272.6957,-21.335882 46.4718,48.06841 40.4286,132.461918 -14.0656,208.819838 77.1892,-92.37632 89.0644,-199.214073 31.8257,-258.7750948 C 1533.0083,-70.098715 1398.2636,-67.195874 1280.3686,12.170441 1141.5732,105.23289 1080.3893,263.30578 1166.155,348.60973 c 33.0924,32.64377 81.5171,46.55101 135.4967,43.74054 -35.309,-2.41464 -66.3827,-14.25032 -88.8004,-36.589"
             style="fill:#4e9a06;fill-opacity:1;fill-rule:nonzero;stroke:#4e9a06;stroke-width:10.5558"
             id="path3900-6-1-5-0"
             inkscape:connector-curvature="0" />
          <path
             d="M 1324.6582,500.02086 C 1274.8086,550.62266 1086.1106,450.44826 902.71713,269.56167 715.00877,84.861805 623.18662,-94.863644 696.43058,-126.05599 755.38465,-150.98084 902.30799,-70.242274 1045.7479,56.77022 863.34395,-114.78769 664.01113,-230.82217 584.55245,-201.54306 491.80678,-167.1048 599.7,48.140865 827.36191,271.36935 1049.0466,488.83173 1275.9696,606.8982 1335.0029,544.56628 c 21.5997,-22.72133 17.7996,-66.32992 -5.5946,-121.81377 11.0044,34.88687 10.2655,62.00205 -4.7501,77.26835"
             style="fill:#a40000;fill-opacity:1;fill-rule:nonzero;stroke:#a40000;stroke-width:10.5558;stroke-linecap:butt"
             id="path3894-3-3-3-9"
             inkscape:connector-curvature="0" />
          <path
             sodipodi:nodetypes="cccccccccccc"
             d="m -854.7259,583.1405 h 226.69733 c -127.86931,-362.22464 -98.96419,-352.11653 -226.69733,0 z m 66.06835,-388.97807 h 94.56052 l 234.95596,616.50128 h -86.71483 l -56.15815,-158.15132 h -277.90049 l -56.15815,158.15132 h -87.95361 l 235.36875,-616.50128"
             id="path4367-3-5-3"
             style="font-style:normal;font-variant:normal;font-weight:normal;font-stretch:normal;font-size:64px;line-height:100%;font-family:'DejaVu Sans';-inkscape-font-specification:'DejaVu Sans';text-align:start;writing-mode:lr-tb;text-anchor:start;fill:#000000;fill-opacity:1;stroke:#000000;stroke-width:11.0588;stroke-miterlimit:4;stroke-dasharray:none;stroke-opacity:1"
             inkscape:connector-curvature="0" />
          <path
             d="m -414.52102,423.60605 h 302.04326 v 58.05862 l -239.1464,278.19774 h 239.1464 v 50.8013 h -310.68296 v -58.05862 l 239.1464,-278.19773 h -230.5067 v -50.80131"
             id="path4369-0-6-6"
             style="font-style:normal;font-variant:normal;font-weight:normal;font-stretch:normal;font-size:64px;line-height:100%;font-family:'DejaVu Sans';-inkscape-font-specification:'DejaVu Sans';text-align:start;writing-mode:lr-tb;text-anchor:start;fill:#000000;fill-opacity:1;stroke:#000000;stroke-width:11.0588;stroke-miterlimit:4;stroke-dasharray:none;stroke-opacity:1"
             inkscape:connector-curvature="0" />
          <path
             d="M 149.71065,606.07527 C 87.842869,605.56965 18.67281,610.18664 13.203752,683.83235 13.532037,733.34448 51.194131,755.0344 96.144678,757.44239 184.02497,755.62648 211.27315,681.96905 212.9531,606.07527 h -63.24245 m 126.83051,-26.2647 V 800.64089 H 212.9531 C 220.06718,689.20409 196.71609,799.19844 79.210875,810.66287 2.2620464,810.9067 -45.520091,762.87239 -50.384302,687.9794 -49.761511,585.80943 36.877107,559.80789 123.79165,556.31065 H 212.9531 C 213.50412,486.48518 164.74409,466.25618 103.0564,458.1639 58.951683,457.63083 16.856159,469.88695 -22.04624,489.95793 V 431.20812 C 20.0135,414.5646 64.433409,405.25155 109.62252,404.25234 222.84747,402.4568 279.74526,473.65082 276.54116,579.81057"
             id="path4371-9-2-0"
             style="font-style:normal;font-variant:normal;font-weight:normal;font-stretch:normal;font-size:64px;line-height:100%;font-family:'DejaVu Sans';-inkscape-font-specification:'DejaVu Sans';text-align:start;writing-mode:lr-tb;text-anchor:start;opacity:1;fill:#000000;fill-opacity:1;stroke:#000000;stroke-width:11.0588;stroke-miterlimit:4;stroke-dasharray:none;stroke-opacity:1"
             sodipodi:nodetypes="ccccccccccccccccc"
             inkscape:connector-curvature="0" />
          <path
             d="m 723.13862,591.21568 v 31.10283 H 430.77185 c 4.17724,84.63334 56.64541,129.8178 138.23488,134.43342 49.18521,0.67768 95.77634,-14.06073 139.27167,-35.94108 v 60.1322 c -45.29446,19.80635 -93.86997,28.70593 -143.07313,29.72045 -123.75476,0.16995 -193.56756,-81.75013 -200.78624,-199.74935 -0.55735,-120.046 71.40556,-198.73009 189.72737,-206.66118 111.72096,0.7009 163.35849,84.75726 168.99222,186.96271 M 659.55057,572.55389 C 658.82961,507.30541 619.6744,462.63322 554.83759,458.16453 482.46639,457.83625 442.62801,505.18148 432.84533,572.89949 l 226.70524,-0.34518 M 460.84486,362.68998 C 461.41065,361.41622 644.39657,228.6371 669,279.18401 c 24.4111,50.15233 -124.02236,84.55058 -208.15514,83.50597 z"
             id="path4373-1-9-6"
             sodipodi:nodetypes="ccccccccccccccczc"
             style="font-style:normal;font-variant:normal;font-weight:normal;font-stretch:normal;font-size:64px;line-height:100%;font-family:'DejaVu Sans';-inkscape-font-specification:'DejaVu Sans';text-align:start;writing-mode:lr-tb;text-anchor:start;fill:#000000;fill-opacity:1;stroke:#000000;stroke-width:11.0588;stroke-miterlimit:4;stroke-dasharray:none;stroke-opacity:1"
             inkscape:connector-curvature="0" />
        </g>
        <text
           xml:space="preserve"
           id="text1558-8-7"
           style="font-style:normal;font-variant:normal;font-weight:normal;font-stretch:normal;font-size:12.5px;line-height:1.25;font-family:'Linux Biolinum O';-inkscape-font-specification:'Linux Biolinum O, Normal';font-variant-ligatures:normal;font-variant-caps:normal;font-variant-numeric:normal;font-variant-east-asian:normal;letter-spacing:0px;word-spacing:0px;white-space:pre;shape-inside:url(#rect1560-9-36);fill:#000000;fill-opacity:1;stroke:none;"
           transform="translate(330.31037,650.12988)"><tspan
             x="194.55664"
             y="52.359272"><tspan
               style="shape-inside:url(#rect1560-9-36)">Lean Startup Dashboard par </tspan></tspan></text>
        <g
           id="surface1"
           transform="matrix(0.4096875,0,0,0.4096875,784.37667,689.12794)">
          <path
             style="fill:#a8b0ab;fill-opacity:1;fill-rule:nonzero;stroke:none"
             d="m 3.40625,0.476563 113.35547,0.203125 c 1.58594,0 3,-0.238282 3,3.160156 l -0.14063,37.328125 H 0.546875 V 3.699219 c 0,-1.671875 0.164063,-3.222656 2.859375,-3.222656 z"
             id="path3774" />
          <path
             style="fill:#ffffff;fill-opacity:1;fill-rule:nonzero;stroke:none"
             d="m 34.523438,19.574219 c 0.0039,7.53125 -6.097657,13.636719 -13.628907,13.644531 -7.527343,0.0039 -13.636718,-6.097656 -13.640625,-13.625 0,-0.0078 0,-0.01172 0,-0.01953 -0.00391,-7.527345 6.09375,-13.63672 13.625,-13.640626 7.53125,-0.00391 13.640625,6.097656 13.644532,13.625 0,0.0039 0,0.01172 0,0.01563 z"
             id="path3776" />
          <path
             style="fill:#000000;fill-opacity:1;fill-rule:nonzero;stroke:none"
             d="m 31.972656,8.46875 c 3.023438,3.027344 4.535157,6.726563 4.535157,11.105469 0,4.382812 -1.488282,8.042969 -4.457032,10.988281 -3.15625,3.101563 -6.882812,4.652344 -11.183593,4.652344 -4.25,0 -7.910157,-1.535156 -10.984375,-4.613281 -3.078125,-3.074219 -4.617188,-6.75 -4.617188,-11.027344 0,-4.273438 1.539063,-7.976563 4.617188,-11.105469 2.996093,-3.023437 6.65625,-4.535156 10.984375,-4.535156 4.378906,0 8.082031,1.511719 11.105468,4.535156 z m -20.054687,2.035156 c -2.558594,2.582032 -3.835938,5.605469 -3.835938,9.074219 0,3.46875 1.265625,6.46875 3.796875,8.996094 2.527344,2.53125 5.539063,3.796875 9.035157,3.796875 3.496093,0 6.53125,-1.277344 9.113281,-3.835938 2.453125,-2.371093 3.679687,-5.355468 3.679687,-8.957031 0,-3.570312 -1.246093,-6.601562 -3.738281,-9.09375 C 27.480469,7.996094 24.460938,6.75 20.914063,6.75 17.367188,6.75 14.367188,8 11.917969,10.503906 Z m 6.726562,7.550782 c -0.390625,-0.851563 -0.976562,-1.277344 -1.757812,-1.277344 -1.375,0 -2.066406,0.925781 -2.066406,2.78125 0,1.855469 0.691406,2.785156 2.066406,2.785156 0.910156,0 1.5625,-0.453125 1.953125,-1.359375 L 20.75,22.003906 c -0.910156,1.617188 -2.277344,2.425782 -4.097656,2.425782 -1.40625,0 -2.53125,-0.429688 -3.378906,-1.289063 -0.847657,-0.863281 -1.269532,-2.050781 -1.269532,-3.566406 0,-1.488281 0.4375,-2.667969 1.308594,-3.542969 0.871094,-0.875 1.957031,-1.3125 3.261719,-1.3125 1.925781,0 3.304687,0.761719 4.136719,2.277344 z m 8.988282,0 c -0.390625,-0.851563 -0.964844,-1.277344 -1.71875,-1.277344 -1.40625,0 -2.109375,0.925781 -2.109375,2.78125 0,1.855469 0.703125,2.785156 2.109375,2.785156 0.910156,0 1.550781,-0.453125 1.914062,-1.359375 l 1.953125,1.019531 c -0.910156,1.617188 -2.273437,2.425782 -4.089844,2.425782 -1.40625,0 -2.527343,-0.429688 -3.375,-1.289063 -0.839843,-0.863281 -1.265625,-2.050781 -1.265625,-3.566406 0,-1.488281 0.429688,-2.667969 1.289063,-3.542969 0.855469,-0.875 1.945312,-1.3125 3.273437,-1.3125 1.921875,0 3.296875,0.761719 4.128907,2.277344 z"
             id="path3778" />
          <path
             style="fill:#000000;fill-opacity:1;fill-rule:nonzero;stroke:none"
             d="M 117.75391,0 H 2.246094 C 1.007813,0 0,1.007813 0,2.246094 V 41.492188 C 0,41.773438 0.226563,42 0.507813,42 H 119.49219 C 119.77344,42 120,41.773438 120,41.492188 V 2.246094 C 120,1.007813 118.99219,0 117.75391,0 Z M 2.246094,1.015625 H 117.75391 c 0.67968,0 1.23047,0.550781 1.23047,1.230469 0,0 0,15.820312 0,27.246094 H 36.429688 c -3.027344,5.46875 -8.859375,9.183593 -15.546875,9.183593 -6.695313,0 -12.523438,-3.710937 -15.546875,-9.183593 H 1.015625 c 0,-11.425782 0,-27.246094 0,-27.246094 0,-0.679688 0.550781,-1.230469 1.230469,-1.230469 z"
             id="path3780" />
          <path
             style="fill:#ffffff;fill-opacity:1;fill-rule:nonzero;stroke:none"
             d="m 86.265625,37.730469 c 0.07813,0.15625 0.183594,0.28125 0.316406,0.378906 0.132813,0.09375 0.289063,0.164063 0.46875,0.210938 0.179688,0.04687 0.363282,0.07031 0.554688,0.07031 0.128906,0 0.269531,-0.01172 0.417969,-0.03125 0.144531,-0.02344 0.285156,-0.0625 0.414062,-0.125 0.128906,-0.0625 0.238281,-0.148437 0.324219,-0.257812 0.08594,-0.105469 0.128906,-0.242188 0.128906,-0.410157 0,-0.179687 -0.05469,-0.324218 -0.171875,-0.4375 -0.113281,-0.109375 -0.261719,-0.203125 -0.449219,-0.277343 -0.183593,-0.07422 -0.394531,-0.140625 -0.628906,-0.195313 -0.234375,-0.05469 -0.472656,-0.117187 -0.710937,-0.183594 -0.25,-0.0625 -0.488282,-0.140625 -0.722657,-0.230468 -0.234375,-0.08594 -0.445312,-0.203125 -0.632812,-0.347657 -0.183594,-0.140625 -0.332031,-0.320312 -0.449219,-0.53125 -0.113281,-0.214843 -0.167969,-0.472656 -0.167969,-0.773437 0,-0.34375 0.07031,-0.636719 0.214844,-0.886719 0.148438,-0.25 0.335938,-0.460937 0.570313,-0.628906 0.234375,-0.164063 0.5,-0.289063 0.796875,-0.371094 0.296875,-0.07813 0.59375,-0.117187 0.890625,-0.117187 0.347656,0 0.679687,0.03906 0.996093,0.113281 0.316407,0.07813 0.601563,0.203125 0.847657,0.378906 0.246093,0.171875 0.445312,0.394531 0.589843,0.664063 0.144532,0.269531 0.214844,0.59375 0.214844,0.976562 h -1.410156 c -0.01563,-0.195312 -0.05469,-0.359375 -0.125,-0.492187 -0.07031,-0.128907 -0.164063,-0.230469 -0.28125,-0.304688 -0.117188,-0.07422 -0.25,-0.125 -0.402344,-0.15625 -0.152344,-0.03125 -0.316406,-0.04687 -0.492187,-0.04687 -0.117188,0 -0.234375,0.01172 -0.351563,0.03516 -0.117187,0.02734 -0.222656,0.07031 -0.320312,0.128907 -0.09375,0.0625 -0.171875,0.140625 -0.234375,0.234375 -0.0625,0.09375 -0.09375,0.210937 -0.09375,0.351562 0,0.128906 0.02734,0.234375 0.07422,0.316406 0.05078,0.08203 0.148438,0.15625 0.292969,0.222657 0.144531,0.06641 0.34375,0.136718 0.601563,0.203125 0.257812,0.07031 0.589843,0.15625 1.003906,0.261718 0.125,0.02344 0.296875,0.07031 0.515625,0.132813 0.21875,0.06641 0.4375,0.167969 0.652344,0.3125 0.21875,0.140625 0.402343,0.332031 0.5625,0.570312 0.15625,0.238282 0.234375,0.542969 0.234375,0.914063 0,0.300781 -0.05859,0.582031 -0.175782,0.84375 -0.117187,0.257812 -0.292968,0.484375 -0.523437,0.671875 -0.234375,0.1875 -0.519531,0.335937 -0.863281,0.441406 -0.34375,0.105469 -0.742188,0.15625 -1.191407,0.15625 -0.363281,0 -0.71875,-0.04297 -1.0625,-0.132812 -0.34375,-0.08984 -0.648437,-0.230469 -0.910156,-0.425782 -0.261719,-0.191406 -0.46875,-0.433593 -0.625,-0.730468 -0.15625,-0.300782 -0.226562,-0.652344 -0.222656,-1.058594 h 1.414062 c 0,0.222656 0.03906,0.410156 0.121094,0.5625 z"
             id="path3782" />
          <path
             style="fill:#ffffff;fill-opacity:1;fill-rule:nonzero;stroke:none"
             d="m 94.46875,32.746094 2.476563,6.625 h -1.511719 l -0.5,-1.476563 H 92.457031 L 91.9375,39.371094 h -1.464844 l 2.503907,-6.625 z m 0.08594,4.0625 -0.835938,-2.429688 h -0.01953 l -0.863281,2.429688 z"
             id="path3784" />
          <path
             style="fill:#ffffff;fill-opacity:1;fill-rule:nonzero;stroke:none"
             d="m 59.996094,32.746094 c 0.316406,0 0.605469,0.03125 0.863281,0.08594 0.261719,0.05469 0.484375,0.144532 0.671875,0.273438 0.183594,0.125 0.328125,0.292969 0.429688,0.503906 0.101562,0.210938 0.152343,0.46875 0.152343,0.777344 0,0.335937 -0.07422,0.613281 -0.226562,0.835937 -0.152344,0.222657 -0.375,0.40625 -0.671875,0.546875 0.410156,0.117188 0.714844,0.324219 0.914062,0.617188 0.203125,0.292969 0.304688,0.648437 0.304688,1.0625 0,0.332031 -0.06641,0.621094 -0.195313,0.867187 -0.128906,0.242188 -0.304687,0.445313 -0.523437,0.597657 -0.222656,0.15625 -0.472656,0.269531 -0.753906,0.34375 -0.28125,0.07422 -0.570313,0.113281 -0.871094,0.113281 H 56.875 v -6.625 z m -0.1875,2.679687 c 0.261719,0 0.476562,-0.0625 0.644531,-0.183593 0.164063,-0.125 0.25,-0.324219 0.25,-0.601563 0,-0.15625 -0.02734,-0.28125 -0.08594,-0.378906 -0.05469,-0.101563 -0.128907,-0.175781 -0.222657,-0.234375 -0.09375,-0.05469 -0.199218,-0.09375 -0.320312,-0.113281 -0.121094,-0.02344 -0.246094,-0.03516 -0.375,-0.03516 h -1.363281 v 1.546875 z m 0.08594,2.808594 c 0.144532,0 0.28125,-0.01172 0.410157,-0.03906 0.128906,-0.02734 0.246093,-0.07422 0.34375,-0.140625 0.09766,-0.0625 0.179687,-0.152344 0.238281,-0.265625 0.05859,-0.109375 0.08594,-0.25 0.08594,-0.425782 0,-0.339843 -0.09375,-0.582031 -0.285156,-0.726562 -0.195312,-0.144531 -0.449219,-0.21875 -0.765625,-0.21875 h -1.585937 v 1.816406 z"
             id="path3786" />
          <path
             style="fill:#ffffff;fill-opacity:1;fill-rule:nonzero;stroke:none"
             d="m 62.691406,32.746094 h 1.632813 l 1.550781,2.617187 1.539063,-2.617187 h 1.625 l -2.457032,4.082031 v 2.542969 h -1.460937 v -2.582031 z"
             id="path3788" />
          <path
             style="fill:#ffffff;fill-opacity:1;fill-rule:nonzero;stroke:none"
             d="m 102.40234,14.980469 c 0.004,5.84375 -4.730465,10.585937 -10.578121,10.59375 -5.84375,0.0039 -10.585938,-4.730469 -10.589844,-10.578125 0,-0.0039 0,-0.01172 0,-0.01563 -0.0039,-5.84375 4.730469,-10.585938 10.574219,-10.589844 5.847656,-0.00781 10.589846,4.730469 10.593746,10.574219 0,0.0078 0,0.01172 0,0.01563 z"
             id="path3790" />
          <path
             style="fill:#000000;fill-opacity:1;fill-rule:nonzero;stroke:none"
             d="m 91.742188,3.386719 c -3.210938,0 -5.929688,1.121094 -8.15625,3.363281 -2.285157,2.316406 -3.425782,5.0625 -3.425782,8.230469 0,3.167969 1.140625,5.894531 3.425782,8.175781 2.28125,2.28125 5.003906,3.417969 8.15625,3.417969 3.191406,0 5.960937,-1.148438 8.300782,-3.449219 2.20703,-2.183594 3.30859,-4.898437 3.30859,-8.144531 0,-3.246094 -1.12109,-5.992188 -3.367185,-8.230469 C 97.742188,4.507813 94.992188,3.386719 91.742188,3.386719 Z m 0.02734,2.085937 c 2.632813,0 4.867188,0.925782 6.707032,2.78125 1.85938,1.835938 2.78516,4.078125 2.78516,6.726563 0,2.667969 -0.90625,4.878906 -2.726567,6.636719 -1.917968,1.894531 -4.171875,2.84375 -6.765625,2.84375 -2.589843,0 -4.828125,-0.9375 -6.703125,-2.8125 C 83.1875,19.773438 82.25,17.550781 82.25,14.980469 c 0,-2.570313 0.949219,-4.8125 2.84375,-6.726563 1.820313,-1.855468 4.046875,-2.78125 6.675781,-2.78125 z"
             id="path3792" />
          <path
             style="fill:#000000;fill-opacity:1;fill-rule:nonzero;stroke:none"
             d="m 86.601563,13.34375 c 0.464843,-2.917969 2.515625,-4.476562 5.089843,-4.476562 3.703125,0 5.960938,2.6875 5.960938,6.269531 0,3.492187 -2.402344,6.207031 -6.019531,6.207031 -2.484375,0 -4.710938,-1.53125 -5.117188,-4.53125 H 89.4375 c 0.08594,1.558594 1.097656,2.105469 2.542969,2.105469 1.648437,0 2.722656,-1.53125 2.722656,-3.871094 0,-2.453125 -0.925781,-3.753906 -2.664062,-3.753906 -1.273438,0 -2.371094,0.464844 -2.601563,2.050781 l 0.847656,-0.0039 -2.296875,2.300781 L 85.6875,13.33985 Z"
             id="path3794" />
          <path
             style="fill:#ffffff;fill-opacity:1;fill-rule:nonzero;stroke:none"
             d="m 74.097656,15.21875 c 0,5.929688 -4.808593,10.734375 -10.738281,10.734375 -5.929687,0 -10.738281,-4.804687 -10.738281,-10.734375 0,-5.933594 4.808594,-10.738281 10.738281,-10.738281 5.929688,0 10.738281,4.804687 10.738281,10.738281 z"
             id="path3796" />
          <path
             style="fill:#000000;fill-opacity:1;fill-rule:nonzero;stroke:none"
             d="m 66.46875,12.109375 c 0,-0.414062 -0.335937,-0.75 -0.75,-0.75 h -4.742187 c -0.414063,0 -0.75,0.335938 -0.75,0.75 v 4.742188 h 1.324218 v 5.617187 h 3.59375 v -5.617187 h 1.324219 z"
             id="path3798" />
          <path
             style="fill:#000000;fill-opacity:1;fill-rule:nonzero;stroke:none"
             d="m 64.96875,9.113281 c 0,0.898438 -0.726562,1.621094 -1.621094,1.621094 -0.894531,0 -1.621093,-0.722656 -1.621093,-1.621094 0,-0.894531 0.726562,-1.621093 1.621093,-1.621093 0.894532,0 1.621094,0.726562 1.621094,1.621093 z"
             id="path3800" />
          <path
             style="fill:#000000;fill-opacity:1;fill-rule:evenodd;stroke:none"
             d="m 63.332031,3.386719 c -3.210937,0 -5.929687,1.121094 -8.15625,3.363281 C 52.890625,9.066406 51.75,11.8125 51.75,14.980469 c 0,3.167969 1.140625,5.894531 3.425781,8.175781 2.285157,2.277344 5.003907,3.417969 8.15625,3.417969 3.191407,0 5.960938,-1.148438 8.300782,-3.449219 2.207031,-2.183594 3.308593,-4.898437 3.308593,-8.144531 0,-3.246094 -1.121093,-5.992188 -3.363281,-8.230469 C 69.332031,4.507813 66.582031,3.386719 63.332031,3.386719 Z m 0.02734,2.085937 c 2.632813,0 4.867188,0.925782 6.707031,2.78125 1.859375,1.835938 2.789063,4.078125 2.789063,6.726563 0,2.667969 -0.910156,4.878906 -2.730469,6.636719 -1.917969,1.894531 -4.171875,2.839843 -6.765625,2.839843 -2.589844,0 -4.828125,-0.933593 -6.703125,-2.808593 -1.878906,-1.875 -2.816406,-4.097657 -2.816406,-6.667969 0,-2.570313 0.949219,-4.8125 2.84375,-6.726563 1.820312,-1.855468 4.046875,-2.78125 6.675781,-2.78125 z"
             id="path3802" />
        </g>
        <text
           xml:space="preserve"
           id="text1558-8-7-3"
           style="font-style:normal;font-variant:normal;font-weight:normal;font-stretch:normal;font-size:12.5px;line-height:1.25;font-family:'Linux Biolinum O';-inkscape-font-specification:'Linux Biolinum O, Normal';font-variant-ligatures:normal;font-variant-caps:normal;font-variant-numeric:normal;font-variant-east-asian:normal;letter-spacing:0px;word-spacing:0px;white-space:pre;shape-inside:url(#rect1560-9-36-5);fill:#000000;fill-opacity:1;stroke:none;"
           transform="translate(523.23122,650.12988)"><tspan
             x="194.55664"
             y="52.359272"><tspan>sous licence</tspan></tspan></text>
      </g>
    </g>
  </g>
</svg>
