<?xml version="1.0" encoding="UTF-8" standalone="no"?>
<svg
   xmlns:dc="http://purl.org/dc/elements/1.1/"
   xmlns:cc="http://creativecommons.org/ns#"
   xmlns:rdf="http://www.w3.org/1999/02/22-rdf-syntax-ns#"
   xmlns:svg="http://www.w3.org/2000/svg"
   xmlns="http://www.w3.org/2000/svg"
   xmlns:sodipodi="http://sodipodi.sourceforge.net/DTD/sodipodi-0.dtd"
   xmlns:inkscape="http://www.inkscape.org/namespaces/inkscape"
   width="156.75313mm"
   height="204.2928mm"
   viewBox="0 0 156.75313 204.2928"
   version="1.1"
   id="svg8"
   inkscape:version="1.0.1 (3bc2e813f5, 2020-09-07)"
   sodipodi:docname="pirates-metrics-reference.svg">
  <defs
     id="defs2" />
  <sodipodi:namedview
     id="base"
     pagecolor="#ffffff"
     bordercolor="#666666"
     borderopacity="1.0"
     inkscape:pageopacity="0.0"
     inkscape:pageshadow="2"
     inkscape:zoom="0.27089825"
     inkscape:cx="-372.79597"
     inkscape:cy="909.45525"
     inkscape:document-units="mm"
     inkscape:current-layer="layer1"
     inkscape:document-rotation="0"
     showgrid="false"
     inkscape:window-width="1920"
     inkscape:window-height="1016"
     inkscape:window-x="0"
     inkscape:window-y="27"
     inkscape:window-maximized="1"
     fit-margin-top="0"
     fit-margin-left="0"
     fit-margin-right="0"
     fit-margin-bottom="0"
     showguides="true"
     inkscape:guide-bbox="true">
    <sodipodi:guide
       position="78.991464,-0.69524574"
       orientation="1,0"
       id="guide846" />
  </sodipodi:namedview>
  <metadata
     id="metadata5">
    <rdf:RDF>
      <cc:Work
         rdf:about="">
        <dc:format>image/svg+xml</dc:format>
        <dc:type
           rdf:resource="http://purl.org/dc/dcmitype/StillImage" />
        <dc:title></dc:title>
      </cc:Work>
    </rdf:RDF>
  </metadata>
  <g
     inkscape:label="Calque 1"
     inkscape:groupmode="layer"
     id="layer1"
     transform="translate(11.363475,-4.4598268)">
    <path
       style="fill:#4c566a;fill-opacity:1;stroke:#000000;stroke-width:0.265633px;stroke-linecap:butt;stroke-linejoin:miter;stroke-opacity:1"
       d="M -11.172187,4.5928304 67.627987,208.42228 146.44137,4.7455973 Z"
       id="path1132"
       sodipodi:nodetypes="cccc" />
    <rect
       style="opacity:0.999;fill:#eceff4;stroke-width:0.00658027"
       id="rect28"
       width="140"
       height="26.54339"
       x="-2.3654492"
       y="19.66371" />
    <text
       xml:space="preserve"
       style="font-style:normal;font-weight:normal;font-size:10.5833px;line-height:1.25;font-family:sans-serif;letter-spacing:0px;word-spacing:0px;fill:#000000;fill-opacity:1;stroke:none;stroke-width:0.264583"
       x="41.969532"
       y="35.855114"
       id="text1028"><tspan
         sodipodi:role="line"
         id="tspan1026"
         x="41.969532"
         y="35.855114"
         style="stroke-width:0.264583">Aquisition</tspan></text>
    <rect
       style="opacity:0.999;fill:#eceff4;stroke-width:0.00609215"
       id="rect28-3"
       width="120"
       height="26.543392"
       x="7.634551"
       y="54.572006" />
    <text
       xml:space="preserve"
       style="font-style:normal;font-weight:normal;font-size:10.5833px;line-height:1.25;font-family:sans-serif;letter-spacing:0px;word-spacing:0px;fill:#000000;fill-opacity:1;stroke:none;stroke-width:0.264583"
       x="41.550957"
       y="71.789185"
       id="text1032"><tspan
         sodipodi:role="line"
         id="tspan1030"
         x="41.550957"
         y="71.789185"
         style="stroke-width:0.264583">Activation</tspan></text>
    <rect
       style="opacity:0.999;fill:#eceff4;stroke-width:0.00556136"
       id="rect28-6"
       width="100"
       height="26.543392"
       x="17.63455"
       y="89.480301" />
    <text
       xml:space="preserve"
       style="font-style:normal;font-weight:normal;font-size:10.5833px;line-height:1.25;font-family:sans-serif;letter-spacing:0px;word-spacing:0px;fill:#000000;fill-opacity:1;stroke:none;stroke-width:0.264583"
       x="42.049629"
       y="106.90936"
       id="text1036"><tspan
         sodipodi:role="line"
         id="tspan1034"
         x="42.049629"
         y="106.90936"
         style="stroke-width:0.264583">Rétention</tspan></text>
    <rect
       style="opacity:0.999;fill:#ebcb8b;stroke-width:0.00497421"
       id="rect28-7"
       width="80"
       height="26.543392"
       x="27.63455"
       y="124.3886" />
    <text
       xml:space="preserve"
       style="font-style:normal;font-weight:normal;font-size:10.5833px;line-height:1.25;font-family:sans-serif;letter-spacing:0px;word-spacing:0px;fill:#000000;fill-opacity:1;stroke:none;stroke-width:0.264583"
       x="40.749973"
       y="141.44299"
       id="text1040"><tspan
         sodipodi:role="line"
         id="tspan1038"
         x="40.749973"
         y="141.44299"
         style="stroke-width:0.264583">Référence</tspan></text>
    <rect
       style="opacity:0.999;fill:#eceff4;stroke-width:0.00430781"
       id="rect28-5"
       width="60"
       height="26.543392"
       x="37.634552"
       y="159.29691" />
    <text
       xml:space="preserve"
       style="font-style:normal;font-weight:normal;font-size:10.5833px;line-height:1.25;font-family:sans-serif;letter-spacing:0px;word-spacing:0px;fill:#000000;fill-opacity:1;stroke:none;stroke-width:0.264583"
       x="44.827229"
       y="176.72595"
       id="text1044"><tspan
         sodipodi:role="line"
         id="tspan1042"
         x="44.827229"
         y="176.72595"
         style="stroke-width:0.264583">Revenus</tspan></text>
  </g>
</svg>
