<?xml version="1.0" encoding="UTF-8" standalone="no"?>
<svg
   xmlns:dc="http://purl.org/dc/elements/1.1/"
   xmlns:cc="http://creativecommons.org/ns#"
   xmlns:rdf="http://www.w3.org/1999/02/22-rdf-syntax-ns#"
   xmlns:svg="http://www.w3.org/2000/svg"
   xmlns="http://www.w3.org/2000/svg"
   xmlns:sodipodi="http://sodipodi.sourceforge.net/DTD/sodipodi-0.dtd"
   xmlns:inkscape="http://www.inkscape.org/namespaces/inkscape"
   width="33.59943mm"
   height="42.401459mm"
   viewBox="0 0 33.599431 42.401459"
   version="1.1"
   id="svg8"
   inkscape:version="1.0.2 (e86c870879, 2021-01-15)"
   sodipodi:docname="understand.svg">
  <defs
     id="defs2" />
  <sodipodi:namedview
     id="base"
     pagecolor="#ffffff"
     bordercolor="#666666"
     borderopacity="1.0"
     inkscape:pageopacity="0.0"
     inkscape:pageshadow="2"
     inkscape:zoom="3.959798"
     inkscape:cx="58.271778"
     inkscape:cy="78.165737"
     inkscape:document-units="mm"
     inkscape:current-layer="layer1"
     inkscape:document-rotation="0"
     showgrid="false"
     fit-margin-top="0"
     fit-margin-left="0"
     fit-margin-right="0"
     fit-margin-bottom="0"
     inkscape:window-width="1920"
     inkscape:window-height="1016"
     inkscape:window-x="0"
     inkscape:window-y="27"
     inkscape:window-maximized="1" />
  <metadata
     id="metadata5">
    <rdf:RDF>
      <cc:Work
         rdf:about="">
        <dc:format>image/svg+xml</dc:format>
        <dc:type
           rdf:resource="http://purl.org/dc/dcmitype/StillImage" />
        <dc:title></dc:title>
      </cc:Work>
    </rdf:RDF>
  </metadata>
  <g
     inkscape:label="Calque 1"
     inkscape:groupmode="layer"
     id="layer1"
     transform="translate(-215.14781,-5.4410239)">
    <path
       style="fill:#5e81ac;stroke-width:0.112115"
       d="m 231.70584,46.587641 c -1.75808,-2.705137 -4.32146,-5.56353 -6.40789,-7.145343 -1.14994,-0.871814 -2.7539,-1.739758 -3.75047,-2.029468 -0.51773,-0.150508 -0.58912,-0.203599 -0.49935,-0.371339 0.24896,-0.465197 0.37621,-2.093312 0.23768,-3.040833 -0.29619,-2.025562 -0.74286,-3.001879 -2.72207,-5.949778 -2.14601,-3.196327 -3.06808,-5.161327 -3.34623,-7.131037 -0.35415,-2.507905 0.66068,-5.864214 2.60311,-8.609182 0.90896,-1.284532 3.17051,-3.5669556 4.18938,-4.2280606 2.34689,-1.5228006 4.76853,-2.2433418 8.63075,-2.5680168 4.17641,-0.3510847 8.02394,0.5604017 11.01445,2.6093434 1.79817,1.2320102 3.61339,3.357045 4.51973,5.291125 0.68823,1.468644 0.90671,2.51899 0.97161,4.670929 l 0.0559,1.854501 -0.46087,1.082791 c -0.38147,0.896268 -0.46086,1.208369 -0.46086,1.811807 0,0.753695 0.0709,0.925435 1.39294,3.374598 0.50522,0.935958 1.07359,2.300893 1.07359,2.578231 0,0.618573 -0.74433,1.177608 -1.56793,1.177608 -0.4719,0 -0.56225,0.25874 -0.56225,1.610155 0,1.264902 -1.1e-4,1.265196 -0.74416,1.709152 -0.18606,0.11102 -0.19158,0.154509 -0.0526,0.414299 0.21871,0.408639 0.0967,0.980712 -0.34491,1.616704 l -0.37194,0.535707 v 1.533402 1.533403 l -0.33322,0.348629 c -0.6522,0.682327 -2.41528,0.89363 -4.73409,0.567369 -1.92318,-0.270593 -3.12601,-0.03923 -3.86698,0.743772 -0.34778,0.367506 -2.47511,4.57884 -3.11026,6.157147 -0.23615,0.586862 -0.44804,1.084838 -0.47083,1.106615 -0.0228,0.02178 -0.41983,-0.542626 -0.8823,-1.25423 z"
       id="path1062"
       sodipodi:nodetypes="csssssssssssscssssssssscccssssscc" />
    <path
       d="m 236.744,16.037995 c 0,0.947054 -0.31262,1.765384 -0.94706,2.464183 -0.63444,0.698798 -1.47116,1.682633 -1.54472,2.666467 0.26665,0.156311 0.43216,0.45054 0.43216,0.753966 0,0.220675 -0.0828,0.432151 -0.22987,0.588463 0.14712,0.156309 0.22987,0.367788 0.22987,0.588462 0,0.303425 -0.15631,0.579265 -0.41376,0.74477 0.0736,0.128724 0.11958,0.285037 0.11958,0.432153 0,0.597656 -0.46894,0.882692 -1.00223,0.882692 -0.23905,0.533294 -0.77234,0.882693 -1.35161,0.882693 -0.57927,0 -1.11257,-0.349399 -1.35164,-0.882693 -0.53329,0 -1.00221,-0.285036 -1.00221,-0.882692 0,-0.147116 0.046,-0.303426 0.11957,-0.432153 -0.25746,-0.165505 -0.41377,-0.441345 -0.41377,-0.74477 0,-0.220674 0.0828,-0.432153 0.22987,-0.588462 -0.14712,-0.156312 -0.22987,-0.367788 -0.22987,-0.588463 0,-0.303426 0.16552,-0.597655 0.43215,-0.753966 -0.0736,-0.983834 -0.91027,-1.967669 -1.5447,-2.666467 -0.63443,-0.698799 -0.94706,-1.517129 -0.94706,-2.464183 0,-2.500964 2.38143,-4.119233 4.7077,-4.119233 2.32625,0 4.70769,1.618269 4.70769,4.119233 z"
       id="path969-8"
       style="fill:#eceff4;stroke-width:0.00926932;stroke-miterlimit:4;stroke-dasharray:none"
       sodipodi:nodetypes="cscscscscscscscscssscc" />
    <path
       d="m 234.1419,16.036225 c 0,0.156311 -0.13793,0.29423 -0.29424,0.29423 -0.15632,0 -0.29423,-0.137919 -0.29423,-0.29423 0,-0.634438 -0.98383,-0.882695 -1.47115,-0.882695 -0.15632,0 -0.29423,-0.13792 -0.29423,-0.294229 0,-0.15631 0.13791,-0.294231 0.29423,-0.294231 0.8551,0 2.05962,0.45054 2.05962,1.471155 z"
       id="path969"
       style="fill:#5e81ac;stroke-width:0.00926932;stroke-miterlimit:4;stroke-dasharray:none"
       sodipodi:nodetypes="sssssss" />
    <rect
       style="fill:#eceff4;stroke:none;stroke-width:0.960182;stroke-linecap:round;stroke-linejoin:round;stroke-miterlimit:4;stroke-dasharray:none"
       id="rect1064"
       width="1.1852241"
       height="2.6054974"
       x="159.31555"
       y="160.18118"
       ry="0.34784254"
       transform="rotate(-42.535034)" />
    <rect
       style="fill:#eceff4;stroke:none;stroke-width:0.960182;stroke-linecap:round;stroke-linejoin:round;stroke-miterlimit:4;stroke-dasharray:none"
       id="rect1064-3-1"
       width="1.1852241"
       height="2.6054974"
       x="232.08801"
       y="3.7867234"
       ry="0.34784254"
       transform="rotate(1.0421811)"
       inkscape:transform-center-x="-0.036477707"
       inkscape:transform-center-y="0.097553797" />
    <rect
       style="fill:#eceff4;stroke:none;stroke-width:0.960182;stroke-linecap:round;stroke-linejoin:round;stroke-miterlimit:4;stroke-dasharray:none"
       id="rect1064-3-1-2-9"
       width="1.1852241"
       height="2.6054974"
       x="176.46712"
       y="-160.30911"
       ry="0.34784254"
       transform="rotate(44.636795)"
       inkscape:transform-center-x="0.040855715"
       inkscape:transform-center-y="0.095810588" />
    <rect
       style="fill:#eceff4;stroke:none;stroke-width:0.960182;stroke-linecap:round;stroke-linejoin:round;stroke-miterlimit:4;stroke-dasharray:none"
       id="rect1064-3-1-2-9-9"
       width="1.1852241"
       height="2.6054974"
       x="23.925581"
       y="-240.16029"
       ry="0.34784254"
       transform="rotate(87.875724)"
       inkscape:transform-center-x="0.095415504"
       inkscape:transform-center-y="0.041811989" />
    <rect
       style="fill:#eceff4;stroke:none;stroke-width:0.960182;stroke-linecap:round;stroke-linejoin:round;stroke-miterlimit:4;stroke-dasharray:none"
       id="rect1064-3-1-2-9-7"
       width="1.1852241"
       height="2.6054974"
       x="24.543049"
       y="-225.19716"
       ry="0.34784254"
       transform="rotate(87.580848)"
       inkscape:transform-center-x="0.095180743"
       inkscape:transform-center-y="0.042300549" />
  </g>
</svg>
