<?xml version="1.0" encoding="UTF-8" standalone="no"?>
<svg
   xmlns:dc="http://purl.org/dc/elements/1.1/"
   xmlns:cc="http://creativecommons.org/ns#"
   xmlns:rdf="http://www.w3.org/1999/02/22-rdf-syntax-ns#"
   xmlns:svg="http://www.w3.org/2000/svg"
   xmlns="http://www.w3.org/2000/svg"
   xmlns:sodipodi="http://sodipodi.sourceforge.net/DTD/sodipodi-0.dtd"
   xmlns:inkscape="http://www.inkscape.org/namespaces/inkscape"
   width="477.5806mm"
   height="164.00514mm"
   viewBox="0 0 477.5806 164.00514"
   version="1.1"
   id="svg2540"
   inkscape:version="1.0.1 (3bc2e813f5, 2020-09-07)"
   sodipodi:docname="matrice-kano-lecture.svg">
  <defs
     id="defs2534" />
  <sodipodi:namedview
     id="base"
     pagecolor="#ffffff"
     bordercolor="#666666"
     borderopacity="1.0"
     inkscape:pageopacity="0.0"
     inkscape:pageshadow="2"
     inkscape:zoom="0.49497475"
     inkscape:cx="854.17416"
     inkscape:cy="335.78152"
     inkscape:document-units="mm"
     inkscape:current-layer="layer1"
     inkscape:document-rotation="0"
     showgrid="false"
     fit-margin-top="0"
     fit-margin-left="0"
     fit-margin-right="0"
     fit-margin-bottom="0"
     inkscape:window-width="1920"
     inkscape:window-height="1016"
     inkscape:window-x="0"
     inkscape:window-y="27"
     inkscape:window-maximized="1" />
  <metadata
     id="metadata2537">
    <rdf:RDF>
      <cc:Work
         rdf:about="">
        <dc:format>image/svg+xml</dc:format>
        <dc:type
           rdf:resource="http://purl.org/dc/dcmitype/StillImage" />
        <dc:title></dc:title>
      </cc:Work>
    </rdf:RDF>
  </metadata>
  <g
     inkscape:label="Calque 1"
     inkscape:groupmode="layer"
     id="layer1"
     transform="translate(4.693964,-64.095749)">
    <rect
       style="fill:#bf616a;stroke:#bf616a;stroke-width:2"
       id="rect3177-3-3-0-6-2"
       width="377.03076"
       height="23.143585"
       x="-471.88663"
       y="-88.239334"
       transform="scale(-1)" />
    <text
       xml:space="preserve"
       style="font-size:7.05556px;line-height:1.25;font-family:sans-serif;-inkscape-font-specification:'sans-serif, Normal';letter-spacing:0px;word-spacing:0px;fill:#eceff4;stroke-width:0.264583"
       x="244.95015"
       y="77.88414"
       id="text3105"><tspan
         sodipodi:role="line"
         id="tspan3103"
         x="244.95015"
         y="77.88414"
         style="fill:#eceff4;stroke-width:0.264583">Fonctionnalité absente</tspan></text>
    <rect
       style="fill:#a3be8c;stroke:#a3be8c;stroke-width:2"
       id="rect3177-3-3-0-6"
       width="115.71797"
       height="23.143583"
       x="111.38292"
       y="-19.449619"
       transform="rotate(90)" />
    <text
       xml:space="preserve"
       style="font-size:7.05556px;line-height:1.25;font-family:sans-serif;-inkscape-font-specification:'sans-serif, Normal';letter-spacing:0px;word-spacing:0px;stroke-width:0.264583"
       x="-212.01863"
       y="10.994265"
       id="text3109"
       transform="rotate(-90)"><tspan
         sodipodi:role="line"
         id="tspan3107"
         x="-212.01863"
         y="10.994265"
         style="stroke-width:0.264583">Fonctionnalité préente</tspan></text>
    <rect
       style="fill:#eceff4;stroke:#bf616a;stroke-width:2"
       id="rect3177-3-3-0-59-08"
       width="75.406166"
       height="23.143593"
       x="94.855797"
       y="88.239326" />
    <text
       xml:space="preserve"
       style="font-size:7.05556px;line-height:1.25;font-family:sans-serif;-inkscape-font-specification:'sans-serif, Normal';letter-spacing:0px;word-spacing:0px;stroke-width:0.264583"
       x="112.22591"
       y="101.75761"
       id="text3113"><tspan
         sodipodi:role="line"
         id="tspan3111"
         x="112.22591"
         y="101.75761"
         style="stroke-width:0.264583">Ca me plait</tspan></text>
    <rect
       style="fill:#d8dee9;stroke:none;stroke-width:2"
       id="rect3177-3-3-0-9-0"
       width="75.406166"
       height="23.143593"
       x="94.855797"
       y="134.52654" />
    <rect
       style="fill:#eceff4;stroke:#bf616a;stroke-width:2"
       id="rect3177-3-3-0-59-7-5"
       width="75.406166"
       height="23.143593"
       x="170.26198"
       y="88.239326" />
    <rect
       style="fill:#ebcb8b;stroke:none;stroke-width:2"
       id="rect3177-3-3-0-59"
       width="75.406166"
       height="23.143593"
       x="94.855797"
       y="111.38292" />
    <rect
       style="fill:#d8dee9;stroke:none;stroke-width:2"
       id="rect3177-3-3-0-5-2"
       width="75.406166"
       height="23.143593"
       x="94.855797"
       y="180.81372" />
    <rect
       style="fill:#d8dee9;stroke:none;stroke-width:2"
       id="rect3177-3-3-0-2-4"
       width="75.406166"
       height="23.143593"
       x="94.855797"
       y="157.67014" />
    <rect
       style="fill:#d8dee9;stroke:none;stroke-width:2"
       id="rect3177-3-3-0-4-6"
       width="75.406166"
       height="23.143593"
       x="94.855797"
       y="203.95731" />
    <rect
       style="fill:#eceff4;stroke:none;stroke-width:2"
       id="rect3177-3-3-0-9-0-4"
       width="75.406166"
       height="23.143593"
       x="170.26198"
       y="134.52654" />
    <rect
       style="fill:#eceff4;stroke:#a3be8c;stroke-width:2"
       id="rect3177-3-3-0-9"
       width="75.406166"
       height="23.143593"
       x="19.449627"
       y="134.52654" />
    <rect
       style="fill:#eceff4;stroke:#bf616a;stroke-width:2"
       id="rect3177-3-3-0-59-1-0"
       width="75.406166"
       height="23.143593"
       x="245.66815"
       y="88.239326" />
    <rect
       style="fill:#a3be8c;stroke:none;stroke-width:2"
       id="rect3177-3-3-0-59-7"
       width="75.406166"
       height="23.143593"
       x="170.26198"
       y="111.38292" />
    <rect
       style="fill:#eceff4;stroke:#bf616a;stroke-width:2"
       id="rect3177-3-3-0-59-6-6"
       width="75.406166"
       height="23.143593"
       x="321.07431"
       y="88.239326" />
    <text
       xml:space="preserve"
       style="font-size:7.05556px;line-height:1.25;font-family:sans-serif;-inkscape-font-specification:'sans-serif, Normal';letter-spacing:0px;word-spacing:0px;stroke-width:0.264583"
       x="185.6391"
       y="102.44145"
       id="text3117"><tspan
         sodipodi:role="line"
         id="tspan3115"
         x="185.6391"
         y="102.44145"
         style="stroke-width:0.264583">C’est normal</tspan></text>
    <rect
       style="fill:#eceff4;stroke:#a3be8c;stroke-width:2"
       id="rect3177-3-3-0"
       width="75.406166"
       height="23.143593"
       x="19.449619"
       y="111.38292" />
    <text
       xml:space="preserve"
       style="font-size:7.05556px;line-height:1.25;font-family:sans-serif;-inkscape-font-specification:'sans-serif, Normal';letter-spacing:0px;word-spacing:0px;stroke-width:0.264583"
       x="25.251711"
       y="124.9012"
       id="text3113-8"><tspan
         sodipodi:role="line"
         id="tspan3111-6"
         x="25.251711"
         y="124.9012"
         style="stroke-width:0.264583">Ca me plait</tspan></text>
    <rect
       style="fill:#eceff4;stroke:none;stroke-width:2"
       id="rect3177-3-3-0-5-2-7"
       width="75.406166"
       height="23.143593"
       x="170.26198"
       y="180.81372" />
    <rect
       style="fill:#eceff4;stroke:#a3be8c;stroke-width:2"
       id="rect3177-3-3-0-2"
       width="75.406166"
       height="23.143593"
       x="19.449629"
       y="157.67014" />
    <text
       xml:space="preserve"
       style="font-size:7.05556px;line-height:1.25;font-family:sans-serif;-inkscape-font-specification:'sans-serif, Normal';letter-spacing:0px;word-spacing:0px;stroke-width:0.264583"
       x="25.251711"
       y="148.72867"
       id="text3117-0"><tspan
         sodipodi:role="line"
         id="tspan3115-4"
         x="25.251711"
         y="148.72867"
         style="stroke-width:0.264583">C’est normal</tspan></text>
    <rect
       style="fill:#eceff4;stroke:none;stroke-width:2"
       id="rect3177-3-3-0-2-4-5"
       width="75.406166"
       height="23.143593"
       x="170.26198"
       y="157.67014" />
    <rect
       style="fill:#eceff4;stroke:#a3be8c;stroke-width:2"
       id="rect3177-3-3-0-5"
       width="75.406166"
       height="23.143593"
       x="19.449629"
       y="180.81372" />
    <text
       xml:space="preserve"
       style="font-size:7.05556px;line-height:1.25;font-family:sans-serif;-inkscape-font-specification:'sans-serif, Normal';letter-spacing:0px;word-spacing:0px;stroke-width:0.264583"
       x="25.251711"
       y="171.32967"
       id="text3121-8"><tspan
         sodipodi:role="line"
         id="tspan3119-8"
         x="25.251711"
         y="171.32967"
         style="stroke-width:0.264583">Ca m’est égal</tspan></text>
    <rect
       style="fill:#d8dee9;stroke:none;stroke-width:2"
       id="rect3177-3-3-0-4-6-4"
       width="75.406166"
       height="23.143593"
       x="170.26198"
       y="203.95731" />
    <rect
       style="fill:#eceff4;stroke:#a3be8c;stroke-width:2"
       id="rect3177-3-3-0-4"
       width="75.406166"
       height="23.143593"
       x="19.449629"
       y="203.95731" />
    <text
       xml:space="preserve"
       style="font-size:7.05556px;line-height:1.25;font-family:sans-serif;-inkscape-font-specification:'sans-serif, Normal';letter-spacing:0px;word-spacing:0px;stroke-width:0.264583"
       x="26.013077"
       y="194.25104"
       id="text3125-8"><tspan
         sodipodi:role="line"
         id="tspan3123-9"
         x="26.013077"
         y="194.25104"
         style="stroke-width:0.264583">Je m’en contente</tspan></text>
    <text
       xml:space="preserve"
       style="font-size:7.05556px;line-height:1.25;font-family:sans-serif;-inkscape-font-specification:'sans-serif, Normal';letter-spacing:0px;word-spacing:0px;stroke-width:0.264583"
       x="25.251711"
       y="217.61684"
       id="text3129-7"><tspan
         sodipodi:role="line"
         id="tspan3127-7"
         x="25.251711"
         y="217.61684"
         style="stroke-width:0.264583">Ca me déplait</tspan></text>
    <rect
       style="fill:#eceff4;stroke:#bf616a;stroke-width:2"
       id="rect3177-3-3-0-59-0-4"
       width="75.406166"
       height="23.143593"
       x="396.48047"
       y="88.239326" />
    <text
       xml:space="preserve"
       style="font-size:7.05556px;line-height:1.25;font-family:sans-serif;-inkscape-font-specification:'sans-serif, Normal';letter-spacing:0px;word-spacing:0px;stroke-width:0.264583"
       x="259.13498"
       y="101.89885"
       id="text3121"><tspan
         sodipodi:role="line"
         id="tspan3119"
         x="259.13498"
         y="101.89885"
         style="stroke-width:0.264583">Ca m’est égal</tspan></text>
    <text
       xml:space="preserve"
       style="font-size:7.05556px;line-height:1.25;font-family:sans-serif;-inkscape-font-specification:'sans-serif, Normal';letter-spacing:0px;word-spacing:0px;stroke-width:0.264583"
       x="329.0531"
       y="101.67664"
       id="text3125"><tspan
         sodipodi:role="line"
         id="tspan3123"
         x="329.0531"
         y="101.67664"
         style="stroke-width:0.264583">Je m’en contente</tspan></text>
    <text
       xml:space="preserve"
       style="font-size:7.05556px;line-height:1.25;font-family:sans-serif;-inkscape-font-specification:'sans-serif, Normal';letter-spacing:0px;word-spacing:0px;stroke-width:0.264583"
       x="409.44086"
       y="101.89885"
       id="text3129"><tspan
         sodipodi:role="line"
         id="tspan3127"
         x="409.44086"
         y="101.89885"
         style="stroke-width:0.264583">Ca me déplait</tspan></text>
    <text
       xml:space="preserve"
       style="font-size:7.05556px;line-height:1.25;font-family:sans-serif;-inkscape-font-specification:'sans-serif, Normal';letter-spacing:0px;word-spacing:0px;stroke-width:0.264583"
       x="120.48553"
       y="125.04244"
       id="text3175"><tspan
         sodipodi:role="line"
         x="120.48553"
         y="125.04244"
         style="stroke-width:0.264583"
         id="tspan3233">Risqué</tspan></text>
    <text
       xml:space="preserve"
       style="font-size:7.05556px;line-height:1.25;font-family:sans-serif;-inkscape-font-specification:'sans-serif, Normal';letter-spacing:0px;word-spacing:0px;stroke-width:0.264583"
       x="191.99704"
       y="125.58504"
       id="text3229"><tspan
         sodipodi:role="line"
         x="191.99704"
         y="125.58504"
         style="stroke-width:0.264583"
         id="tspan3231">Attractifs</tspan></text>
    <text
       xml:space="preserve"
       style="font-size:7.05556px;line-height:1.25;font-family:sans-serif;-inkscape-font-specification:'sans-serif, Normal';letter-spacing:0px;word-spacing:0px;stroke-width:0.264583"
       x="189.44421"
       y="148.86992"
       id="text3241"><tspan
         sodipodi:role="line"
         id="tspan3239"
         x="189.44421"
         y="148.86992"
         style="stroke-width:0.264583">Indifférent</tspan></text>
    <text
       xml:space="preserve"
       style="font-size:7.05556px;line-height:1.25;font-family:sans-serif;-inkscape-font-specification:'sans-serif, Normal';letter-spacing:0px;word-spacing:0px;stroke-width:0.264583"
       x="107.47168"
       y="148.72867"
       id="text3245"><tspan
         sodipodi:role="line"
         id="tspan3243"
         x="107.47168"
         y="148.72867"
         style="stroke-width:0.264583">Contradictoire</tspan></text>
    <rect
       style="fill:#eceff4;stroke:none;stroke-width:2"
       id="rect3177-3-3-0-9-0-8"
       width="75.406166"
       height="23.143593"
       x="245.66815"
       y="134.52654" />
    <rect
       style="fill:#a3be8c;stroke:none;stroke-width:2"
       id="rect3177-3-3-0-59-1"
       width="75.406166"
       height="23.143593"
       x="245.66815"
       y="111.38292" />
    <rect
       style="fill:#eceff4;stroke:none;stroke-width:2"
       id="rect3177-3-3-0-5-2-2"
       width="75.406166"
       height="23.143593"
       x="245.66815"
       y="180.81372" />
    <rect
       style="fill:#eceff4;stroke:none;stroke-width:2"
       id="rect3177-3-3-0-2-4-8"
       width="75.406166"
       height="23.143593"
       x="245.66815"
       y="157.67014" />
    <rect
       style="fill:#d8dee9;stroke:none;stroke-width:2"
       id="rect3177-3-3-0-4-6-9"
       width="75.406166"
       height="23.143593"
       x="245.66815"
       y="203.95731" />
    <rect
       style="fill:#eceff4;stroke:none;stroke-width:2"
       id="rect3177-3-3-0-9-0-3"
       width="75.406166"
       height="23.143593"
       x="321.07431"
       y="134.52654" />
    <rect
       style="fill:#a3be8c;stroke:none;stroke-width:2"
       id="rect3177-3-3-0-59-6"
       width="75.406166"
       height="23.143593"
       x="321.07431"
       y="111.38292" />
    <rect
       style="fill:#eceff4;stroke:none;stroke-width:2"
       id="rect3177-3-3-0-5-2-8"
       width="75.406166"
       height="23.143593"
       x="321.07431"
       y="180.81372" />
    <rect
       style="fill:#eceff4;stroke:none;stroke-width:2"
       id="rect3177-3-3-0-2-4-0"
       width="75.406166"
       height="23.143593"
       x="321.07431"
       y="157.67014" />
    <rect
       style="fill:#d8dee9;stroke:none;stroke-width:2"
       id="rect3177-3-3-0-4-6-2"
       width="75.406166"
       height="23.143593"
       x="321.07431"
       y="203.95731" />
    <rect
       style="fill:#bf616a;stroke:none;stroke-width:2"
       id="rect3177-3-3-0-9-0-1"
       width="75.406166"
       height="23.143593"
       x="396.48047"
       y="134.52654" />
    <rect
       style="fill:#5e81ac;stroke:none;stroke-width:2"
       id="rect3177-3-3-0-59-0"
       width="75.406166"
       height="23.143593"
       x="396.48047"
       y="111.38292" />
    <rect
       style="fill:#bf616a;stroke:none;stroke-width:2"
       id="rect3177-3-3-0-5-2-5"
       width="75.406166"
       height="23.143593"
       x="396.48047"
       y="180.81372" />
    <rect
       style="fill:#bf616a;stroke:none;stroke-width:2"
       id="rect3177-3-3-0-2-4-1"
       width="75.406166"
       height="23.143593"
       x="396.48047"
       y="157.67014" />
    <rect
       style="fill:#ebcb8b;stroke:none;stroke-width:2"
       id="rect3177-3-3-0-4-6-1"
       width="75.406166"
       height="23.143593"
       x="396.48047"
       y="203.95731" />
    <text
       xml:space="preserve"
       style="font-size:7.05556px;line-height:1.25;font-family:sans-serif;-inkscape-font-specification:'sans-serif, Normal';letter-spacing:0px;word-spacing:0px;stroke-width:0.264583"
       x="107.47168"
       y="171.87227"
       id="text3245-5"><tspan
         sodipodi:role="line"
         id="tspan3243-8"
         x="107.47168"
         y="171.87227"
         style="stroke-width:0.264583">Contradictoire</tspan></text>
    <text
       xml:space="preserve"
       style="font-size:7.05556px;line-height:1.25;font-family:sans-serif;-inkscape-font-specification:'sans-serif, Normal';letter-spacing:0px;word-spacing:0px;stroke-width:0.264583"
       x="107.47168"
       y="195.01585"
       id="text3245-6"><tspan
         sodipodi:role="line"
         id="tspan3243-2"
         x="107.47168"
         y="195.01585"
         style="stroke-width:0.264583">Contradictoire</tspan></text>
    <text
       xml:space="preserve"
       style="font-size:7.05556px;line-height:1.25;font-family:sans-serif;-inkscape-font-specification:'sans-serif, Normal';letter-spacing:0px;word-spacing:0px;stroke-width:0.264583"
       x="107.47168"
       y="218.15944"
       id="text3245-8"><tspan
         sodipodi:role="line"
         id="tspan3243-4"
         x="107.47168"
         y="218.15944"
         style="stroke-width:0.264583">Contradictoire</tspan></text>
    <text
       xml:space="preserve"
       style="font-size:7.05556px;line-height:1.25;font-family:sans-serif;-inkscape-font-specification:'sans-serif, Normal';letter-spacing:0px;word-spacing:0px;fill:#eceff4;stroke-width:0.264583"
       x="412.87735"
       y="148.04482"
       id="text3508"><tspan
         sodipodi:role="line"
         id="tspan3506"
         x="412.87735"
         y="148.04482"
         style="fill:#eceff4;stroke-width:0.264583">Obligatoires</tspan></text>
    <text
       xml:space="preserve"
       style="font-size:7.05556px;line-height:1.25;font-family:sans-serif;-inkscape-font-specification:'sans-serif, Normal';letter-spacing:0px;word-spacing:0px;fill:#eceff4;stroke-width:0.264583"
       x="412.87735"
       y="171.18842"
       id="text3512"><tspan
         sodipodi:role="line"
         id="tspan3510"
         x="412.87735"
         y="171.18842"
         style="fill:#eceff4;stroke-width:0.264583">Obligatoires</tspan></text>
    <text
       xml:space="preserve"
       style="font-size:7.05556px;line-height:1.25;font-family:sans-serif;-inkscape-font-specification:'sans-serif, Normal';letter-spacing:0px;word-spacing:0px;fill:#eceff4;stroke-width:0.264583"
       x="412.87735"
       y="194.332"
       id="text3516"><tspan
         sodipodi:role="line"
         id="tspan3514"
         x="412.87735"
         y="194.332"
         style="fill:#eceff4;stroke-width:0.264583">Obligatoires</tspan></text>
    <text
       xml:space="preserve"
       style="font-size:7.05556px;line-height:1.25;font-family:sans-serif;-inkscape-font-specification:'sans-serif, Normal';letter-spacing:0px;word-spacing:0px;stroke-width:0.264583"
       x="422.1102"
       y="217.61684"
       id="text3520"><tspan
         sodipodi:role="line"
         id="tspan3518"
         x="422.1102"
         y="217.61684"
         style="stroke-width:0.264583">Risqué</tspan></text>
    <text
       xml:space="preserve"
       style="font-size:7.05556px;line-height:1.25;font-family:sans-serif;-inkscape-font-specification:'sans-serif, Normal';letter-spacing:0px;word-spacing:0px;stroke-width:0.264583"
       x="264.8504"
       y="148.86992"
       id="text3241-7"><tspan
         sodipodi:role="line"
         id="tspan3239-2"
         x="264.8504"
         y="148.86992"
         style="stroke-width:0.264583">Indifférent</tspan></text>
    <text
       xml:space="preserve"
       style="font-size:7.05556px;line-height:1.25;font-family:sans-serif;-inkscape-font-specification:'sans-serif, Normal';letter-spacing:0px;word-spacing:0px;stroke-width:0.264583"
       x="340.25656"
       y="148.86992"
       id="text3241-4"><tspan
         sodipodi:role="line"
         id="tspan3239-0"
         x="340.25656"
         y="148.86992"
         style="stroke-width:0.264583">Indifférent</tspan></text>
    <text
       xml:space="preserve"
       style="font-size:7.05556px;line-height:1.25;font-family:sans-serif;-inkscape-font-specification:'sans-serif, Normal';letter-spacing:0px;word-spacing:0px;stroke-width:0.264583"
       x="340.25656"
       y="172.01352"
       id="text3241-6"><tspan
         sodipodi:role="line"
         id="tspan3239-29"
         x="340.25656"
         y="172.01352"
         style="stroke-width:0.264583">Indifférent</tspan></text>
    <text
       xml:space="preserve"
       style="font-size:7.05556px;line-height:1.25;font-family:sans-serif;-inkscape-font-specification:'sans-serif, Normal';letter-spacing:0px;word-spacing:0px;stroke-width:0.264583"
       x="340.25656"
       y="195.1571"
       id="text3241-9"><tspan
         sodipodi:role="line"
         id="tspan3239-08"
         x="340.25656"
         y="195.1571"
         style="stroke-width:0.264583">Indifférent</tspan></text>
    <text
       xml:space="preserve"
       style="font-size:7.05556px;line-height:1.25;font-family:sans-serif;-inkscape-font-specification:'sans-serif, Normal';letter-spacing:0px;word-spacing:0px;stroke-width:0.264583"
       x="264.8504"
       y="195.1571"
       id="text3241-1"><tspan
         sodipodi:role="line"
         id="tspan3239-3"
         x="264.8504"
         y="195.1571"
         style="stroke-width:0.264583">Indifférent</tspan></text>
    <text
       xml:space="preserve"
       style="font-size:7.05556px;line-height:1.25;font-family:sans-serif;-inkscape-font-specification:'sans-serif, Normal';letter-spacing:0px;word-spacing:0px;stroke-width:0.264583"
       x="264.8504"
       y="172.01352"
       id="text3241-11"><tspan
         sodipodi:role="line"
         id="tspan3239-03"
         x="264.8504"
         y="172.01352"
         style="stroke-width:0.264583">Indifférent</tspan></text>
    <text
       xml:space="preserve"
       style="font-size:7.05556px;line-height:1.25;font-family:sans-serif;-inkscape-font-specification:'sans-serif, Normal';letter-spacing:0px;word-spacing:0px;stroke-width:0.264583"
       x="189.44421"
       y="172.01352"
       id="text3241-40"><tspan
         sodipodi:role="line"
         id="tspan3239-39"
         x="189.44421"
         y="172.01352"
         style="stroke-width:0.264583">Indifférent</tspan></text>
    <text
       xml:space="preserve"
       style="font-size:7.05556px;line-height:1.25;font-family:sans-serif;-inkscape-font-specification:'sans-serif, Normal';letter-spacing:0px;word-spacing:0px;stroke-width:0.264583"
       x="189.44421"
       y="195.1571"
       id="text3241-19"><tspan
         sodipodi:role="line"
         id="tspan3239-6"
         x="189.44421"
         y="195.1571"
         style="stroke-width:0.264583">Indifférent</tspan></text>
    <text
       xml:space="preserve"
       style="font-size:7.05556px;line-height:1.25;font-family:sans-serif;-inkscape-font-specification:'sans-serif, Normal';letter-spacing:0px;word-spacing:0px;stroke-width:0.264583"
       x="182.87785"
       y="218.15944"
       id="text3245-8-9"><tspan
         sodipodi:role="line"
         id="tspan3243-4-3"
         x="182.87785"
         y="218.15944"
         style="stroke-width:0.264583">Contradictoire</tspan></text>
    <text
       xml:space="preserve"
       style="font-size:7.05556px;line-height:1.25;font-family:sans-serif;-inkscape-font-specification:'sans-serif, Normal';letter-spacing:0px;word-spacing:0px;stroke-width:0.264583"
       x="258.28403"
       y="218.15944"
       id="text3245-8-3"><tspan
         sodipodi:role="line"
         id="tspan3243-4-8"
         x="258.28403"
         y="218.15944"
         style="stroke-width:0.264583">Contradictoire</tspan></text>
    <text
       xml:space="preserve"
       style="font-size:7.05556px;line-height:1.25;font-family:sans-serif;-inkscape-font-specification:'sans-serif, Normal';letter-spacing:0px;word-spacing:0px;stroke-width:0.264583"
       x="333.69019"
       y="218.15944"
       id="text3245-8-0"><tspan
         sodipodi:role="line"
         id="tspan3243-4-5"
         x="333.69019"
         y="218.15944"
         style="stroke-width:0.264583">Contradictoire</tspan></text>
    <text
       xml:space="preserve"
       style="font-size:7.05556px;line-height:1.25;font-family:sans-serif;-inkscape-font-specification:'sans-serif, Normal';letter-spacing:0px;word-spacing:0px;stroke-width:0.264583"
       x="267.4032"
       y="125.58504"
       id="text3229-6"><tspan
         sodipodi:role="line"
         x="267.4032"
         y="125.58504"
         style="stroke-width:0.264583"
         id="tspan3231-6">Attractifs</tspan></text>
    <text
       xml:space="preserve"
       style="font-size:7.05556px;line-height:1.25;font-family:sans-serif;-inkscape-font-specification:'sans-serif, Normal';letter-spacing:0px;word-spacing:0px;stroke-width:0.264583"
       x="342.80936"
       y="125.58504"
       id="text3229-4"><tspan
         sodipodi:role="line"
         x="342.80936"
         y="125.58504"
         style="stroke-width:0.264583"
         id="tspan3231-0">Attractifs</tspan></text>
    <text
       xml:space="preserve"
       style="font-size:7.05556px;line-height:1.25;font-family:sans-serif;-inkscape-font-specification:'sans-serif, Normal';letter-spacing:0px;word-spacing:0px;fill:#eceff4;stroke-width:0.264583"
       x="410.57947"
       y="124.9012"
       id="text3668"><tspan
         sodipodi:role="line"
         id="tspan3666"
         x="410.57947"
         y="124.9012"
         style="fill:#eceff4;stroke-width:0.264583">Proportionnel</tspan></text>
  </g>
</svg>
