module legacy-testing-kata-go

go 1.17

require (
	github.com/gen2brain/dlgs v0.0.0-20211108104213-bade24837f0b // indirect
	github.com/gopherjs/gopherjs v0.0.0-20211111143520-d0d5ecc1a356 // indirect
)
