<?xml version="1.0" encoding="UTF-8" standalone="no"?>
<svg
   xmlns:dc="http://purl.org/dc/elements/1.1/"
   xmlns:cc="http://creativecommons.org/ns#"
   xmlns:rdf="http://www.w3.org/1999/02/22-rdf-syntax-ns#"
   xmlns:svg="http://www.w3.org/2000/svg"
   xmlns="http://www.w3.org/2000/svg"
   xmlns:sodipodi="http://sodipodi.sourceforge.net/DTD/sodipodi-0.dtd"
   xmlns:inkscape="http://www.inkscape.org/namespaces/inkscape"
   id="Ebene_1"
   xml:space="preserve"
   height="339.07553"
   viewBox="0 0 295.87332 339.07553"
   width="295.87332"
   version="1.1"
   y="0px"
   x="0px"
   enable-background="new 0 0 506.25 431.25"
   inkscape:version="0.91 r13725"
   sodipodi:docname="Flip-Flops-4.svg"><metadata
     id="metadata113"><rdf:RDF><cc:Work
         rdf:about=""><dc:format>image/svg+xml</dc:format><dc:type
           rdf:resource="http://purl.org/dc/dcmitype/StillImage" /><dc:title></dc:title></cc:Work></rdf:RDF></metadata><defs
     id="defs111" /><sodipodi:namedview
     pagecolor="#ffffff"
     bordercolor="#666666"
     borderopacity="1"
     objecttolerance="10"
     gridtolerance="10"
     guidetolerance="10"
     inkscape:pageopacity="0"
     inkscape:pageshadow="2"
     inkscape:window-width="3840"
     inkscape:window-height="2031"
     id="namedview109"
     showgrid="false"
     fit-margin-top="0"
     fit-margin-left="0"
     fit-margin-right="0"
     fit-margin-bottom="0"
     inkscape:zoom="0.54724638"
     inkscape:cx="-389.3002"
     inkscape:cy="199.20071"
     inkscape:window-x="0"
     inkscape:window-y="55"
     inkscape:window-maximized="1"
     inkscape:current-layer="Ebene_1" /><g
     id="g3"
     style="clip-rule:evenodd;fill-rule:evenodd"
     transform="translate(-105.19003,-75.750165)"><path
       d="m 208.99,311.83 c 0,0 -4.311,-56.723 19.749,-99.452 24.171,-42.729 14.837,-106.76 4.787,-119.56 -7.417,-9.456 -10.413,-11.252 -36.263,-13.047 -25.969,-1.796 -51.7,9.098 -64.388,25.017 -12.683,16.034 -24.174,57.562 -23.215,94.302 0.84,36.63 2.155,31.479 2.988,40.692 0.84,9.219 2.52,33.867 0.243,67.98 -2.274,33.99 -2.391,63.904 -2.391,63.904 0,0 -2.158,32.197 48.346,33.156 50.624,1.076 47.629,-26.689 47.629,-26.689 l 2.51,-66.3 z"
       id="path5"
       inkscape:connector-curvature="0"
       style="fill:#7a990c" /><path
       d="m 204.68,308 c 0,0 -4.429,-56.725 19.75,-99.451 24.06,-42.727 14.842,-106.76 4.665,-119.56 -7.417,-9.453 -10.289,-11.25 -36.26,-13.044 -25.844,-1.794 -51.7,8.978 -64.26,25.011 -12.687,16.039 -24.178,57.569 -23.342,94.308 0.96,36.622 2.274,31.479 3.111,40.692 0.84,9.221 2.513,33.867 0.242,67.98 -2.394,33.986 -2.394,63.908 -2.394,63.908 0,0 -2.155,32.193 48.346,33.152 50.505,1.076 47.637,-26.691 47.637,-26.691 l 2.49,-66.31 z"
       id="path7"
       inkscape:connector-curvature="0"
       style="fill:#0ccc98" /><path
       d="m 156.33,98.442 c 15.316,-1.197 28.723,10.173 30.042,25.492 1.195,15.08 -10.177,28.601 -25.497,29.798 -15.196,1.197 -28.717,-10.171 -29.916,-25.37 -1.31,-15.2 10.18,-28.723 25.38,-29.918 z"
       id="path9"
       inkscape:connector-curvature="0"
       style="fill:#00ff0d" /><path
       d="m 157.41,111.01 c 8.38,-0.718 15.678,5.624 16.391,13.883 0.718,8.258 -5.627,15.679 -13.878,16.276 -8.376,0.717 -15.794,-5.503 -16.515,-13.765 -0.59,-8.37 5.63,-15.67 14.01,-16.39 z"
       id="path11"
       inkscape:connector-curvature="0"
       style="fill:#0cb3cc" /><path
       d="m 183.38,169.17 c 15.319,-1.313 28.723,10.175 29.918,25.372 1.314,15.32 -10.169,28.728 -25.371,30.038 -15.32,1.202 -28.724,-10.172 -30.039,-25.492 -1.2,-15.32 10.28,-28.72 25.49,-29.92 z"
       id="path13"
       inkscape:connector-curvature="0"
       style="fill:#00ff0d" /><path
       d="m 184.45,181.62 c 8.262,-0.603 15.683,5.623 16.399,14 0.599,8.38 -5.627,15.682 -14.001,16.395 -8.377,0.725 -15.682,-5.621 -16.399,-13.882 -0.72,-8.38 5.63,-15.8 14,-16.52 z"
       id="path15"
       inkscape:connector-curvature="0"
       style="fill:#0cb3cc" /><path
       d="m 168.9,333.74 c 15.316,-1.322 28.723,10.166 30.035,25.365 1.202,15.32 -10.169,28.725 -25.485,30.043 -15.205,1.197 -28.729,-10.182 -29.923,-25.492 -1.33,-15.2 10.16,-28.72 25.36,-29.91 z"
       id="path17"
       inkscape:connector-curvature="0"
       style="fill:#00ff0d" /><path
       d="m 169.97,346.18 c 8.377,-0.596 15.679,5.623 16.399,14.004 0.713,8.381 -5.628,15.678 -13.886,16.398 -8.376,0.719 -15.797,-5.631 -16.511,-13.889 -0.6,-8.38 5.63,-15.79 14,-16.51 z"
       id="path19"
       inkscape:connector-curvature="0"
       style="fill:#0cb3cc" /><path
       d="m 130.12,158.16 c 8.619,-0.715 16.153,5.748 16.877,14.364 0.721,8.613 -5.744,16.277 -14.36,16.998 -8.616,0.713 -16.276,-5.752 -16.997,-14.362 -0.6,-8.62 5.87,-16.28 14.48,-17 z"
       id="path21"
       inkscape:connector-curvature="0"
       style="fill:#00ff0d" /><path
       d="m 130.6,165.22 c 4.78,-0.356 8.974,3.235 9.329,7.9 0.355,4.79 -3.107,8.974 -7.899,9.332 -4.665,0.363 -8.854,-3.228 -9.213,-7.899 -0.48,-4.78 3.11,-8.85 7.78,-9.33 z"
       id="path23"
       inkscape:connector-curvature="0"
       style="fill:#0cb3cc" /><path
       d="m 214.85,100.36 c 8.737,-0.718 16.272,5.744 16.99,14.362 0.721,8.618 -5.736,16.156 -14.359,16.873 -8.618,0.717 -16.272,-5.623 -16.993,-14.36 -0.72,-8.61 5.75,-16.16 14.36,-16.87 z"
       id="path25"
       inkscape:connector-curvature="0"
       style="fill:#00ff0d" /><path
       d="m 215.45,107.42 c 4.784,-0.355 8.975,3.111 9.33,7.899 0.365,4.668 -3.223,8.856 -7.891,9.213 -4.788,0.481 -8.856,-3.106 -9.338,-7.776 -0.36,-4.79 3.23,-8.97 7.9,-9.33 z"
       id="path27"
       inkscape:connector-curvature="0"
       style="fill:#0cb3cc" /><path
       d="m 140.29,222.55 c 8.623,-0.721 16.279,5.74 17,14.363 0.718,8.611 -5.863,16.275 -14.479,16.992 -8.62,0.715 -16.163,-5.746 -16.876,-14.359 -0.71,-8.74 5.75,-16.27 14.36,-16.99 z"
       id="path29"
       inkscape:connector-curvature="0"
       style="fill:#00ff0d" /><path
       d="m 140.89,229.61 c 4.668,-0.363 8.858,3.227 9.21,7.898 0.485,4.787 -3.104,8.852 -7.769,9.332 -4.788,0.359 -8.979,-3.23 -9.34,-7.902 -0.35,-4.78 3.11,-8.97 7.9,-9.33 z"
       id="path31"
       inkscape:connector-curvature="0"
       style="fill:#0cb3cc" /><path
       d="m 156.09,273.06 c 8.613,-0.602 16.153,5.855 16.867,14.482 0.721,8.613 -5.741,16.148 -14.353,16.869 -8.616,0.719 -16.275,-5.744 -16.992,-14.361 -0.73,-8.61 5.85,-16.27 14.47,-16.99 z"
       id="path33"
       inkscape:connector-curvature="0"
       style="fill:#00ff0d" /><path
       d="m 156.57,280.24 c 4.789,-0.484 8.975,3.105 9.337,7.773 0.359,4.785 -3.114,8.98 -7.898,9.336 -4.669,0.357 -8.859,-3.111 -9.214,-7.9 -0.49,-4.67 3.1,-8.86 7.77,-9.21 z"
       id="path35"
       inkscape:connector-curvature="0"
       style="fill:#0cb3cc" /><path
       d="m 128.68,314.7 c 8.616,-0.596 16.153,5.865 16.874,14.477 0.713,8.619 -5.741,16.16 -14.36,16.881 -8.616,0.721 -16.273,-5.748 -16.993,-14.367 -0.6,-8.61 5.87,-16.27 14.48,-16.99 z"
       id="path37"
       inkscape:connector-curvature="0"
       style="fill:#00ff0d" /><path
       d="m 129.28,321.88 c 4.668,-0.477 8.858,3.111 9.217,7.9 0.358,4.66 -3.111,8.855 -7.892,9.209 -4.672,0.367 -8.859,-3.104 -9.217,-7.895 -0.49,-4.66 3.1,-8.86 7.89,-9.22 z"
       id="path39"
       inkscape:connector-curvature="0"
       style="fill:#0cb3cc" /><path
       d="m 182.42,241.1 c 8.62,-0.725 16.16,5.74 16.874,14.357 0.721,8.619 -5.741,16.275 -14.359,16.877 -8.616,0.721 -16.272,-5.744 -16.993,-14.365 -0.6,-8.62 5.86,-16.29 14.48,-16.88 z"
       id="path41"
       inkscape:connector-curvature="0"
       style="fill:#00ff0d" /><path
       d="m 183.02,248.16 c 4.667,-0.355 8.852,3.115 9.213,7.896 0.355,4.67 -3.114,8.863 -7.898,9.215 -4.669,0.359 -8.856,-3.104 -9.217,-7.898 -0.47,-4.67 3.12,-8.86 7.91,-9.22 z"
       id="path43"
       inkscape:connector-curvature="0"
       style="fill:#0cb3cc" /><path
       d="m 220.23,212.5 c -0.358,-7.657 -4.426,34.229 -8.613,44.756 -2.513,6.467 -11.01,15.562 -11.01,15.686 l -15.681,16.275 c 0,0 -12.445,12.924 -8.854,19.99 3.472,6.932 7.18,6.213 11.969,4.549 3.948,-1.445 5.144,-3.836 16.874,-16.758 12.564,-13.762 17.352,-45.598 17.352,-45.598 l -2.04,-38.9 z"
       id="path45"
       inkscape:connector-curvature="0"
       style="fill:#696917" /><path
       d="m 116.84,218.72 c 0,0 -1.797,34.707 4.907,44.404 6.581,9.691 11.125,24.654 11.369,28.361 0.123,3.713 0.358,11.246 -6.584,10.652 -6.943,-0.598 -10.648,-16.395 -11.85,-20.465 0,0 -4.303,-25.014 -3.344,-29.201 -1.34,-6.82 5.49,-33.74 5.49,-33.74 z"
       id="path47"
       inkscape:connector-curvature="0"
       style="fill:#696917" /><path
       d="M 220.23,262.29 C 255.415,149.43 197.856,126.93 197.856,126.93 l -4.191,23.336 c 0,-0.01 33.03,46.43 26.56,112.02 z"
       id="path49"
       inkscape:connector-curvature="0"
       style="fill:#999833" /><path
       d="m 111.21,250.56 c 0,0 -2.513,-56.491 20.467,-78.153 38.773,-42.607 66.417,-45.478 66.417,-45.478 l -4.066,23.218 c 0,-0.01 -80.18,39.37 -82.82,100.41 z"
       id="path51"
       inkscape:connector-curvature="0"
       style="fill:#999833" /><path
       d="m 209.11,77.493 c 0.479,1.317 0.837,2.758 0.957,4.31 0.721,8.62 -5.745,16.279 -14.483,16.877 -8.616,0.719 -16.153,-5.744 -16.874,-14.362 -0.236,-2.992 0.363,-5.744 1.561,-8.258 4.183,-0.356 8.377,-0.356 12.56,-0.119 6.82,0.48 12.08,0.957 16.27,1.552 z"
       id="path53"
       inkscape:connector-curvature="0"
       style="fill:#00ff0d" /><path
       d="m 199.9,76.421 c 1.669,1.435 2.868,3.589 3.107,5.984 0.363,4.667 -3.23,8.856 -7.895,9.211 -4.789,0.36 -8.974,-3.108 -9.337,-7.896 -0.239,-3.232 1.434,-6.228 3.947,-7.899 1.076,0 2.156,0 3.111,0.12 2.62,0.12 4.9,0.36 7.06,0.48 z"
       id="path55"
       inkscape:connector-curvature="0"
       style="fill:#0cb3cc" /><path
       d="m 297.27,321.8 c 0,0 4.307,-56.723 -19.744,-99.447 -24.175,-42.728 -14.839,-106.76 -4.789,-119.56 7.418,-9.455 10.413,-11.249 36.261,-13.046 25.965,-1.794 51.703,9.097 64.384,25.015 12.687,16.035 24.175,57.57 23.222,94.31 -0.841,36.618 -2.158,31.472 -2.995,40.687 -0.84,9.217 -2.513,33.873 -0.236,67.982 2.271,33.988 2.391,63.904 2.391,63.904 0,0 2.159,32.193 -48.35,33.15 -50.62,1.08 -47.632,-26.686 -47.632,-26.686 l -2.5,-66.3 z"
       id="path57"
       inkscape:connector-curvature="0"
       style="fill:#7a990c" /><path
       d="m 301.57,317.97 c 0,0 4.426,-56.73 -19.741,-99.449 -24.063,-42.729 -14.846,-106.76 -4.668,-119.57 7.421,-9.452 10.289,-11.25 36.261,-13.044 25.848,-1.794 51.698,8.979 64.263,25.014 12.684,16.039 24.175,57.566 23.335,94.312 -0.954,36.615 -2.274,31.473 -3.104,40.684 -0.844,9.221 -2.517,33.873 -0.243,67.982 2.394,33.988 2.394,63.912 2.394,63.912 0,0 2.152,32.188 -48.346,33.148 -50.505,1.074 -47.635,-26.689 -47.635,-26.689 l -2.51,-66.29 z"
       id="path59"
       inkscape:connector-curvature="0"
       style="fill:#0ccc98" /><path
       d="m 349.93,108.41 c -15.323,-1.197 -28.724,10.173 -30.043,25.495 -1.198,15.078 10.171,28.599 25.494,29.8 15.197,1.192 28.721,-10.175 29.919,-25.374 1.31,-15.2 -10.18,-28.72 -25.37,-29.92 z"
       id="path61"
       inkscape:connector-curvature="0"
       style="fill:#00ff0d" /><path
       d="m 348.85,120.98 c -8.377,-0.721 -15.676,5.623 -16.396,13.88 -0.713,8.259 5.629,15.68 13.887,16.278 8.376,0.715 15.793,-5.506 16.514,-13.763 0.6,-8.38 -5.62,-15.68 -14,-16.4 z"
       id="path63"
       inkscape:connector-curvature="0"
       style="fill:#0cb3cc" /><path
       d="m 322.88,179.14 c -15.319,-1.32 -28.723,10.169 -29.923,25.373 -1.321,15.32 10.174,28.721 25.374,30.039 15.32,1.195 28.72,-10.174 30.039,-25.489 1.2,-15.32 -10.29,-28.72 -25.49,-29.92 z"
       id="path65"
       inkscape:connector-curvature="0"
       style="fill:#00ff0d" /><path
       d="m 321.81,191.59 c -8.261,-0.597 -15.688,5.624 -16.399,14.001 -0.599,8.377 5.624,15.678 14.001,16.396 8.378,0.716 15.679,-5.626 16.393,-13.879 0.72,-8.39 -5.62,-15.8 -13.99,-16.52 z"
       id="path67"
       inkscape:connector-curvature="0"
       style="fill:#0cb3cc" /><path
       d="m 337.36,343.7 c -15.319,-1.318 -28.724,10.17 -30.038,25.369 -1.205,15.318 10.169,28.721 25.489,30.035 15.204,1.207 28.724,-10.17 29.919,-25.49 1.32,-15.19 -10.17,-28.71 -25.37,-29.91 z"
       id="path69"
       inkscape:connector-curvature="0"
       style="fill:#00ff0d" /><path
       d="m 336.29,356.15 c -8.382,-0.6 -15.684,5.629 -16.401,14.002 -0.713,8.385 5.629,15.678 13.887,16.398 8.37,0.719 15.795,-5.627 16.511,-13.889 0.59,-8.37 -5.63,-15.79 -14,-16.51 z"
       id="path71"
       inkscape:connector-curvature="0"
       style="fill:#0cb3cc" /><path
       d="m 376.14,168.13 c -8.619,-0.718 -16.159,5.746 -16.877,14.365 -0.721,8.616 5.741,16.272 14.359,16.993 8.616,0.717 16.277,-5.745 16.993,-14.368 0.6,-8.61 -5.86,-16.27 -14.47,-16.99 z"
       id="path73"
       inkscape:connector-curvature="0"
       style="fill:#00ff0d" /><path
       d="m 375.65,175.19 c -4.784,-0.355 -8.975,3.238 -9.33,7.901 -0.365,4.784 3.107,8.977 7.896,9.336 4.668,0.358 8.854,-3.235 9.218,-7.899 0.47,-4.79 -3.12,-8.86 -7.79,-9.34 z"
       id="path75"
       inkscape:connector-curvature="0"
       style="fill:#0cb3cc" /><path
       d="m 291.4,110.33 c -8.735,-0.719 -16.275,5.744 -16.988,14.362 -0.718,8.618 5.74,16.156 14.356,16.874 8.619,0.717 16.279,-5.621 16.996,-14.359 0.71,-8.62 -5.75,-16.16 -14.37,-16.87 z"
       id="path77"
       inkscape:connector-curvature="0"
       style="fill:#00ff0d" /><path
       d="m 290.81,117.39 c -4.791,-0.358 -8.974,3.11 -9.34,7.898 -0.354,4.666 3.233,8.854 7.903,9.213 4.788,0.479 8.854,-3.109 9.329,-7.776 0.36,-4.78 -3.23,-8.97 -7.89,-9.33 z"
       id="path79"
       inkscape:connector-curvature="0"
       style="fill:#0cb3cc" /><path
       d="m 365.96,232.52 c -8.613,-0.721 -16.272,5.74 -16.99,14.355 -0.716,8.615 5.864,16.283 14.48,16.998 8.611,0.717 16.156,-5.74 16.872,-14.363 0.72,-8.74 -5.75,-16.28 -14.36,-17 z"
       id="path81"
       inkscape:connector-curvature="0"
       style="fill:#00ff0d" /><path
       d="m 365.36,239.58 c -4.666,-0.355 -8.859,3.238 -9.215,7.902 -0.478,4.781 3.111,8.859 7.773,9.334 4.787,0.361 8.977,-3.23 9.337,-7.896 0.37,-4.78 -3.1,-8.97 -7.89,-9.33 z"
       id="path83"
       inkscape:connector-curvature="0"
       style="fill:#0cb3cc" /><path
       d="m 350.16,283.02 c -8.619,-0.596 -16.153,5.865 -16.874,14.482 -0.723,8.615 5.748,16.152 14.361,16.871 8.616,0.721 16.272,-5.746 16.993,-14.361 0.72,-8.61 -5.86,-16.27 -14.48,-16.99 z"
       id="path85"
       inkscape:connector-curvature="0"
       style="fill:#00ff0d" /><path
       d="m 349.69,290.2 c -4.784,-0.479 -8.976,3.115 -9.334,7.775 -0.357,4.789 3.114,8.982 7.9,9.338 4.66,0.354 8.854,-3.107 9.213,-7.898 0.48,-4.67 -3.11,-8.86 -7.78,-9.22 z"
       id="path87"
       inkscape:connector-curvature="0"
       style="fill:#0cb3cc" /><path
       d="m 377.57,324.67 c -8.613,-0.598 -16.161,5.867 -16.871,14.479 -0.72,8.619 5.742,16.16 14.357,16.883 8.619,0.715 16.275,-5.754 16.996,-14.365 0.59,-8.61 -5.87,-16.27 -14.49,-16.99 z"
       id="path89"
       inkscape:connector-curvature="0"
       style="fill:#00ff0d" /><path
       d="m 376.98,331.86 c -4.678,-0.479 -8.861,3.107 -9.223,7.898 -0.359,4.666 3.114,8.857 7.898,9.213 4.667,0.359 8.858,-3.105 9.217,-7.898 0.47,-4.67 -3.12,-8.86 -7.9,-9.21 z"
       id="path91"
       inkscape:connector-curvature="0"
       style="fill:#0cb3cc" /><path
       d="m 323.84,251.07 c -8.62,-0.713 -16.157,5.748 -16.878,14.363 -0.714,8.619 5.745,16.279 14.36,16.875 8.619,0.721 16.28,-5.742 16.996,-14.357 0.6,-8.61 -5.87,-16.27 -14.48,-16.87 z"
       id="path93"
       inkscape:connector-curvature="0"
       style="fill:#00ff0d" /><path
       d="m 323.24,258.14 c -4.669,-0.367 -8.852,3.104 -9.214,7.895 -0.358,4.668 3.114,8.855 7.899,9.217 4.668,0.354 8.854,-3.115 9.213,-7.902 0.48,-4.68 -3.12,-8.87 -7.9,-9.22 z"
       id="path95"
       inkscape:connector-curvature="0"
       style="fill:#0cb3cc" /><path
       d="m 286.02,222.47 c 0.362,-7.663 4.433,34.227 8.62,44.758 2.513,6.459 11.007,15.562 11.007,15.678 l 15.678,16.279 c 0,0 12.451,12.92 8.862,19.984 -3.477,6.943 -7.182,6.223 -11.971,4.549 -3.954,-1.434 -5.149,-3.828 -16.876,-16.754 -12.567,-13.76 -17.355,-45.602 -17.355,-45.602 l 2.04,-38.9 z"
       id="path97"
       inkscape:connector-curvature="0"
       style="fill:#696917" /><path
       d="m 389.42,228.69 c 0,0 1.794,34.715 -4.906,44.406 -6.588,9.695 -11.133,24.652 -11.372,28.361 -0.12,3.715 -0.359,11.25 6.588,10.648 6.935,-0.592 10.645,-16.393 11.843,-20.463 0,0 4.31,-25.016 3.35,-29.199 1.32,-6.83 -5.5,-33.76 -5.5,-33.76 z"
       id="path99"
       inkscape:connector-curvature="0"
       style="fill:#696917" /><path
       d="M 286.02,272.25 C 250.838,159.39 308.403,136.89 308.403,136.89 l 4.189,23.336 c 0,0 -33.03,46.44 -26.57,112.02 z"
       id="path101"
       inkscape:connector-curvature="0"
       style="fill:#999833" /><path
       d="m 395.04,260.52 c 0,0 2.514,-56.483 -20.466,-78.144 -38.774,-42.611 -66.419,-45.48 -66.419,-45.48 l 4.07,23.217 c 0.01,-0.01 80.19,39.37 82.82,100.4 z"
       id="path103"
       inkscape:connector-curvature="0"
       style="fill:#999833" /><path
       d="m 297.15,87.467 c -0.481,1.318 -0.836,2.754 -0.962,4.31 -0.714,8.618 5.75,16.276 14.479,16.876 8.628,0.718 16.163,-5.745 16.881,-14.363 0.239,-2.993 -0.358,-5.746 -1.561,-8.259 -4.18,-0.357 -8.374,-0.357 -12.56,-0.12 -6.83,0.483 -12.09,0.959 -16.28,1.559 z"
       id="path105"
       inkscape:connector-curvature="0"
       style="fill:#00ff0d" /><path
       d="m 306.36,86.391 c -1.678,1.434 -2.87,3.591 -3.114,5.986 -0.355,4.665 3.233,8.854 7.9,9.212 4.789,0.36 8.976,-3.111 9.337,-7.897 0.236,-3.234 -1.437,-6.226 -3.954,-7.9 -1.068,0 -2.147,0 -3.106,0.119 -2.64,0.119 -4.91,0.358 -7.07,0.479 z"
       id="path107"
       inkscape:connector-curvature="0"
       style="fill:#0cb3cc" /></g></svg>